FailedOk

th/SRPMS[OK]
th/x32[OK]
th/i686[OK]
th/x86_64[OK]

ac/SRPMS[OK]
ac/i386[OK]
ac/i586[OK]
ac/i686[OK]
ac/alpha[OK]
ac/amd64[OK]
ac/athlon[OK]
ac/ppc[OK]
ac/sparc[OK]
ac/sparc64[OK]

Advanced Search
main()
Powered by PLD Linux
(c) 2002-2018 PLD Team
$Revision: 1.37 $
Powered by BOFH.
Your IP: 54.162.253.34

gpgme 13c7ce25-9ec6-4c5d-9ee3-ab2a6cc18b3d

Status:Failed
Source URL:ftp://buildlogs.pld-linux.org/th/i686/FAIL/gpgme,13c7ce25-9ec6-4c5d-9ee3-ab2a6cc18b3d.bz2
text/plain URL:View!
full text:View!
rpm -qa of builder:View!
Date:2018/05/15 21:08:35
Runtime:0:01:04.703799

Toc:

  • error 1
  • make[4]: *** [Makefile:631: pubring-stamp] Error 2
  • error 2
  • make[3]: *** [Makefile:472: all-recursive] Error 1
  • error 3
  • make[2]: *** [Makefile:456: all-recursive] Error 1
  • error 4
  • make[1]: *** [Makefile:531: all-recursive] Error 1
  • error 5
  • error: Bad exit status from /tmp/B.92Lbw9/BUILD/tmp/rpm-tmp.38888 (%build)
  • error 6
  • RPM build errors:
  • error 7
  • error: No files produced.

Content:

make[4]: Entering directory '/tmp/B.92Lbw9/BUILD/gpgme-1.11.1/lang/python/tests'
echo no-force-v3-sigs > ./gpg.conf
echo ignore-invalid-option agent-program >> ./gpg.conf
echo "agent-program `which gpg-agent`|--debug-quick-random" >> ./gpg.conf
which: no gpg-agent in (/home/users/builder/GNUstep/Tools:/usr/local/bin:/usr/bin:/bin:/home/users/builder/bin)
make[4]: Leaving directory '/tmp/B.92Lbw9/BUILD/gpgme-1.11.1/lang/python/tests'
make[4]: Entering directory '/tmp/B.92Lbw9/BUILD/gpgme-1.11.1/lang/python/tests'
GNUPGHOME=/tmp/B.92Lbw9/BUILD/gpgme-1.11.1/lang/python/tests LC_ALL=C GPG_AGENT_INFO= top_srcdir=../../.. srcdir=. LD_LIBRARY_PATH="../../../src/.libs:/home/users/builder/GNUstep/Library/Libraries:/usr/local/lib:/usr/lib" gpgconf --kill all
/bin/mkdir -p ./private-keys-v1.d
for k in ../../../tests/gpg/13CD0F3BDF24BE53FE192D62F18737256FF6E4FD ../../../tests/gpg/76F7E2B35832976B50A27A282D9B87E44577EB66 ../../../tests/gpg/A0747D5F9425E6664F4FFBEED20FBCA79FDED2BD ../../../tests/gpg/13CBE3758AFE42B5E5E2AE4CED27AFA455E3F87F ../../../tests/gpg/7A030357C0F253A5BBCD282FFC4E521B37558F5C; do \
          cp $k private-keys-v1.d/${k#../../../tests/gpg/}.key; \
        done
echo x > ./gpg-sample.stamp
make[4]: Leaving directory '/tmp/B.92Lbw9/BUILD/gpgme-1.11.1/lang/python/tests'
make[4]: Entering directory '/tmp/B.92Lbw9/BUILD/gpgme-1.11.1/lang/python/tests'
GNUPGHOME=/tmp/B.92Lbw9/BUILD/gpgme-1.11.1/lang/python/tests LC_ALL=C GPG_AGENT_INFO= top_srcdir=../../.. srcdir=. LD_LIBRARY_PATH="../../../src/.libs:/home/users/builder/GNUstep/Library/Libraries:/usr/local/lib:/usr/lib" gpg --batch --no-permission-warning \
               --import ../../../tests/gpg/pubdemo.asc
gpg: keybox '/tmp/B.92Lbw9/BUILD/gpgme-1.11.1/lang/python/tests/pubring.kbx' created
gpg: /tmp/B.92Lbw9/BUILD/gpgme-1.11.1/lang/python/tests/trustdb.gpg: trustdb created
gpg: key 2D727CC768697734: public key "Alfa Test (demo key) <alfa@example.net>" imported
gpg: failed to start agent '|--debug-quick-random': No such file or directory
gpg: can't connect to the agent: No such file or directory
gpg: key FE180B1DA9E3B0B2: public key "Bob (demo key)" imported
gpg: failed to start agent '|--debug-quick-random': No such file or directory
gpg: can't connect to the agent: No such file or directory
gpg: key 413F4AF31AFDAB6C: public key "Charlie Test (demo key) <charlie@example.net>" imported
gpg: failed to start agent '|--debug-quick-random': No such file or directory
gpg: can't connect to the agent: No such file or directory
gpg: key EBA9F240EB9DC9E6: public key "Delta Test (demo key) <delta@example.net>" imported
gpg: failed to start agent '|--debug-quick-random': No such file or directory
gpg: can't connect to the agent: No such file or directory
gpg: key 318C1FAEFAEF6D1B: public key "Echelon (demo key)" imported
gpg: failed to start agent '|--debug-quick-random': No such file or directory
gpg: can't connect to the agent: No such file or directory
gpg: key D4BF57F37372E243: public key "Foxtrot Test (demo key) <foxtrot@example.net>" imported
gpg: failed to start agent '|--debug-quick-random': No such file or directory
gpg: can't connect to the agent: No such file or directory
gpg: key 168410A48FC282E6: public key "Golf Test (demo key) <golf@example.net>" imported
gpg: failed to start agent '|--debug-quick-random': No such file or directory
gpg: can't connect to the agent: No such file or directory
gpg: key 13DB965534C6E3F1: public key "Hotel Test (demo key) <hotel@example.net>" imported
gpg: failed to start agent '|--debug-quick-random': No such file or directory
gpg: can't connect to the agent: No such file or directory
gpg: key 1FE8FC6F04259677: public key "India Test (demo key) <india@example.net>" imported
gpg: failed to start agent '|--debug-quick-random': No such file or directory
gpg: can't connect to the agent: No such file or directory
gpg: key 0C820C71D2699313: public key "Juliet Test (demo key) <juliet@example.net>" imported
gpg: failed to start agent '|--debug-quick-random': No such file or directory
gpg: can't connect to the agent: No such file or directory
gpg: key AD1B0FAD43C2D0C7: public key "Kilo Test (demo key) <kilo@example.net>" imported
gpg: failed to start agent '|--debug-quick-random': No such file or directory
gpg: can't connect to the agent: No such file or directory
gpg: key 37CAB51FB79103F8: public key "Lima Test (demo key) <lima@example.net>" imported
gpg: failed to start agent '|--debug-quick-random': No such file or directory
gpg: can't connect to the agent: No such file or directory
gpg: key BE794852BE5CF886: public key "Mallory (demo key)" imported
gpg: failed to start agent '|--debug-quick-random': No such file or directory
gpg: can't connect to the agent: No such file or directory
gpg: key 25B00FD430CEC684: public key "November Test (demo key) <november@example.net>" imported
gpg: failed to start agent '|--debug-quick-random': No such file or directory
gpg: can't connect to the agent: No such file or directory
gpg: key 5F6356BA6D9732AC: public key "Oscar Test (demo key) <oscar@example.net>" imported
gpg: failed to start agent '|--debug-quick-random': No such file or directory
gpg: can't connect to the agent: No such file or directory
gpg: key 5D15E01D3FF13206: public key "Papa test (demo key) <papa@example.net>" imported
gpg: failed to start agent '|--debug-quick-random': No such file or directory
gpg: can't connect to the agent: No such file or directory
gpg: key 1C67EC133C661C84: public key "Quebec Test (demo key) <quebec@example.net>" imported
gpg: failed to start agent '|--debug-quick-random': No such file or directory
gpg: can't connect to the agent: No such file or directory
gpg: key 3BDBEDB1777FBED3: public key "Romeo Test (demo key) <romeo@example.net>" imported
gpg: failed to start agent '|--debug-quick-random': No such file or directory
gpg: can't connect to the agent: No such file or directory
gpg: key A5E67F7FA3AE3EA1: public key "Sierra Test (demo key) <sierra@example.net>" imported
gpg: failed to start agent '|--debug-quick-random': No such file or directory
gpg: can't connect to the agent: No such file or directory
gpg: key 58CB9A4C85A81F38: public key "Tango Test (demo key) <tango@example.net>" imported
gpg: failed to start agent '|--debug-quick-random': No such file or directory
gpg: can't connect to the agent: No such file or directory
gpg: key A94C0F75653244D6: public key "Uniform Test (demo key) <uniform@example.net>" imported
gpg: failed to start agent '|--debug-quick-random': No such file or directory
gpg: can't connect to the agent: No such file or directory
gpg: key 47AF4B6961F04784: public key "Victor Test (demo key) <victor@example.org>" imported
gpg: failed to start agent '|--debug-quick-random': No such file or directory
gpg: can't connect to the agent: No such file or directory
gpg: key DEF0F7B8EC67DBDE: public key "Whisky Test (demo key) <whisky@example.net>" imported
gpg: failed to start agent '|--debug-quick-random': No such file or directory
gpg: can't connect to the agent: No such file or directory
gpg: key 8979A6C5567FB34A: public key "XRay Test (demo key) <xray@example.net>" imported
gpg: failed to start agent '|--debug-quick-random': No such file or directory
gpg: can't connect to the agent: No such file or directory
gpg: key 9EEF34CD4B11B25F: public key "Yankee Test (demo key) <yankee@example.net>" imported
gpg: failed to start agent '|--debug-quick-random': No such file or directory
gpg: can't connect to the agent: No such file or directory
gpg: key 6BC4778054ACD246: public key "Zulu Test (demo key) <zulu@example.net>" imported
gpg: failed to start agent '|--debug-quick-random': No such file or directory
gpg: can't connect to the agent: No such file or directory
gpg: Total number processed: 26
gpg:               imported: 26
make[4]: *** [Makefile:631: pubring-stamp] Error 2
make[4]: Leaving directory '/tmp/B.92Lbw9/BUILD/gpgme-1.11.1/lang/python/tests'
make[3]: *** [Makefile:472: all-recursive] Error 1
make[2]: *** [Makefile:456: all-recursive] Error 1
make[1]: *** [Makefile:531: all-recursive] Error 1
make: *** [Makefile:463: all] Error 2
error: Bad exit status from /tmp/B.92Lbw9/BUILD/tmp/rpm-tmp.38888 (%build)


RPM build errors:
    Bad exit status from /tmp/B.92Lbw9/BUILD/tmp/rpm-tmp.38888 (%build)
ended at: Tue May 15 21:08:35 2018, done in 0:01:04.703799
error: No files produced.
+ chmod -R u+rwX /tmp/B.92Lbw9/BUILD
+ rm -rf /tmp/B.92Lbw9/tmp /tmp/B.92Lbw9/BUILD
+ rm -rf /tmp/B.92Lbw9
Begin-PLD-Builder-Info
Build-Time: user:125.60s sys:8.11s real:69.18s (faults io:0 non-io:3119115)

End-PLD-Builder-Info
[Back to list of logs] [View rpm -qa of builder]