Advanced Search
Powered by PLD Linux
(c) 2002-2019 PLD Team
$Revision: 1.37 $
Powered by ufo.
Your IP:

hfst 3ea4702e-611a-408b-aa5f-785874f4bbd4

Source URL:,3ea4702e-611a-408b-aa5f-785874f4bbd4.bz2
text/plain URL:View!
full text:View!
rpm -qa of builder:View!
Date:2018/07/05 09:22:04


  • error 1
  • ./../include/fst/replace.h:1061:46: error: expected ';' before '::' token
  • error 2
  • make[5]: *** [Makefile:426: fst.lo] Error 1
  • error 3
  • make[4]: *** [Makefile:380: all-recursive] Error 1
  • error 4
  • make[3]: *** [Makefile:390: all-recursive] Error 1
  • error 5
  • make[2]: *** [Makefile:385: all-recursive] Error 1
  • error 6
  • make[1]: *** [Makefile:488: all-recursive] Error 1
  • error 7
  • error: Bad exit status from /tmp/B.dm3_Xg/BUILD/tmp/rpm-tmp.5205 (%build)
  • error 8
  • RPM build errors:
  • error 9
  • error: No files produced.


config.status: creating back-ends/openfst/src/lib/Makefile
config.status: creating back-ends/foma/Makefile
config.status: creating back-ends/sfst/Makefile
config.status: creating man/Makefile
config.status: creating python/Makefile
config.status: creating python/test/Makefile
config.status: creating scripts/Makefile
config.status: creating scripts/
config.status: creating scripts/hfst-foma
config.status: creating config.h
config.status: creating libhfst/src/hfst.hpp
config.status: executing depfiles commands
config.status: executing libtool commands
-- Building hfst 3.11.0:
    * libhfst with sfst: yes
    *         with openfst: yes
    *         with openfst log weights: yes
    *         with foma: yes
    *         with optimized lookup: bundled
    * tools including affix-guessify: yes
    *                 calculate: yes (sfstpl2fst)
    *                 compare: yes
    *                 compose: yes
    *                 concatenate: yes
    *                 conjunct: yes (intersect)
    *                 determinize: yes (determinise)
    *                 disjunct: yes (union)
    *                 foma: yes
    *                 format: yes
    *                 fst2fst: yes
    *                 fst2strings: yes (expand)
    *                 fst2txt: yes
    *                 grep: yes
    *                 guessify: yes
    *                 guess: yes
    *                 head: yes
    *                 invert: yes
    *                 lexc: yes
    *                 lexc-wrapper: yes
    *                 lookup: yes
    *                 minimize: yes (minimise)
    *                 name: yes
    *                 optimized-lookup: yes
    *                 pmatch: yes
    *                 tokenize: yes
    *                 proc: yes
    *                 project: yes
    *                 prune-alphabet: yes
    *                 push-weights: yes
    *                 regexp2fst: yes
    *                 pmatch2fst: yes
    *                 remove-epsilons: yes
    *                 repeat: yes
    *                 reverse: yes
    *                 shuffle: no
    *                 split: yes
    *                 strings2fst: yes
    *                 substitute: yes
    *                 subtract: yes (minus)
    *                 summarize: yes (summarise)
    *                 tail: yes
    *                 test: yes
    *                 twolc: yes
    *                 tagger: yes
    *                 txt2fst: yes
    *                 xfst: yes
    * unicode parsed in corpus tools with: glib
configure: WARNING: Python bindings for HFST are not under autotools; see python/README for instructions about how to build and install them
+ /usr/bin/make -Otarget -j9 -j1
/usr/bin/make  all-recursive
make[1]: Entering directory '/tmp/B.dm3_Xg/BUILD/hfst-3.11.0'
Making all in back-ends
make[2]: Entering directory '/tmp/B.dm3_Xg/BUILD/hfst-3.11.0/back-ends'
Making all in openfst
make[3]: Entering directory '/tmp/B.dm3_Xg/BUILD/hfst-3.11.0/back-ends/openfst'
Making all in src
make[4]: Entering directory '/tmp/B.dm3_Xg/BUILD/hfst-3.11.0/back-ends/openfst/src'
Making all in lib
make[5]: Entering directory '/tmp/B.dm3_Xg/BUILD/hfst-3.11.0/back-ends/openfst/src/lib'
depbase=`echo compat.lo | sed 's|[^/]*$|.deps/&|;s|\.lo$||'`;\
/bin/sh ../../../../libtool  --tag=CXX   --mode=compile i686-pld-linux-g++ -DHAVE_CONFIG_H -I. -I../../../.. -I../../../../libhfst/src  -I ./../include    -O2 -fwrapv -pipe -Wformat -Werror=format-security -gdwarf-4 -fno-debug-types-section -fvar-tracking-assignments -g2 -Wp,-D_FORTIFY_SOURCE=2 -fstack-protector-strong --param=ssp-buffer-size=4 -fomit-frame-pointer -march=i686 -fasynchronous-unwind-tables -mtune=pentium4 -gdwarf-4 -fno-debug-types-section -fvar-tracking-assignments -g2  -std=c++17 -MT compat.lo -MD -MP -MF $depbase.Tpo -c -o compat.lo &&\
mv -f $depbase.Tpo $depbase.Plo
libtool: compile:  i686-pld-linux-g++ -DHAVE_CONFIG_H -I. -I../../../.. -I../../../../libhfst/src -I ./../include -O2 -fwrapv -pipe -Wformat -Werror=format-security -gdwarf-4 -fno-debug-types-section -fvar-tracking-assignments -g2 -Wp,-D_FORTIFY_SOURCE=2 -fstack-protector-strong --param=ssp-buffer-size=4 -fomit-frame-pointer -march=i686 -fasynchronous-unwind-tables -mtune=pentium4 -gdwarf-4 -fno-debug-types-section -fvar-tracking-assignments -g2 -std=c++17 -MT compat.lo -MD -MP -MF .deps/compat.Tpo -c  -fPIC -DPIC -o .libs/compat.o
libtool: compile:  i686-pld-linux-g++ -DHAVE_CONFIG_H -I. -I../../../.. -I../../../../libhfst/src -I ./../include -O2 -fwrapv -pipe -Wformat -Werror=format-security -gdwarf-4 -fno-debug-types-section -fvar-tracking-assignments -g2 -Wp,-D_FORTIFY_SOURCE=2 -fstack-protector-strong --param=ssp-buffer-size=4 -fomit-frame-pointer -march=i686 -fasynchronous-unwind-tables -mtune=pentium4 -gdwarf-4 -fno-debug-types-section -fvar-tracking-assignments -g2 -std=c++17 -MT compat.lo -MD -MP -MF .deps/compat.Tpo -c -o compat.o >/dev/null 2>&1
depbase=`echo flags.lo | sed 's|[^/]*$|.deps/&|;s|\.lo$||'`;\
/bin/sh ../../../../libtool  --tag=CXX   --mode=compile i686-pld-linux-g++ -DHAVE_CONFIG_H -I. -I../../../.. -I../../../../libhfst/src  -I ./../include    -O2 -fwrapv -pipe -Wformat -Werror=format-security -gdwarf-4 -fno-debug-types-section -fvar-tracking-assignments -g2 -Wp,-D_FORTIFY_SOURCE=2 -fstack-protector-strong --param=ssp-buffer-size=4 -fomit-frame-pointer -march=i686 -fasynchronous-unwind-tables -mtune=pentium4 -gdwarf-4 -fno-debug-types-section -fvar-tracking-assignments -g2  -std=c++17 -MT flags.lo -MD -MP -MF $depbase.Tpo -c -o flags.lo &&\
mv -f $depbase.Tpo $depbase.Plo
libtool: compile:  i686-pld-linux-g++ -DHAVE_CONFIG_H -I. -I../../../.. -I../../../../libhfst/src -I ./../include -O2 -fwrapv -pipe -Wformat -Werror=format-security -gdwarf-4 -fno-debug-types-section -fvar-tracking-assignments -g2 -Wp,-D_FORTIFY_SOURCE=2 -fstack-protector-strong --param=ssp-buffer-size=4 -fomit-frame-pointer -march=i686 -fasynchronous-unwind-tables -mtune=pentium4 -gdwarf-4 -fno-debug-types-section -fvar-tracking-assignments -g2 -std=c++17 -MT flags.lo -MD -MP -MF .deps/flags.Tpo -c  -fPIC -DPIC -o .libs/flags.o
libtool: compile:  i686-pld-linux-g++ -DHAVE_CONFIG_H -I. -I../../../.. -I../../../../libhfst/src -I ./../include -O2 -fwrapv -pipe -Wformat -Werror=format-security -gdwarf-4 -fno-debug-types-section -fvar-tracking-assignments -g2 -Wp,-D_FORTIFY_SOURCE=2 -fstack-protector-strong --param=ssp-buffer-size=4 -fomit-frame-pointer -march=i686 -fasynchronous-unwind-tables -mtune=pentium4 -gdwarf-4 -fno-debug-types-section -fvar-tracking-assignments -g2 -std=c++17 -MT flags.lo -MD -MP -MF .deps/flags.Tpo -c -o flags.o >/dev/null 2>&1
depbase=`echo fst.lo | sed 's|[^/]*$|.deps/&|;s|\.lo$||'`;\
/bin/sh ../../../../libtool  --tag=CXX   --mode=compile i686-pld-linux-g++ -DHAVE_CONFIG_H -I. -I../../../.. -I../../../../libhfst/src  -I ./../include    -O2 -fwrapv -pipe -Wformat -Werror=format-security -gdwarf-4 -fno-debug-types-section -fvar-tracking-assignments -g2 -Wp,-D_FORTIFY_SOURCE=2 -fstack-protector-strong --param=ssp-buffer-size=4 -fomit-frame-pointer -march=i686 -fasynchronous-unwind-tables -mtune=pentium4 -gdwarf-4 -fno-debug-types-section -fvar-tracking-assignments -g2  -std=c++17 -MT fst.lo -MD -MP -MF $depbase.Tpo -c -o fst.lo &&\
mv -f $depbase.Tpo $depbase.Plo
libtool: compile:  i686-pld-linux-g++ -DHAVE_CONFIG_H -I. -I../../../.. -I../../../../libhfst/src -I ./../include -O2 -fwrapv -pipe -Wformat -Werror=format-security -gdwarf-4 -fno-debug-types-section -fvar-tracking-assignments -g2 -Wp,-D_FORTIFY_SOURCE=2 -fstack-protector-strong --param=ssp-buffer-size=4 -fomit-frame-pointer -march=i686 -fasynchronous-unwind-tables -mtune=pentium4 -gdwarf-4 -fno-debug-types-section -fvar-tracking-assignments -g2 -std=c++17 -MT fst.lo -MD -MP -MF .deps/fst.Tpo -c  -fPIC -DPIC -o .libs/fst.o
In file included from ./../include/fst/accumulator.h:44:0,
                 from ./../include/fst/label-reachable.h:39,
                 from ./../include/fst/lookahead-matcher.h:28,
                 from ./../include/fst/matcher-fst.h:26,
./../include/fst/replace.h: In constructor 'fst::ArcIterator<fst::ReplaceFst<A, T> >::ArcIterator(const fst::ReplaceFst<A, T>&, fst::ArcIterator<fst::ReplaceFst<A, T> >::StateId)':
./../include/fst/replace.h:1061:46: error: expected ';' before '::' token
       (fst_.GetImpl())->template CacheImpl<A>::InitArcIterator(state_,
make[5]: *** [Makefile:426: fst.lo] Error 1
make[5]: Leaving directory '/tmp/B.dm3_Xg/BUILD/hfst-3.11.0/back-ends/openfst/src/lib'
make[4]: *** [Makefile:380: all-recursive] Error 1
make[4]: Leaving directory '/tmp/B.dm3_Xg/BUILD/hfst-3.11.0/back-ends/openfst/src'
make[3]: *** [Makefile:390: all-recursive] Error 1
make[3]: Leaving directory '/tmp/B.dm3_Xg/BUILD/hfst-3.11.0/back-ends/openfst'
make[2]: *** [Makefile:385: all-recursive] Error 1
make[2]: Leaving directory '/tmp/B.dm3_Xg/BUILD/hfst-3.11.0/back-ends'
make[1]: *** [Makefile:488: all-recursive] Error 1
make[1]: Leaving directory '/tmp/B.dm3_Xg/BUILD/hfst-3.11.0'
make: *** [Makefile:399: all] Error 2
error: Bad exit status from /tmp/B.dm3_Xg/BUILD/tmp/rpm-tmp.5205 (%build)

RPM build errors:
    Bad exit status from /tmp/B.dm3_Xg/BUILD/tmp/rpm-tmp.5205 (%build)
ended at: Thu Jul  5 09:22:04 2018, done in 0:00:29.282706
error: No files produced.
+ chmod -R u+rwX /tmp/B.dm3_Xg/BUILD
+ rm -rf /tmp/B.dm3_Xg/tmp /tmp/B.dm3_Xg/BUILD
+ rm -rf /tmp/B.dm3_Xg
Build-Time: user:24.67s sys:2.49s real:33.15s (faults io:0 non-io:1264049)

[Back to list of logs] [View rpm -qa of builder]