FailedOk

th/SRPMS[OK]
th/x32[OK]
th/i686[OK]
th/x86_64[OK]

ac/SRPMS[OK]
ac/i386[OK]
ac/i586[OK]
ac/i686[OK]
ac/alpha[OK]
ac/amd64[OK]
ac/athlon[OK]
ac/ppc[OK]
ac/sparc[OK]
ac/sparc64[OK]

Advanced Search
main()
Powered by PLD Linux
(c) 2002-2018 PLD Team
$Revision: 1.37 $
Powered by Unix conspiracy.
Your IP: 54.224.85.115

hivex 1b2b9f9f-60bd-4aef-a444-13e508002fae

Status:Failed
Source URL:ftp://buildlogs.pld-linux.org/th/i686/FAIL/hivex,1b2b9f9f-60bd-4aef-a444-13e508002fae.bz2
text/plain URL:View!
full text:View!
rpm -qa of builder:View!
Date:2018/06/05 08:47:56
Runtime:0:01:00.497763

Toc:

  • error 1
  • make[2]: [Makefile:1635: Makefile-pl] Error 1 (ignored)
  • error 2
  • make[2]: *** [Makefile:1634: all] Error 127
  • error 3
  • make[1]: *** [Makefile:1275: all-recursive] Error 1
  • error 4
  • error: Bad exit status from /tmp/B.upcGDY/BUILD/tmp/rpm-tmp.58159 (%build)
  • error 5
  • RPM build errors:
  • error 6
  • error: No files produced.

Content:

ocamlmklib -o mlhivex hivex_c.o hivex.cmo -L../lib/.libs -lhivex
make[2]: Leaving directory '/tmp/B.upcGDY/BUILD/hivex-1.3.14/ocaml'
make[2]: Entering directory '/tmp/B.upcGDY/BUILD/hivex-1.3.14/ocaml'
ocamlfind ocamlopt -package unix -c hivex.ml -o hivex.cmx
make[2]: Leaving directory '/tmp/B.upcGDY/BUILD/hivex-1.3.14/ocaml'
make[2]: Entering directory '/tmp/B.upcGDY/BUILD/hivex-1.3.14/ocaml'
ocamlmklib -o mlhivex hivex_c.o hivex.cmx -L../lib/.libs -lhivex
make[2]: Leaving directory '/tmp/B.upcGDY/BUILD/hivex-1.3.14/ocaml'
make[2]: Entering directory '/tmp/B.upcGDY/BUILD/hivex-1.3.14/ocaml'
mkdir -p `dirname t/hivex_005_load.cmo`
ocamlfind ocamlc -package unix -c t/hivex_005_load.ml -o t/hivex_005_load.cmo
make[2]: Leaving directory '/tmp/B.upcGDY/BUILD/hivex-1.3.14/ocaml'
make[2]: Entering directory '/tmp/B.upcGDY/BUILD/hivex-1.3.14/ocaml'
/bin/sh ../libtool --mode=execute -dlopen ../lib/libhivex.la \
  ocamlfind ocamlc -dllpath /tmp/B.upcGDY/BUILD/hivex-1.3.14/ocaml -package unix \
  -linkpkg mlhivex.cma t/hivex_005_load.cmo -o t/hivex_005_load
make[2]: Leaving directory '/tmp/B.upcGDY/BUILD/hivex-1.3.14/ocaml'
make[2]: Entering directory '/tmp/B.upcGDY/BUILD/hivex-1.3.14/ocaml'
mkdir -p `dirname t/hivex_010_open.cmo`
ocamlfind ocamlc -package unix -c t/hivex_010_open.ml -o t/hivex_010_open.cmo
make[2]: Leaving directory '/tmp/B.upcGDY/BUILD/hivex-1.3.14/ocaml'
make[2]: Entering directory '/tmp/B.upcGDY/BUILD/hivex-1.3.14/ocaml'
/bin/sh ../libtool --mode=execute -dlopen ../lib/libhivex.la \
  ocamlfind ocamlc -dllpath /tmp/B.upcGDY/BUILD/hivex-1.3.14/ocaml -package unix \
  -linkpkg mlhivex.cma t/hivex_010_open.cmo -o t/hivex_010_open
make[2]: Leaving directory '/tmp/B.upcGDY/BUILD/hivex-1.3.14/ocaml'
make[2]: Entering directory '/tmp/B.upcGDY/BUILD/hivex-1.3.14/ocaml'
mkdir -p `dirname t/hivex_020_root.cmo`
ocamlfind ocamlc -package unix -c t/hivex_020_root.ml -o t/hivex_020_root.cmo
make[2]: Leaving directory '/tmp/B.upcGDY/BUILD/hivex-1.3.14/ocaml'
make[2]: Entering directory '/tmp/B.upcGDY/BUILD/hivex-1.3.14/ocaml'
/bin/sh ../libtool --mode=execute -dlopen ../lib/libhivex.la \
  ocamlfind ocamlc -dllpath /tmp/B.upcGDY/BUILD/hivex-1.3.14/ocaml -package unix \
  -linkpkg mlhivex.cma t/hivex_020_root.cmo -o t/hivex_020_root
make[2]: Leaving directory '/tmp/B.upcGDY/BUILD/hivex-1.3.14/ocaml'
make[2]: Entering directory '/tmp/B.upcGDY/BUILD/hivex-1.3.14/ocaml'
mkdir -p `dirname t/hivex_100_errors.cmo`
ocamlfind ocamlc -package unix -c t/hivex_100_errors.ml -o t/hivex_100_errors.cmo
make[2]: Leaving directory '/tmp/B.upcGDY/BUILD/hivex-1.3.14/ocaml'
make[2]: Entering directory '/tmp/B.upcGDY/BUILD/hivex-1.3.14/ocaml'
/bin/sh ../libtool --mode=execute -dlopen ../lib/libhivex.la \
  ocamlfind ocamlc -dllpath /tmp/B.upcGDY/BUILD/hivex-1.3.14/ocaml -package unix \
  -linkpkg mlhivex.cma t/hivex_100_errors.cmo -o t/hivex_100_errors
make[2]: Leaving directory '/tmp/B.upcGDY/BUILD/hivex-1.3.14/ocaml'
make[2]: Entering directory '/tmp/B.upcGDY/BUILD/hivex-1.3.14/ocaml'
mkdir -p `dirname t/hivex_110_gc_handle.cmo`
ocamlfind ocamlc -package unix -c t/hivex_110_gc_handle.ml -o t/hivex_110_gc_handle.cmo
make[2]: Leaving directory '/tmp/B.upcGDY/BUILD/hivex-1.3.14/ocaml'
make[2]: Entering directory '/tmp/B.upcGDY/BUILD/hivex-1.3.14/ocaml'
/bin/sh ../libtool --mode=execute -dlopen ../lib/libhivex.la \
  ocamlfind ocamlc -dllpath /tmp/B.upcGDY/BUILD/hivex-1.3.14/ocaml -package unix \
  -linkpkg mlhivex.cma t/hivex_110_gc_handle.cmo -o t/hivex_110_gc_handle
make[2]: Leaving directory '/tmp/B.upcGDY/BUILD/hivex-1.3.14/ocaml'
make[2]: Entering directory '/tmp/B.upcGDY/BUILD/hivex-1.3.14/ocaml'
mkdir -p `dirname t/hivex_120_rlenvalue.cmo`
ocamlfind ocamlc -package unix -c t/hivex_120_rlenvalue.ml -o t/hivex_120_rlenvalue.cmo
make[2]: Leaving directory '/tmp/B.upcGDY/BUILD/hivex-1.3.14/ocaml'
make[2]: Entering directory '/tmp/B.upcGDY/BUILD/hivex-1.3.14/ocaml'
/bin/sh ../libtool --mode=execute -dlopen ../lib/libhivex.la \
  ocamlfind ocamlc -dllpath /tmp/B.upcGDY/BUILD/hivex-1.3.14/ocaml -package unix \
  -linkpkg mlhivex.cma t/hivex_120_rlenvalue.cmo -o t/hivex_120_rlenvalue
make[2]: Leaving directory '/tmp/B.upcGDY/BUILD/hivex-1.3.14/ocaml'
make[2]: Entering directory '/tmp/B.upcGDY/BUILD/hivex-1.3.14/ocaml'
mkdir -p `dirname t/hivex_200_write.cmo`
ocamlfind ocamlc -package unix -c t/hivex_200_write.ml -o t/hivex_200_write.cmo
File "t/hivex_200_write.ml", line 58, characters 15-28:
Warning 3: deprecated: String.create
Use Bytes.create instead.
File "t/hivex_200_write.ml", line 60, characters 6-27:
Warning 3: deprecated: String.set
Use Bytes.set instead.
File "t/hivex_200_write.ml", line 61, characters 6-28:
Warning 3: deprecated: String.set
Use Bytes.set instead.
File "t/hivex_200_write.ml", line 63, characters 4-27:
Warning 3: deprecated: String.set
Use Bytes.set instead.
File "t/hivex_200_write.ml", line 64, characters 4-27:
Warning 3: deprecated: String.set
Use Bytes.set instead.
make[2]: Leaving directory '/tmp/B.upcGDY/BUILD/hivex-1.3.14/ocaml'
make[2]: Entering directory '/tmp/B.upcGDY/BUILD/hivex-1.3.14/ocaml'
/bin/sh ../libtool --mode=execute -dlopen ../lib/libhivex.la \
  ocamlfind ocamlc -dllpath /tmp/B.upcGDY/BUILD/hivex-1.3.14/ocaml -package unix \
  -linkpkg mlhivex.cma t/hivex_200_write.cmo -o t/hivex_200_write
make[2]: Leaving directory '/tmp/B.upcGDY/BUILD/hivex-1.3.14/ocaml'
make[2]: Entering directory '/tmp/B.upcGDY/BUILD/hivex-1.3.14/ocaml'
mkdir -p `dirname t/hivex_300_fold.cmo`
ocamlfind ocamlc -package unix -c t/hivex_300_fold.ml -o t/hivex_300_fold.cmo
make[2]: Leaving directory '/tmp/B.upcGDY/BUILD/hivex-1.3.14/ocaml'
make[2]: Entering directory '/tmp/B.upcGDY/BUILD/hivex-1.3.14/ocaml'
/bin/sh ../libtool --mode=execute -dlopen ../lib/libhivex.la \
  ocamlfind ocamlc -dllpath /tmp/B.upcGDY/BUILD/hivex-1.3.14/ocaml -package unix \
  -linkpkg mlhivex.cma t/hivex_300_fold.cmo -o t/hivex_300_fold
make[2]: Leaving directory '/tmp/B.upcGDY/BUILD/hivex-1.3.14/ocaml'
rm t/hivex_005_load.cmo t/hivex_100_errors.cmo t/hivex_300_fold.cmo t/hivex_020_root.cmo t/hivex_120_rlenvalue.cmo t/hivex_010_open.cmo t/hivex_200_write.cmo t/hivex_110_gc_handle.cmo
Making all in perl
make[2]: Entering directory '/tmp/B.upcGDY/BUILD/hivex-1.3.14/perl'
[ . != . ] && cp -rsu /tmp/B.upcGDY/BUILD/hivex-1.3.14/perl/. ./.
make[2]: [Makefile:1635: Makefile-pl] Error 1 (ignored)
perl Makefile.PL INSTALLDIRS=vendor PREFIX=/usr
Warning: -L../lib/.libs changed to -L/tmp/B.upcGDY/BUILD/hivex-1.3.14/perl/../lib/.libs
Generating a Unix-style Makefile-pl
Writing Makefile-pl for Win::Hivex
Writing MYMETA.yml and MYMETA.json
make[2]: Leaving directory '/tmp/B.upcGDY/BUILD/hivex-1.3.14/perl'
/usr/bin/make -f Makefile-pl
make[3]: Entering directory '/tmp/B.upcGDY/BUILD/hivex-1.3.14/perl'
Running Mkbootstrap for Hivex ()
chmod 644 "Hivex.bs"
make[3]: Leaving directory '/tmp/B.upcGDY/BUILD/hivex-1.3.14/perl'
make[3]: Entering directory '/tmp/B.upcGDY/BUILD/hivex-1.3.14/perl'
"/usr/bin/perl5.26.2" -MExtUtils::Command::MM -e 'cp_nonempty' -- Hivex.bs blib/arch/auto/Win/Hivex/Hivex.bs 644
make[3]: Leaving directory '/tmp/B.upcGDY/BUILD/hivex-1.3.14/perl'
make[3]: Entering directory '/tmp/B.upcGDY/BUILD/hivex-1.3.14/perl'
cp lib/Win/Hivex/Regedit.pm blib/lib/Win/Hivex/Regedit.pm
cp lib/Win/Hivex.pm blib/lib/Win/Hivex.pm
make[3]: Leaving directory '/tmp/B.upcGDY/BUILD/hivex-1.3.14/perl'
make[3]: Entering directory '/tmp/B.upcGDY/BUILD/hivex-1.3.14/perl'
"/usr/bin/perl5.26.2" "/usr/share/perl5/5.26.2/ExtUtils/xsubpp"  -typemap '/usr/share/perl5/5.26.2/ExtUtils/typemap' -typemap '/tmp/B.upcGDY/BUILD/hivex-1.3.14/perl/typemap' -typemap '/tmp/B.upcGDY/BUILD/hivex-1.3.14/perl/typemap'  Hivex.xs > Hivex.xsc
mv Hivex.xsc Hivex.c
make[3]: Leaving directory '/tmp/B.upcGDY/BUILD/hivex-1.3.14/perl'
make[3]: Entering directory '/tmp/B.upcGDY/BUILD/hivex-1.3.14/perl'
i686-pld-linux-gcc -c  -I../lib -I../lib -D_REENTRANT -D_GNU_SOURCE -fwrapv -fno-strict-aliasing -pipe -fstack-protector-strong -I/usr/local/include -D_LARGEFILE_SOURCE -D_FILE_OFFSET_BITS=64 -O2 -fwrapv -pipe -Wformat -Werror=format-security -gdwarf-4 -fno-debug-types-section -fvar-tracking-assignments -g2 -Wp,-D_FORTIFY_SOURCE=2 -fstack-protector-strong --param=ssp-buffer-size=4 -fomit-frame-pointer -march=i686 -fasynchronous-unwind-tables -mtune=pentium4 -gdwarf-4 -fno-debug-types-section -fvar-tracking-assignments -g2  -O2 -fwrapv -pipe -Wformat -Werror=format-security -gdwarf-4 -fno-debug-types-section -fvar-tracking-assignments -g2 -Wp,-D_FORTIFY_SOURCE=2 -fstack-protector-strong --param=ssp-buffer-size=4 -fomit-frame-pointer -march=i686 -fasynchronous-unwind-tables -mtune=pentium4 -gdwarf-4 -fno-debug-types-section -fvar-tracking-assignments -g2   -DVERSION=\"1.3.14\" -DXS_VERSION=\"1.3.14\" -fPIC "-I/usr/lib/perl5/5.26.2/i686-pld-linux-thread-multi/CORE"   Hivex.c
Hivex.xs: In function 'XS_Win__Hivex_value_data_cell_offset':
Hivex.xs:485:16: warning: too many arguments for format [-Wformat-extra-args]
         croak ("%s: ", "value_data_cell_offset", strerror (errno));
                ^~~~~~
make[3]: Leaving directory '/tmp/B.upcGDY/BUILD/hivex-1.3.14/perl'
make[3]: Entering directory '/tmp/B.upcGDY/BUILD/hivex-1.3.14/perl'
rm -f blib/arch/auto/Win/Hivex/Hivex.so
LD_RUN_PATH="/tmp/B.upcGDY/BUILD/hivex-1.3.14/perl/../lib/.libs" i686-pld-linux-gcc  -shared   -Wl,--no-copy-dt-needed-entries -Wl,-z,relro -Wl,-z,combreloc  -L/usr/local/lib -fstack-protector-strong Hivex.o  -o blib/arch/auto/Win/Hivex/Hivex.so  \
   -L/tmp/B.upcGDY/BUILD/hivex-1.3.14/perl/../lib/.libs -lhivex   \
  
chmod 755 blib/arch/auto/Win/Hivex/Hivex.so
make[3]: Leaving directory '/tmp/B.upcGDY/BUILD/hivex-1.3.14/perl'
make[3]: Entering directory '/tmp/B.upcGDY/BUILD/hivex-1.3.14/perl'
Manifying 2 pod documents
make[3]: Leaving directory '/tmp/B.upcGDY/BUILD/hivex-1.3.14/perl'
Making all in regedit
make[2]: Entering directory '/tmp/B.upcGDY/BUILD/hivex-1.3.14/regedit'
pod2man \
  --section 1 \
  -c "Windows Registry" \
  --name "hivexregedit" \
  --release "hivex-1.3.14" \
  hivexregedit > hivexregedit.1-t; mv hivexregedit.1-t hivexregedit.1
hivexregedit around line 257: '=item' outside of any '=over'
hivexregedit around line 338: You forgot a '=back' before '=head1'
POD document had syntax errors at /usr/bin/pod2man line 71.
make[2]: Leaving directory '/tmp/B.upcGDY/BUILD/hivex-1.3.14/regedit'
make[2]: Entering directory '/tmp/B.upcGDY/BUILD/hivex-1.3.14/regedit'
mkdir -p ../html
cd .. && pod2html \
  --css 'pod.css' \
  --htmldir html \
  --outfile html/hivexregedit.1.html \
  /tmp/B.upcGDY/BUILD/hivex-1.3.14/regedit/hivexregedit
make[2]: Leaving directory '/tmp/B.upcGDY/BUILD/hivex-1.3.14/regedit'
Making all in python
make[2]: Entering directory '/tmp/B.upcGDY/BUILD/hivex-1.3.14/python'
/bin/sh ../libtool  --tag=CC   --mode=compile i686-pld-linux-gcc -DHAVE_CONFIG_H -I. -I..    -Wall -I/usr/include/python2.7 -I../lib -I../lib -O2 -fwrapv -pipe -Wformat -Werror=format-security -gdwarf-4 -fno-debug-types-section -fvar-tracking-assignments -g2 -Wp,-D_FORTIFY_SOURCE=2 -fstack-protector-strong --param=ssp-buffer-size=4 -fomit-frame-pointer -march=i686 -fasynchronous-unwind-tables -mtune=pentium4 -gdwarf-4 -fno-debug-types-section -fvar-tracking-assignments -g2  -MT libhivexmod_la-hivex-py.lo -MD -MP -MF .deps/libhivexmod_la-hivex-py.Tpo -c -o libhivexmod_la-hivex-py.lo `test -f 'hivex-py.c' || echo './'`hivex-py.c
libtool: compile:  i686-pld-linux-gcc -DHAVE_CONFIG_H -I. -I.. -Wall -I/usr/include/python2.7 -I../lib -I../lib -O2 -fwrapv -pipe -Wformat -Werror=format-security -gdwarf-4 -fno-debug-types-section -fvar-tracking-assignments -g2 -Wp,-D_FORTIFY_SOURCE=2 -fstack-protector-strong --param=ssp-buffer-size=4 -fomit-frame-pointer -march=i686 -fasynchronous-unwind-tables -mtune=pentium4 -gdwarf-4 -fno-debug-types-section -fvar-tracking-assignments -g2 -MT libhivexmod_la-hivex-py.lo -MD -MP -MF .deps/libhivexmod_la-hivex-py.Tpo -c hivex-py.c  -fPIC -DPIC -o .libs/libhivexmod_la-hivex-py.o
libtool: compile:  i686-pld-linux-gcc -DHAVE_CONFIG_H -I. -I.. -Wall -I/usr/include/python2.7 -I../lib -I../lib -O2 -fwrapv -pipe -Wformat -Werror=format-security -gdwarf-4 -fno-debug-types-section -fvar-tracking-assignments -g2 -Wp,-D_FORTIFY_SOURCE=2 -fstack-protector-strong --param=ssp-buffer-size=4 -fomit-frame-pointer -march=i686 -fasynchronous-unwind-tables -mtune=pentium4 -gdwarf-4 -fno-debug-types-section -fvar-tracking-assignments -g2 -MT libhivexmod_la-hivex-py.lo -MD -MP -MF .deps/libhivexmod_la-hivex-py.Tpo -c hivex-py.c -o libhivexmod_la-hivex-py.o >/dev/null 2>&1
mv -f .deps/libhivexmod_la-hivex-py.Tpo .deps/libhivexmod_la-hivex-py.Plo
make[2]: Leaving directory '/tmp/B.upcGDY/BUILD/hivex-1.3.14/python'
make[2]: Entering directory '/tmp/B.upcGDY/BUILD/hivex-1.3.14/python'
/bin/sh ../libtool  --tag=CC   --mode=link i686-pld-linux-gcc -Wall -I/usr/include/python2.7 -I../lib -I../lib -O2 -fwrapv -pipe -Wformat -Werror=format-security -gdwarf-4 -fno-debug-types-section -fvar-tracking-assignments -g2 -Wp,-D_FORTIFY_SOURCE=2 -fstack-protector-strong --param=ssp-buffer-size=4 -fomit-frame-pointer -march=i686 -fasynchronous-unwind-tables -mtune=pentium4 -gdwarf-4 -fno-debug-types-section -fvar-tracking-assignments -g2  -avoid-version -shared -module -shrext .so -Wl,--as-needed -Wl,--no-copy-dt-needed-entries -Wl,-z,relro -Wl,-z,combreloc  -o libhivexmod.la -rpath /usr/lib/python2.7/site-packages libhivexmod_la-hivex-py.lo ../lib/libhivex.la 
libtool: link: i686-pld-linux-gcc -shared  -fPIC -DPIC  .libs/libhivexmod_la-hivex-py.o   -Wl,-rpath -Wl,/tmp/B.upcGDY/BUILD/hivex-1.3.14/lib/.libs ../lib/.libs/libhivex.so  -O2 -gdwarf-4 -g2 -fstack-protector-strong -march=i686 -mtune=pentium4 -gdwarf-4 -g2 -Wl,--as-needed -Wl,--no-copy-dt-needed-entries -Wl,-z -Wl,relro -Wl,-z -Wl,combreloc   -Wl,-soname -Wl,libhivexmod.so -o .libs/libhivexmod.so
libtool: link: ( cd ".libs" && rm -f "libhivexmod.la" && ln -s "../libhivexmod.la" "libhivexmod.la" )
make[2]: Leaving directory '/tmp/B.upcGDY/BUILD/hivex-1.3.14/python'
Making all in ruby
make[2]: Entering directory '/tmp/B.upcGDY/BUILD/hivex-1.3.14/ruby'
no build
make[2]: no: Command not found
make[2]: *** [Makefile:1634: all] Error 127
make[2]: Leaving directory '/tmp/B.upcGDY/BUILD/hivex-1.3.14/ruby'
make[1]: *** [Makefile:1275: all-recursive] Error 1
make: *** [Makefile:1182: all] Error 2
error: Bad exit status from /tmp/B.upcGDY/BUILD/tmp/rpm-tmp.58159 (%build)


RPM build errors:
    Bad exit status from /tmp/B.upcGDY/BUILD/tmp/rpm-tmp.58159 (%build)
ended at: Tue Jun  5 08:47:55 2018, done in 0:01:00.497763
error: No files produced.
+ chmod -R u+rwX /tmp/B.upcGDY/BUILD
+ rm -rf /tmp/B.upcGDY/tmp /tmp/B.upcGDY/BUILD
+ rm -rf /tmp/B.upcGDY
Begin-PLD-Builder-Info
Build-Time: user:50.84s sys:8.82s real:64.67s (faults io:0 non-io:4703074)

End-PLD-Builder-Info
[Back to list of logs] [View rpm -qa of builder]