FailedOk

th/SRPMS[OK]
th/x32[OK]
th/i686[OK]
th/x86_64[OK]

ac/SRPMS[OK]
ac/i386[OK]
ac/i586[OK]
ac/i686[OK]
ac/alpha[OK]
ac/amd64[OK]
ac/athlon[OK]
ac/ppc[OK]
ac/sparc[OK]
ac/sparc64[OK]

Advanced Search
main()
Powered by PLD Linux
(c) 2002-2017 PLD Team
$Revision: 1.37 $
Powered by NASA.
Your IP: 54.156.58.187

icedove 9232fb5d-9fd4-4a72-8112-a7874082bd82

Status:Failed
Source URL:ftp://buildlogs.pld-linux.org/th/i686/FAIL/icedove,9232fb5d-9fd4-4a72-8112-a7874082bd82.bz2
text/plain URL:View!
rpm -qa of builder:View!
Date:2017/03/10 23:37:09
Runtime:0:04:06.334368

Toc:

  • prep
  • Executing(%prep): /bin/sh -e /tmp/B.7PyGsO/BUILD/tmp/rpm-tmp.32054
  • build
  • Executing(%build): /bin/sh -e /tmp/B.7PyGsO/BUILD/tmp/rpm-tmp.13752
  • error 1
  • configure: error: cannot determine icu version number from uvernum.h header file
  • error 2
  • configure: error: cannot determine icu version number from uvernum.h header file
  • error 3
  • error: Bad exit status from /tmp/B.7PyGsO/BUILD/tmp/rpm-tmp.13752 (%build)
  • error 4
  • RPM build errors:
  • error 5
  • error: No files produced.

Content:

request from: baggins
checking if we should skip the build
started at: Fri Mar 10 23:30:21 2017
fetching https://srcbuilder.pld-linux.org/th//srpms/9232fb5d-9fd4-4a72-8112-a7874082bd82/icedove-38.5.0-5.src.rpm
fetched 203999734 bytes, 11718.5 K/s
installing srpm: icedove-38.5.0-5.src.rpm
+ install -d /tmp/B.7PyGsO/BUILD /tmp/B.7PyGsO/RPMS
+ LC_ALL=en_US.UTF-8
+ rpm -qp --changelog icedove-38.5.0-5.src.rpm
* Fri Mar 10 2017 PLD Linux Team <feedback@pld-linux.org>
- For complete changelog see: http://git.pld-linux.org/?p=packages/icedove.git;a=log;h=auto/th/icedove-38.5.0-5
* Fri Mar 10 2017 Jan Rękorajski <baggins@pld-linux.org> ec5c46e
- rebuild with icu 58.2 - release 5 (by relup.sh) * Mon Aug 29 2016 Jan Rękorajski <baggins@pld-linux.org> f4a8d6e
- rebuild with libvpx 1.6 - release 4 (by relup.sh) * Sun May 29 2016 Jan Rękorajski <baggins@pld-linux.org> f0b6d5d
- rebuild with hunspell 1.4.1 - release 3 (by relup.sh) * Sat May 28 2016 Jan Rękorajski <baggins@pld-linux.org> 597ad16
- rebuild with icu 57.1 - release 2 (by relup.sh) * Fri May 27 2016 Jan Rękorajski <baggins@pld-linux.org> 59e5e62
- disabled elf hack + rpm -Uhv --nodeps --define '_topdir /tmp/B.7PyGsO' --define '_specdir %{_topdir}' --define '_sourcedir %{_specdir}' --define '_rpmdir %{_topdir}/RPMS' --define '_builddir %{_topdir}/BUILD' icedove-38.5.0-5.src.rpm Preparing... ################################################## icedove ################################################## + rm -f icedove-38.5.0-5.src.rpm + install -m 700 -d /tmp/B.7PyGsO/BUILD/tmp + TMPDIR=/tmp/B.7PyGsO/BUILD/tmp + exec nice -n 0 rpmbuild -bp --short-circuit --nodeps --define '_topdir /tmp/B.7PyGsO' --define '_specdir %{_topdir}' --define '_sourcedir %{_specdir}' --define '_rpmdir %{_topdir}/RPMS' --define '_builddir %{_topdir}/BUILD' --target i686-pld-linux --define 'prep exit 0' /tmp/B.7PyGsO/icedove.spec Building target platforms: i686-pld-linux checking BuildConflict-ing packages no BuildConflicts found checking BR rpm: Building target platforms: i686-pld-linux no BR needed building RPM using: set -ex; : build-id: 9232fb5d-9fd4-4a72-8112-a7874082bd82; TMPDIR=/tmp/B.7PyGsO/BUILD/tmp exec nice -n 0 rpmbuild -bb --define '_smp_mflags -j9' --define '_make_opts -Otarget' --define '_pld_builder 1' --define '_topdir /tmp/B.7PyGsO' --define '_specdir %{_topdir}' --define '_sourcedir %{_specdir}' --define '_rpmdir %{_topdir}/RPMS' --define '_builddir %{_topdir}/BUILD' --target i686-pld-linux /tmp/B.7PyGsO/icedove.spec + : build-id: 9232fb5d-9fd4-4a72-8112-a7874082bd82 + TMPDIR=/tmp/B.7PyGsO/BUILD/tmp + exec nice -n 0 rpmbuild -bb --define '_smp_mflags -j9' --define '_make_opts -Otarget' --define '_pld_builder 1' --define '_topdir /tmp/B.7PyGsO' --define '_specdir %{_topdir}' --define '_sourcedir %{_specdir}' --define '_rpmdir %{_topdir}/RPMS' --define '_builddir %{_topdir}/BUILD' --target i686-pld-linux /tmp/B.7PyGsO/icedove.spec Building target platforms: i686-pld-linux Executing(%prep): /bin/sh -e /tmp/B.7PyGsO/BUILD/tmp/rpm-tmp.32054 + umask 022 + cd /tmp/B.7PyGsO/BUILD + cd /tmp/B.7PyGsO/BUILD + rm -rf icedove-38.5.0 + /bin/mkdir -p icedove-38.5.0 + cd icedove-38.5.0 + /usr/bin/bzip2 -dc /tmp/B.7PyGsO/thunderbird-38.5.0.source.tar.bz2 + /bin/tar -xf - + STATUS=0 + '[' 0 -ne 0 ']' + /bin/id -u + '[' 1001 '=' 0 ']' + /bin/id -u + '[' 1001 '=' 0 ']' + /bin/chmod -Rf a+rX,u+w,g-w,o-w . + /bin/mv comm-esr38 mozilla + cd /tmp/B.7PyGsO/BUILD + cd icedove-38.5.0 + /usr/bin/xz -dc /tmp/B.7PyGsO/icedove-branding.tar.xz + /bin/tar -xf - + STATUS=0 + '[' 0 -ne 0 ']' + /bin/id -u + '[' 1001 '=' 0 ']' + /bin/id -u + '[' 1001 '=' 0 ']' + /bin/chmod -Rf a+rX,u+w,g-w,o-w . + cd mozilla + echo 'Patch #0 (icedove-branding.patch):' Patch #0 (icedove-branding.patch): + '[' -f /tmp/B.7PyGsO/icedove-branding.patch ']' + /bin/cat /tmp/B.7PyGsO/icedove-branding.patch + /usr/bin/patch -s -p1 + echo 'Patch #2 (icedove-prefs.patch):' Patch #2 (icedove-prefs.patch): + '[' -f /tmp/B.7PyGsO/icedove-prefs.patch ']' + /bin/cat /tmp/B.7PyGsO/icedove-prefs.patch + /usr/bin/patch -s -p1 + echo 'Patch #3 (system-mozldap.patch):' Patch #3 (system-mozldap.patch): + '[' -f /tmp/B.7PyGsO/system-mozldap.patch ']' + /bin/cat /tmp/B.7PyGsO/system-mozldap.patch + /usr/bin/patch -s -p1 + echo 'Patch #5 (icedove-extensiondir.patch):' Patch #5 (icedove-extensiondir.patch): + '[' -f /tmp/B.7PyGsO/icedove-extensiondir.patch ']' + /bin/cat /tmp/B.7PyGsO/icedove-extensiondir.patch + /usr/bin/patch -s -p2 + echo 'Patch #6 (no-subshell.patch):' Patch #6 (no-subshell.patch): + '[' -f /tmp/B.7PyGsO/no-subshell.patch ']' + /bin/cat /tmp/B.7PyGsO/no-subshell.patch + /usr/bin/patch -s -p1 + echo 'Patch #7 (system-virtualenv.patch):' Patch #7 (system-virtualenv.patch): + '[' -f /tmp/B.7PyGsO/system-virtualenv.patch ']' + /bin/cat /tmp/B.7PyGsO/system-virtualenv.patch + /usr/bin/patch -s -p1 + echo 'Patch #8 (enable-addons.patch):' Patch #8 (enable-addons.patch): + '[' -f /tmp/B.7PyGsO/enable-addons.patch ']' + /bin/cat /tmp/B.7PyGsO/enable-addons.patch + /usr/bin/patch -s -p1 + echo 'Patch #9 (bump-nss-req.patch):' Patch #9 (bump-nss-req.patch): + '[' -f /tmp/B.7PyGsO/bump-nss-req.patch ']' + /bin/cat /tmp/B.7PyGsO/bump-nss-req.patch + /usr/bin/patch -s -p2 + exit 0 Executing(%build): /bin/sh -e /tmp/B.7PyGsO/BUILD/tmp/rpm-tmp.13752 TMP=/home/users/builder/tmp HOME=/home/users/builder PATH=/home/users/builder/GNUstep/Tools:/usr/local/bin:/usr/bin:/bin:/home/users/builder/bin TMPDIR=/tmp/B.7PyGsO/BUILD/tmp + umask 022 + cd /tmp/B.7PyGsO/BUILD + cd icedove-38.5.0 + cd mozilla + cp -f /usr/share/automake/config.guess /usr/share/automake/config.sub mozilla/build/autoconf + cp -f /usr/share/automake/config.guess /usr/share/automake/config.sub mozilla/nsprpub/build/autoconf + cp -f /usr/share/automake/config.guess /usr/share/automake/config.sub ldap/sdks/c-sdk/config/autoconf + <<EOF + >.mozconfig + cat + mkdir -p /tmp/B.7PyGsO/BUILD/icedove-38.5.0/obj-i686/config + ln -s /tmp/B.7PyGsO/BUILD/icedove-38.5.0/mozilla/config/baseconfig.mk /tmp/B.7PyGsO/BUILD/icedove-38.5.0/mozilla/config/config.mk /tmp/B.7PyGsO/BUILD/icedove-38.5.0/mozilla/config/recurse.mk /tmp/B.7PyGsO/BUILD/icedove-38.5.0/mozilla/config/rules.mk /tmp/B.7PyGsO/BUILD/icedove-38.5.0/obj-i686/config + /usr/bin/make -Otarget -j9 -j1 -f client.mk build 'STRIP=/bin/true' 'MOZ_MAKE_FLAGS=-j9' 'installdir=/usr/lib/icedove' 'XLIBS=-lX11 -lXt' 'CC=i686-pld-linux-gcc' 'CXX=i686-pld-linux-g++' mkdir -p '/tmp/B.7PyGsO/BUILD/icedove-38.5.0/obj-i686/' > /tmp/B.7PyGsO/BUILD/icedove-38.5.0/obj-i686/.mozconfig.mk Adding client.mk options from /tmp/B.7PyGsO/BUILD/icedove-38.5.0/mozilla/.mozconfig: MOZ_OBJDIR=/tmp/B.7PyGsO/BUILD/icedove-38.5.0/obj-i686 FOUND_MOZCONFIG := /tmp/B.7PyGsO/BUILD/icedove-38.5.0/mozilla/.mozconfig make[1]: Entering directory '/tmp/B.7PyGsO/BUILD/icedove-38.5.0/mozilla' cd /tmp/B.7PyGsO/BUILD/icedove-38.5.0/obj-i686 /tmp/B.7PyGsO/BUILD/icedove-38.5.0/mozilla/configure creating cache ./config.cache Adding configure options from /tmp/B.7PyGsO/BUILD/icedove-38.5.0/mozilla/.mozconfig --prefix=/usr --exec-prefix=/usr --bindir=/usr/bin --sbindir=/usr/sbin --sysconfdir=/etc --datadir=/usr/share --includedir=/usr/include --libdir=/usr/lib --libexecdir=/usr/lib --localstatedir=/var --sharedstatedir=/var/lib --mandir=/usr/share/man --infodir=/usr/share/info --disable-debug --disable-debug-modules --disable-logging --enable-optimize=-O2 -fwrapv -pipe -Wformat -Werror=format-security -gdwarf-4 -fno-debug-types-section -fvar-tracking-assignments -g2 -Wp,-D_FORTIFY_SOURCE=2 -fstack-protector-strong --param=ssp-buffer-size=4 -fomit-frame-pointer -march=i686 -fasynchronous-unwind-tables -mtune=pentium4 -gdwarf-4 -fno-debug-types-section -fvar-tracking-assignments -g2 -Os --disable-strip --disable-strip-libs --disable-tests --enable-calendar --disable-crashreporter --disable-elf-dynstr-gc --disable-elf-hack --disable-gnomeui --disable-gnomevfs --disable-installer --disable-javaxpcom --disable-profilesharing --disable-updater --disable-xterm-updates --enable-application=mail --enable-crypto --enable-default-toolkit=cairo-gtk2 --enable-gio --enable-ldap --with-system-ldap --enable-libxul --enable-pango --enable-postscript --enable-single-profile --enable-startup-notification --enable-system-cairo --enable-system-hunspell --enable-system-sqlite --with-branding=icedove/branding --with-default-mozilla-five-home=/usr/lib/icedove --with-distribution-id=org.pld-linux --with-pthreads --with-system-bz2 --with-system-ffi --with-system-icu --with-system-jpeg --with-system-libevent --with-system-libvpx --with-system-nspr --with-system-nss --with-system-png --with-system-zlib loading cache ./config.cache checking host system type... i686-pc-linux-gnu checking target system type... i686-pc-linux-gnu checking build system type... i686-pc-linux-gnu checking for gawk... gawk checking for python2.7... /usr/bin/python2.7 Creating Python environment New python executable in /tmp/B.7PyGsO/BUILD/icedove-38.5.0/obj-i686/_virtualenv/bin/python2.7 Also creating executable in /tmp/B.7PyGsO/BUILD/icedove-38.5.0/obj-i686/_virtualenv/bin/python Installing setuptools, pip, wheel...done. running build_ext building '_psutil_linux' extension creating build/temp.linux-i686-2.7 creating build/temp.linux-i686-2.7/psutil i686-pld-linux-gcc -pthread -fno-strict-aliasing -O2 -fwrapv -pipe -Wformat -Werror=format-security -gdwarf-4 -fno-debug-types-section -fvar-tracking-assignments -g2 -Wp,-D_FORTIFY_SOURCE=2 -fstack-protector-strong --param=ssp-buffer-size=4 -fomit-frame-pointer -march=i686 -fasynchronous-unwind-tables -mtune=pentium4 -gdwarf-4 -fno-debug-types-section -fvar-tracking-assignments -g2 -DNDEBUG -O2 -fwrapv -pipe -Wformat -Werror=format-security -gdwarf-4 -fno-debug-types-section -fvar-tracking-assignments -g2 -Wp,-D_FORTIFY_SOURCE=2 -fstack-protector-strong --param=ssp-buffer-size=4 -fomit-frame-pointer -march=i686 -fasynchronous-unwind-tables -mtune=pentium4 -gdwarf-4 -fno-debug-types-section -fvar-tracking-assignments -g2 -fPIC -I/usr/include/python2.7 -c psutil/_psutil_linux.c -o build/temp.linux-i686-2.7/psutil/_psutil_linux.o psutil/_psutil_linux.c: In function 'init_psutil_linux': psutil/_psutil_linux.c:563:54: warning: overflow in implicit constant conversion [-Woverflow] PyModule_AddIntConstant(module, "RLIM_INFINITY", RLIM_INFINITY); ^~~~~~~~~~~~~ creating build/lib.linux-i686-2.7 i686-pld-linux-gcc -pthread -shared -Wl,--as-needed -Wl,--no-copy-dt-needed-entries -Wl,-z,relro -Wl,-z,combreloc build/temp.linux-i686-2.7/psutil/_psutil_linux.o -L/usr/lib -lpython2.7 -o build/lib.linux-i686-2.7/_psutil_linux.so building '_psutil_posix' extension i686-pld-linux-gcc -pthread -fno-strict-aliasing -O2 -fwrapv -pipe -Wformat -Werror=format-security -gdwarf-4 -fno-debug-types-section -fvar-tracking-assignments -g2 -Wp,-D_FORTIFY_SOURCE=2 -fstack-protector-strong --param=ssp-buffer-size=4 -fomit-frame-pointer -march=i686 -fasynchronous-unwind-tables -mtune=pentium4 -gdwarf-4 -fno-debug-types-section -fvar-tracking-assignments -g2 -DNDEBUG -O2 -fwrapv -pipe -Wformat -Werror=format-security -gdwarf-4 -fno-debug-types-section -fvar-tracking-assignments -g2 -Wp,-D_FORTIFY_SOURCE=2 -fstack-protector-strong --param=ssp-buffer-size=4 -fomit-frame-pointer -march=i686 -fasynchronous-unwind-tables -mtune=pentium4 -gdwarf-4 -fno-debug-types-section -fvar-tracking-assignments -g2 -fPIC -I/usr/include/python2.7 -c psutil/_psutil_posix.c -o build/temp.linux-i686-2.7/psutil/_psutil_posix.o i686-pld-linux-gcc -pthread -shared -Wl,--as-needed -Wl,--no-copy-dt-needed-entries -Wl,-z,relro -Wl,-z,combreloc build/temp.linux-i686-2.7/psutil/_psutil_posix.o -L/usr/lib -lpython2.7 -o build/lib.linux-i686-2.7/_psutil_posix.so copying build/lib.linux-i686-2.7/_psutil_linux.so -> copying build/lib.linux-i686-2.7/_psutil_posix.so -> checking Python environment is Mozilla virtualenv... yes checking for perl5... no checking for perl... /usr/bin/perl checking for objcopy... /usr/bin/objcopy checking for gcc... i686-pld-linux-gcc checking whether the C compiler (i686-pld-linux-gcc -O2 -fwrapv -pipe -Wformat -Werror=format-security -gdwarf-4 -fno-debug-types-section -fvar-tracking-assignments -g2 -Wp,-D_FORTIFY_SOURCE=2 -fstack-protector-strong --param=ssp-buffer-size=4 -fomit-frame-pointer -march=i686 -fasynchronous-unwind-tables -mtune=pentium4 -gdwarf-4 -fno-debug-types-section -fvar-tracking-assignments -g2 ) works... yes checking whether the C compiler (i686-pld-linux-gcc -O2 -fwrapv -pipe -Wformat -Werror=format-security -gdwarf-4 -fno-debug-types-section -fvar-tracking-assignments -g2 -Wp,-D_FORTIFY_SOURCE=2 -fstack-protector-strong --param=ssp-buffer-size=4 -fomit-frame-pointer -march=i686 -fasynchronous-unwind-tables -mtune=pentium4 -gdwarf-4 -fno-debug-types-section -fvar-tracking-assignments -g2 ) is a cross-compiler... no checking whether we are using GNU C... yes checking whether i686-pld-linux-gcc accepts -g... yes checking for c++... i686-pld-linux-g++ checking whether the C++ compiler (i686-pld-linux-g++ -O2 -fwrapv -pipe -Wformat -Werror=format-security -gdwarf-4 -fno-debug-types-section -fvar-tracking-assignments -g2 -Wp,-D_FORTIFY_SOURCE=2 -fstack-protector-strong --param=ssp-buffer-size=4 -fomit-frame-pointer -march=i686 -fasynchronous-unwind-tables -mtune=pentium4 -gdwarf-4 -fno-debug-types-section -fvar-tracking-assignments -g2 ) works... yes checking whether the C++ compiler (i686-pld-linux-g++ -O2 -fwrapv -pipe -Wformat -Werror=format-security -gdwarf-4 -fno-debug-types-section -fvar-tracking-assignments -g2 -Wp,-D_FORTIFY_SOURCE=2 -fstack-protector-strong --param=ssp-buffer-size=4 -fomit-frame-pointer -march=i686 -fasynchronous-unwind-tables -mtune=pentium4 -gdwarf-4 -fno-debug-types-section -fvar-tracking-assignments -g2 ) is a cross-compiler... no checking whether we are using GNU C++... yes checking whether i686-pld-linux-g++ accepts -g... yes checking for ranlib... ranlib checking for as... /usr/bin/as checking for ar... ar checking for ld... ld checking for strip... /bin/true checking for windres... no checking for otool... no checking how to run the C preprocessor... i686-pld-linux-gcc -E checking how to run the C++ preprocessor... i686-pld-linux-g++ -E checking for a BSD compatible install... /usr/bin/install -c checking whether ln -s works... yes checking for minimum required perl version >= 5.006... 5.024000 checking for full perl installation... yes checking for doxygen... /usr/bin/doxygen checking for autoconf... /usr/bin/autoconf checking for unzip... /usr/bin/unzip checking for zip... /usr/bin/zip checking for xargs... /bin/xargs checking for rpmbuild... /usr/bin/rpmbuild checking for /usr/bin/make... no checking for gmake... /usr/bin/gmake checking for X... libraries , headers checking for dnet_ntoa in -ldnet... no checking for dnet_ntoa in -ldnet_stub... no checking for gethostbyname... no checking for connect... no checking for remove... no checking for shmat... no checking for IceConnectionNumber in -lICE... yes checking that static assertion macros used in autoconf tests work... yes checking for --noexecstack option to as... yes checking for -z noexecstack option to ld... yes checking for -z text option to ld... yes checking for --build-id option to ld... yes checking for --ignore-unresolved-symbol option to ld... yes checking if toolchain supports -mssse3 option... yes checking if toolchain supports -msse4.1 option... yes checking for x86 AVX2 asm support in compiler... yes checking whether the C++ compiler supports -Wno-inline-new-delete... no checking whether ld has archive extraction flags... yes checking for 64-bit OS... no checking whether the C++ compiler (i686-pld-linux-g++ -O2 -fwrapv -pipe -Wformat -Werror=format-security -gdwarf-4 -fno-debug-types-section -fvar-tracking-assignments -g2 -Wp,-D_FORTIFY_SOURCE=2 -fstack-protector-strong --param=ssp-buffer-size=4 -fomit-frame-pointer -march=i686 -fasynchronous-unwind-tables -mtune=pentium4 -gdwarf-4 -fno-debug-types-section -fvar-tracking-assignments -g2 -fno-exceptions -fno-strict-aliasing -fno-rtti -Wl,-z,noexecstack -Wl,-z,text -Wl,--build-id) actually is a C++ compiler... yes checking for ANSI C header files... yes checking for working const... yes checking for mode_t... yes checking for off_t... yes checking for pid_t... yes checking for size_t... yes checking for gcc c++0x headers bug without rtti... no checking for gcc PR49911... no checking for llvm pr8927... no checking for __force_align_arg_pointer__ attribute... yes checking for dirent.h that defines DIR... yes checking for opendir in -ldir... no checking for sys/byteorder.h... no checking for compat.h... no checking for getopt.h... yes checking for sys/bitypes.h... yes checking for memory.h... yes checking for unistd.h... yes checking for gnu/libc-version.h... yes checking for nl_types.h... yes checking for malloc.h... yes checking for X11/XKBlib.h... yes checking for io.h... no checking for cpuid.h... yes checking for sys/statvfs.h... yes checking for sys/statfs.h... yes checking for sys/vfs.h... yes checking for sys/mount.h... yes checking for sys/quota.h... yes checking for sys/sysmacros.h... yes checking for linux/quota.h... yes checking for linux/if_addr.h... yes checking for linux/rtnetlink.h... yes checking for sys/types.h... yes checking for netinet/in.h... yes checking for byteswap.h... yes checking for sockaddr_in.sin_len... false checking for sockaddr_in6.sin6_len... false checking for sockaddr.sa_len... false checking for sys/cdefs.h... yes checking for linux/perf_event.h... yes checking for perf_event_open system call... yes checking for gethostbyname_r in -lc_r... no checking for library containing dlopen... -ldl checking for dlfcn.h... yes checking for dladdr... yes checking for memmem... yes checking for socket in -lsocket... no checking for XDrawLines in -lX11... yes checking for XextAddDisplay in -lXext... yes checking for XtFree in -lXt... yes checking for XShmCreateImage in -lXext... yes checking for X11/extensions/scrnsaver.h... yes checking for XScreenSaverQueryInfo in -lXss... yes checking for pthread_create in -lpthreads... no checking for pthread_create in -lpthread... yes checking whether i686-pld-linux-gcc accepts -pthread... yes checking whether i686-pld-linux-gcc needs -traditional... no checking for 8-bit clean memcmp... yes checking for stat64... yes checking for lstat64... yes checking for truncate64... yes checking for statvfs64... yes checking for statvfs... yes checking for statfs64... yes checking for statfs... yes checking for getpagesize... yes checking for gmtime_r... yes checking for localtime_r... yes checking for arc4random... no checking for arc4random_buf... no checking for clock_gettime(CLOCK_MONOTONIC)... checking for wcrtomb... yes checking for mbrtowc... yes checking for res_ninit()... yes checking for iconv in -lc... yes checking for iconv()... yes checking for iconv() with const input... no checking for nl_langinfo and CODESET... yes checking for an implementation of va_copy()... yes checking whether va_list can be copied by value... yes checking whether the C++ "using" keyword resolves ambiguity... yes checking for C++ dynamic_cast to void*... yes checking for __thread keyword for TLS variables... yes checking for malloc.h... (cached) yes checking for alloca.h... yes checking for strndup... yes checking for posix_memalign... yes checking for memalign... yes checking for malloc_usable_size... yes checking for malloc.h... (cached) yes checking whether malloc_usable_size definition can use const argument... no checking for valloc in malloc.h... yes checking for valloc in unistd.h... no checking for __attribute__((always_inline))... yes checking for __attribute__((malloc))... yes checking for __attribute__((warn_unused_result))... yes checking for LC_MESSAGES... yes checking for localeconv... yes checking NSPR selection... system checking for nspr-config... /usr/bin/nspr-config checking for NSPR - version >= 4.10.10... yes checking for pkg-config... /usr/bin/pkg-config checking for libevent... yes checking MOZ_LIBEVENT_CFLAGS... checking MOZ_LIBEVENT_LIBS... -levent checking for nss-config... /usr/bin/nss-config checking for NSS - version >= 3.20.0... yes checking for YASM assembler... checking for yasm... yasm checking for jpeg_destroy_compress in -ljpeg... yes checking for gzread in -lz... yes checking for BZ2_bzread in -lbz2... yes checking for png_get_valid in -lpng... yes checking for png_get_acTL in -lpng... yes checking for hunspell... yes checking MOZ_HUNSPELL_CFLAGS... -I/usr/include/hunspell checking MOZ_HUNSPELL_LIBS... -lhunspell-1.4 checking for application to build... ../mail checking if app-specific confvars.sh exists... /tmp/B.7PyGsO/BUILD/icedove-38.5.0/mozilla/mozilla/../mail/confvars.sh checking for gtk+-2.0 >= 2.18.0 gtk+-unix-print-2.0 glib-2.0 >= 2.22 gobject-2.0 gdk-x11-2.0... yes checking MOZ_GTK2_CFLAGS... -pthread -I/usr/include/gtk-2.0 -I/usr/include/gtk-unix-print-2.0 -I/usr/include/gtk-2.0 -I/usr/include/atk-1.0 -I/usr/include/gtk-2.0 -I/usr/lib/gtk-2.0/include -I/usr/include/pango-1.0 -I/usr/include/gio-unix-2.0/ -I/usr/include/gdk-pixbuf-2.0 -I/usr/include/cairo -I/usr/include/pixman-1 -I/usr/include/freetype2 -I/usr/include/libpng16 -I/usr/include/harfbuzz -I/usr/include/glib-2.0 -I/usr/lib/glib-2.0/include -I/usr/include/freetype2 -I/usr/include/harfbuzz -I/usr/include/glib-2.0 -I/usr/lib/glib-2.0/include -I/usr/include/libpng16 checking MOZ_GTK2_LIBS... -lgtk-x11-2.0 -latk-1.0 -lpangoft2-1.0 -lgdk-x11-2.0 -lpangocairo-1.0 -lpango-1.0 -lgio-2.0 -lfontconfig -lfreetype -lXrender -lXinerama -lXi -lXrandr -lXcursor -lXcomposite -lXdamage -lXfixes -lgdk_pixbuf-2.0 -lgobject-2.0 -lglib-2.0 -lcairo -lX11 -lXext checking for libstartup-notification-1.0 >= 0.8... yes checking MOZ_STARTUP_NOTIFICATION_CFLAGS... -I/usr/include/startup-notification-1.0 checking MOZ_STARTUP_NOTIFICATION_LIBS... -lstartup-notification-1 checking for pango >= 1.22.0... yes checking _PANGOCHK_CFLAGS... -I/usr/include/pango-1.0 -I/usr/include/glib-2.0 -I/usr/lib/glib-2.0/include checking _PANGOCHK_LIBS... -lpango-1.0 -lgobject-2.0 -lglib-2.0 checking for pango >= 1.22.0 pangoft2 >= 1.22.0 pangocairo >= 1.22.0... yes checking MOZ_PANGO_CFLAGS... -I/usr/include/pango-1.0 -I/usr/include/cairo -I/usr/include/pixman-1 -I/usr/include/freetype2 -I/usr/include/libpng16 -I/usr/include/harfbuzz -I/usr/include/glib-2.0 -I/usr/lib/glib-2.0/include -I/usr/include/freetype2 -I/usr/include/harfbuzz -I/usr/include/glib-2.0 -I/usr/lib/glib-2.0/include -I/usr/include/libpng16 checking MOZ_PANGO_LIBS... -lpangoft2-1.0 -lfontconfig -lfreetype -lpangocairo-1.0 -lpango-1.0 -lgobject-2.0 -lglib-2.0 -lcairo checking for gtk+-2.0 >= 2.14... yes checking _GTKCHECK_CFLAGS... -pthread -I/usr/include/gtk-2.0 -I/usr/lib/gtk-2.0/include -I/usr/include/pango-1.0 -I/usr/include/gio-unix-2.0/ -I/usr/include/cairo -I/usr/include/atk-1.0 -I/usr/include/cairo -I/usr/include/pixman-1 -I/usr/include/gdk-pixbuf-2.0 -I/usr/include/pango-1.0 -I/usr/include/freetype2 -I/usr/include/libpng16 -I/usr/include/harfbuzz -I/usr/include/glib-2.0 -I/usr/lib/glib-2.0/include -I/usr/include/freetype2 -I/usr/include/libpng16 -I/usr/include/harfbuzz -I/usr/include/glib-2.0 -I/usr/lib/glib-2.0/include checking _GTKCHECK_LIBS... -lgtk-x11-2.0 -lgdk-x11-2.0 -lpangocairo-1.0 -lgio-2.0 -lXrender -lXinerama -lXi -lXrandr -lXcursor -lXcomposite -lXdamage -lXfixes -lX11 -lXext -latk-1.0 -lcairo -lgdk_pixbuf-2.0 -lgio-2.0 -lpangoft2-1.0 -lpango-1.0 -lgobject-2.0 -lglib-2.0 -lfontconfig -lfreetype checking for gio-2.0 >= 2.22... yes checking MOZ_GIO_CFLAGS... -pthread -I/usr/include/glib-2.0 -I/usr/lib/glib-2.0/include checking MOZ_GIO_LIBS... -lgio-2.0 -lgobject-2.0 -lglib-2.0 checking for gconf-2.0 >= 1.2.1 gobject-2.0 ... yes checking MOZ_GCONF_CFLAGS... -DORBIT2=1 -pthread -I/usr/include/gconf2 -I/usr/include/orbit-2.0 -I/usr/include/glib-2.0 -I/usr/lib/glib-2.0/include checking MOZ_GCONF_LIBS... -lgconf-2 -lgobject-2.0 -lglib-2.0 checking for dbus-1 >= 0.60... yes checking MOZ_DBUS_CFLAGS... -I/usr/include/dbus-1.0 -I/usr/lib/dbus-1.0/include checking MOZ_DBUS_LIBS... -ldbus-1 checking for dbus-glib-1 >= 0.60... yes checking MOZ_DBUS_GLIB_CFLAGS... -I/usr/include/dbus-1.0 -I/usr/lib/dbus-1.0/include -I/usr/include/glib-2.0 -I/usr/lib/glib-2.0/include checking MOZ_DBUS_GLIB_LIBS... -ldbus-glib-1 -ldbus-1 -lgobject-2.0 -lglib-2.0 checking __attribute__ ((aligned ())) support... trying 64 64 checking for vpx >= 1.3.0... yes checking MOZ_LIBVPX_CFLAGS... checking MOZ_LIBVPX_LIBS... -lvpx -lm checking for vpx/vpx_decoder.h... yes checking for vpx_codec_dec_init_ver in -lvpx... yes checking for vpx_mem/vpx_mem.h... no checking for alsa... yes checking MOZ_ALSA_CFLAGS... -I/usr/include/alsa checking MOZ_ALSA_LIBS... -lasound checking for libpulse... yes checking MOZ_PULSEAUDIO_CFLAGS... -D_REENTRANT checking MOZ_PULSEAUDIO_LIBS... -lpulse checking for gstreamer-0.10 >= 0.10.25 gstreamer-app-0.10 gstreamer-plugins-base-0.10... yes checking GSTREAMER_CFLAGS... -pthread -I/usr/include/gstreamer-0.10 -I/usr/include/glib-2.0 -I/usr/lib/glib-2.0/include -I/usr/include/libxml2 checking GSTREAMER_LIBS... -lgstapp-0.10 -lgstbase-0.10 -lgstreamer-0.10 -lgobject-2.0 -lgmodule-2.0 -pthread -lgthread-2.0 -pthread -lglib-2.0 -lxml2 checking for java... /usr/lib/jvm/java/bin/java checking for javac... /usr/lib/jvm/java/bin/javac checking for javah... /usr/lib/jvm/java/bin/javah checking for jar... /usr/lib/jvm/java/bin/jar checking for jarsigner... /usr/lib/jvm/java/bin/jarsigner checking for keytool... /usr/lib/jvm/java/bin/keytool checking for linux/joystick.h... yes checking for gnutar... no checking for gtar... gtar checking for wget... no checking for sqlite3 >= 3.8.9... yes checking SQLITE_CFLAGS... checking SQLITE_LIBS... -lsqlite3 checking for SQLITE_SECURE_DELETE support in system SQLite... yes checking for SQLITE_THREADSAFE support in system SQLite... yes checking for SQLITE_ENABLE_FTS3 support in system SQLite... yes checking for SQLITE_ENABLE_UNLOCK_NOTIFY support in system SQLite... yes checking for valid optimization flags... yes /tmp/B.7PyGsO/BUILD/icedove-38.5.0/mozilla/mozilla/configure: /tmp/B.7PyGsO/BUILD/tmp/subscript.SFIdhJ[90]: cat: /suite/config/version.txt: No such file or directory checking for __cxa_demangle... yes checking for unwind.h... yes checking for _Unwind_Backtrace... yes checking for -pipe support... yes checking whether C compiler supports -fprofile-generate... yes checking whether C compiler supports -fno-integrated-as... no checking what kind of list files are supported by the linker... linkerscript checking what kind of ordering can be done with the linker... section-ordering-file checking for glib-2.0 >= 1.3.7 gobject-2.0... yes checking GLIB_CFLAGS... -I/usr/include/glib-2.0 -I/usr/lib/glib-2.0/include checking GLIB_LIBS... -lgobject-2.0 -lglib-2.0 checking for freetype2 >= 6.1.0... yes checking FT2_CFLAGS... -I/usr/include/freetype2 -I/usr/include/libpng16 -I/usr/include/harfbuzz -I/usr/include/glib-2.0 -I/usr/lib/glib-2.0/include checking FT2_LIBS... -lfreetype checking for FT_Bitmap_Size.y_ppem... yes checking for FT_GlyphSlot_Embolden... yes checking for FT_Load_Sfnt_Table... yes checking for fontconfig/fcfreetype.h... yes checking for fontconfig... yes checking _FONTCONFIG_CFLAGS... -I/usr/include/freetype2 -I/usr/include/libpng16 -I/usr/include/harfbuzz -I/usr/include/glib-2.0 -I/usr/lib/glib-2.0/include -I/usr/include/freetype2 -I/usr/include/libpng16 -I/usr/include/harfbuzz -I/usr/include/glib-2.0 -I/usr/lib/glib-2.0/include checking _FONTCONFIG_LIBS... -lfontconfig -lfreetype checking for pixman-1 >= 0.19.2... yes checking PIXMAN_CFLAGS... -I/usr/include/pixman-1 checking PIXMAN_LIBS... -lpixman-1 checking for stdint.h... yes checking for inttypes.h... yes checking for sys/int_types.h... no checking for cairo >= 1.10... yes checking CAIRO_CFLAGS... -I/usr/include/cairo -I/usr/include/pixman-1 -I/usr/include/freetype2 -I/usr/include/libpng16 -I/usr/include/harfbuzz -I/usr/include/glib-2.0 -I/usr/lib/glib-2.0/include -I/usr/include/freetype2 -I/usr/include/harfbuzz -I/usr/include/glib-2.0 -I/usr/lib/glib-2.0/include -I/usr/include/libpng16 checking CAIRO_LIBS... -lcairo checking for cairo-tee >= 1.10... yes checking CAIRO_TEE_CFLAGS... -I/usr/include/cairo -I/usr/include/pixman-1 -I/usr/include/freetype2 -I/usr/include/libpng16 -I/usr/include/harfbuzz -I/usr/include/glib-2.0 -I/usr/lib/glib-2.0/include -I/usr/include/freetype2 -I/usr/include/harfbuzz -I/usr/include/glib-2.0 -I/usr/lib/glib-2.0/include -I/usr/include/libpng16 checking CAIRO_TEE_LIBS... -lcairo checking for cairo-xlib-xrender >= 1.10... yes checking CAIRO_XRENDER_CFLAGS... -I/usr/include/cairo -I/usr/include/pixman-1 -I/usr/include/freetype2 -I/usr/include/libpng16 -I/usr/include/harfbuzz -I/usr/include/glib-2.0 -I/usr/lib/glib-2.0/include -I/usr/include/freetype2 -I/usr/include/harfbuzz -I/usr/include/glib-2.0 -I/usr/lib/glib-2.0/include -I/usr/include/libpng16 checking CAIRO_XRENDER_LIBS... -lcairo -lXext -lXrender -lX11 checking for posix_fadvise... yes checking for posix_fallocate... yes checking for icu-i18n >= 50.1... yes checking MOZ_ICU_CFLAGS... checking MOZ_ICU_LIBS... -licui18n -licuuc -licudata sed: character class syntax is [[:space:]], not [:space:] configure: error: cannot determine icu version number from uvernum.h header file ------ config.log ------ #line 26918 "configure" #include "confdefs.h" #include <sys/int_types.h> int main() { ; return 0; } configure:27180: checking for cairo >= 1.10 configure:27187: checking CAIRO_CFLAGS configure:27192: checking CAIRO_LIBS configure:27273: checking for cairo-tee >= 1.10 configure:27280: checking CAIRO_TEE_CFLAGS configure:27285: checking CAIRO_TEE_LIBS configure:27365: checking for cairo-xlib-xrender >= 1.10 configure:27372: checking CAIRO_XRENDER_CFLAGS configure:27377: checking CAIRO_XRENDER_LIBS configure:28319: checking for posix_fadvise configure:28351: i686-pld-linux-gcc -o conftest -Wall -Wdeclaration-after-statement -Wempty-body -Wpointer-to-int-cast -Wsign-compare -Wtype-limits -Wno-unused -Wcast-align -O2 -fwrapv -pipe -Wformat -Werror=format-security -gdwarf-4 -fno-debug-types-section -fvar-tracking-assignments -g2 -Wp,-D_FORTIFY_SOURCE=2 -fstack-protector-strong --param=ssp-buffer-size=4 -fomit-frame-pointer -march=i686 -fasynchronous-unwind-tables -mtune=pentium4 -gdwarf-4 -fno-debug-types-section -fvar-tracking-assignments -g2 -std=gnu99 -fgnu89-inline -fno-strict-aliasing -fno-math-errno -pthread -pipe -lpthread -Wl,-z,noexecstack -Wl,-z,text -Wl,--build-id -B /tmp/B.7PyGsO/BUILD/icedove-38.5.0/obj-i686/build/unix/gold conftest.c -ldl 1>&5 configure:28319: checking for posix_fallocate configure:28351: i686-pld-linux-gcc -o conftest -Wall -Wdeclaration-after-statement -Wempty-body -Wpointer-to-int-cast -Wsign-compare -Wtype-limits -Wno-unused -Wcast-align -O2 -fwrapv -pipe -Wformat -Werror=format-security -gdwarf-4 -fno-debug-types-section -fvar-tracking-assignments -g2 -Wp,-D_FORTIFY_SOURCE=2 -fstack-protector-strong --param=ssp-buffer-size=4 -fomit-frame-pointer -march=i686 -fasynchronous-unwind-tables -mtune=pentium4 -gdwarf-4 -fno-debug-types-section -fvar-tracking-assignments -g2 -std=gnu99 -fgnu89-inline -fno-strict-aliasing -fno-math-errno -pthread -pipe -lpthread -Wl,-z,noexecstack -Wl,-z,text -Wl,--build-id -B /tmp/B.7PyGsO/BUILD/icedove-38.5.0/obj-i686/build/unix/gold conftest.c -ldl 1>&5 configure:28405: i686-pld-linux-gcc -c -Wall -Wdeclaration-after-statement -Wempty-body -Wpointer-to-int-cast -Wsign-compare -Wtype-limits -Wno-unused -Wcast-align -O2 -fwrapv -pipe -Wformat -Werror=format-security -gdwarf-4 -fno-debug-types-section -fvar-tracking-assignments -g2 -Wp,-D_FORTIFY_SOURCE=2 -fstack-protector-strong --param=ssp-buffer-size=4 -fomit-frame-pointer -march=i686 -fasynchronous-unwind-tables -mtune=pentium4 -gdwarf-4 -fno-debug-types-section -fvar-tracking-assignments -g2 -std=gnu99 -fgnu89-inline -fno-strict-aliasing -fno-math-errno -pthread -pipe conftest.c 1>&5 configure:28634: checking for icu-i18n >= 50.1 configure:28641: checking MOZ_ICU_CFLAGS configure:28646: checking MOZ_ICU_LIBS configure: error: cannot determine icu version number from uvernum.h header file *** Fix above errors and then restart with\ "/usr/bin/make -f client.mk build" make[1]: *** [/tmp/B.7PyGsO/BUILD/icedove-38.5.0/mozilla/client.mk:363: configure] Error 1 make[1]: Leaving directory '/tmp/B.7PyGsO/BUILD/icedove-38.5.0/mozilla' make: *** [client.mk:375: /tmp/B.7PyGsO/BUILD/icedove-38.5.0/obj-i686/Makefile] Error 2 error: Bad exit status from /tmp/B.7PyGsO/BUILD/tmp/rpm-tmp.13752 (%build) RPM build errors: Bad exit status from /tmp/B.7PyGsO/BUILD/tmp/rpm-tmp.13752 (%build) ended at: Fri Mar 10 23:34:50 2017, done in 0:04:06.334368 error: No files produced. + chmod -R u+rwX /tmp/B.7PyGsO/BUILD + rm -rf /tmp/B.7PyGsO/tmp /tmp/B.7PyGsO/BUILD + rm -rf /tmp/B.7PyGsO Begin-PLD-Builder-Info Build-Time: user:41.94s sys:15.49s real:407.62s (faults io:63 non-io:838705) End-PLD-Builder-Info
[Back to list of logs] [View rpm -qa of builder]