FailedOk

th/SRPMS[OK]
th/x32[OK]
th/i686[OK]
th/x86_64[OK]

ac/SRPMS[OK]
ac/i386[OK]
ac/i586[OK]
ac/i686[OK]
ac/alpha[OK]
ac/amd64[OK]
ac/athlon[OK]
ac/ppc[OK]
ac/sparc[OK]
ac/sparc64[OK]

Advanced Search
main()
Powered by PLD Linux
(c) 2002-2021 PLD Team
$Revision: 1.37 $
Powered by VAX.
Your IP: 3.238.36.32

ipset 350da904-ad4a-49d9-abfe-6e5434c29008

Status:Failed
Source URL:https://buildlogs.pld-linux.org/pld/th/i686/FAIL/ipset,350da904-ad4a-49d9-abfe-6e5434c29008.bz2
text/plain URL:View!
full text:View!
rpm -qa of builder:View!
Date:2021/02/23 13:06:41
Runtime:0:00:53.834516

Toc:

  • error 1
  • /tmp/B.ffb7Nk/BUILD/ipset-7.6/kernel/net/netfilter/ipset/ip_set_hash_netiface.c:229:2: error: implicit declaration of function 'nla_strlcpy'; did you mean 'nla_strscpy'? [-Werror=implicit-function-declaration]
  • error 2
  • make[2]: *** [scripts/Makefile.build:279: /tmp/B.ffb7Nk/BUILD/ipset-7.6/kernel/net/netfilter/ipset/ip_set_hash_netiface.o] Error 1
  • error 3
  • make[1]: *** [scripts/Makefile.build:496: /tmp/B.ffb7Nk/BUILD/ipset-7.6/kernel/net/netfilter/ipset] Error 2
  • error 4
  • error: Bad exit status from /tmp/B.ffb7Nk/BUILD/tmp/rpm-tmp.pYuQB7 (%build)
  • error 5
  • RPM build errors:
  • error 6
  • error: No files produced.

Content:

  137 |  case 2: b += k[1];
      |          ~~^~~~~~~
/tmp/B.ffb7Nk/BUILD/ipset-7.6/kernel/net/netfilter/../../include/linux/jhash.h:138:2: note: here
  138 |  case 1: a += k[0];
      |  ^~~~
  CC [M]  /tmp/B.ffb7Nk/BUILD/ipset-7.6/kernel/net/netfilter/ipset/ip_set_core.o
  CC [M]  /tmp/B.ffb7Nk/BUILD/ipset-7.6/kernel/net/netfilter/ipset/ip_set_hash_ipportip.o
In file included from /tmp/B.ffb7Nk/BUILD/ipset-7.6/kernel/net/netfilter/ipset/ip_set_hash_ipportip.c:7:
/tmp/B.ffb7Nk/BUILD/ipset-7.6/kernel/net/netfilter/../../include/linux/jhash.h: In function 'jhash2':
/tmp/B.ffb7Nk/BUILD/ipset-7.6/kernel/net/netfilter/../../include/linux/jhash.h:136:12: warning: this statement may fall through [-Wimplicit-fallthrough=]
  136 |  case 3: c += k[2];
      |          ~~^~~~~~~
/tmp/B.ffb7Nk/BUILD/ipset-7.6/kernel/net/netfilter/../../include/linux/jhash.h:137:2: note: here
  137 |  case 2: b += k[1];
      |  ^~~~
/tmp/B.ffb7Nk/BUILD/ipset-7.6/kernel/net/netfilter/../../include/linux/jhash.h:137:12: warning: this statement may fall through [-Wimplicit-fallthrough=]
  137 |  case 2: b += k[1];
      |          ~~^~~~~~~
/tmp/B.ffb7Nk/BUILD/ipset-7.6/kernel/net/netfilter/../../include/linux/jhash.h:138:2: note: here
  138 |  case 1: a += k[0];
      |  ^~~~
  CC [M]  /tmp/B.ffb7Nk/BUILD/ipset-7.6/kernel/net/netfilter/ipset/ip_set_hash_ipmark.o
In file included from /tmp/B.ffb7Nk/BUILD/ipset-7.6/kernel/net/netfilter/ipset/ip_set_hash_ipmark.c:8:
/tmp/B.ffb7Nk/BUILD/ipset-7.6/kernel/net/netfilter/../../include/linux/jhash.h: In function 'jhash2':
/tmp/B.ffb7Nk/BUILD/ipset-7.6/kernel/net/netfilter/../../include/linux/jhash.h:136:12: warning: this statement may fall through [-Wimplicit-fallthrough=]
  136 |  case 3: c += k[2];
      |          ~~^~~~~~~
/tmp/B.ffb7Nk/BUILD/ipset-7.6/kernel/net/netfilter/../../include/linux/jhash.h:137:2: note: here
  137 |  case 2: b += k[1];
      |  ^~~~
/tmp/B.ffb7Nk/BUILD/ipset-7.6/kernel/net/netfilter/../../include/linux/jhash.h:137:12: warning: this statement may fall through [-Wimplicit-fallthrough=]
  137 |  case 2: b += k[1];
      |          ~~^~~~~~~
/tmp/B.ffb7Nk/BUILD/ipset-7.6/kernel/net/netfilter/../../include/linux/jhash.h:138:2: note: here
  138 |  case 1: a += k[0];
      |  ^~~~
  CC [M]  /tmp/B.ffb7Nk/BUILD/ipset-7.6/kernel/net/netfilter/ipset/ip_set_hash_ipmac.o
In file included from /tmp/B.ffb7Nk/BUILD/ipset-7.6/kernel/net/netfilter/ipset/ip_set_hash_ipmac.c:7:
/tmp/B.ffb7Nk/BUILD/ipset-7.6/kernel/net/netfilter/../../include/linux/jhash.h: In function 'jhash2':
/tmp/B.ffb7Nk/BUILD/ipset-7.6/kernel/net/netfilter/../../include/linux/jhash.h:136:12: warning: this statement may fall through [-Wimplicit-fallthrough=]
  136 |  case 3: c += k[2];
      |          ~~^~~~~~~
/tmp/B.ffb7Nk/BUILD/ipset-7.6/kernel/net/netfilter/../../include/linux/jhash.h:137:2: note: here
  137 |  case 2: b += k[1];
      |  ^~~~
/tmp/B.ffb7Nk/BUILD/ipset-7.6/kernel/net/netfilter/../../include/linux/jhash.h:137:12: warning: this statement may fall through [-Wimplicit-fallthrough=]
  137 |  case 2: b += k[1];
      |          ~~^~~~~~~
/tmp/B.ffb7Nk/BUILD/ipset-7.6/kernel/net/netfilter/../../include/linux/jhash.h:138:2: note: here
  138 |  case 1: a += k[0];
      |  ^~~~
  LD [M]  /tmp/B.ffb7Nk/BUILD/ipset-7.6/kernel/net/netfilter/ipset/ip_set.o
  CC [M]  /tmp/B.ffb7Nk/BUILD/ipset-7.6/kernel/net/netfilter/ipset/ip_set_hash_ipportnet.o
In file included from /tmp/B.ffb7Nk/BUILD/ipset-7.6/kernel/net/netfilter/ipset/ip_set_hash_ipportnet.c:7:
/tmp/B.ffb7Nk/BUILD/ipset-7.6/kernel/net/netfilter/../../include/linux/jhash.h: In function 'jhash2':
/tmp/B.ffb7Nk/BUILD/ipset-7.6/kernel/net/netfilter/../../include/linux/jhash.h:136:12: warning: this statement may fall through [-Wimplicit-fallthrough=]
  136 |  case 3: c += k[2];
      |          ~~^~~~~~~
/tmp/B.ffb7Nk/BUILD/ipset-7.6/kernel/net/netfilter/../../include/linux/jhash.h:137:2: note: here
  137 |  case 2: b += k[1];
      |  ^~~~
/tmp/B.ffb7Nk/BUILD/ipset-7.6/kernel/net/netfilter/../../include/linux/jhash.h:137:12: warning: this statement may fall through [-Wimplicit-fallthrough=]
  137 |  case 2: b += k[1];
      |          ~~^~~~~~~
/tmp/B.ffb7Nk/BUILD/ipset-7.6/kernel/net/netfilter/../../include/linux/jhash.h:138:2: note: here
  138 |  case 1: a += k[0];
      |  ^~~~
  CC [M]  /tmp/B.ffb7Nk/BUILD/ipset-7.6/kernel/net/netfilter/ipset/ip_set_hash_netport.o
In file included from /tmp/B.ffb7Nk/BUILD/ipset-7.6/kernel/net/netfilter/ipset/ip_set_hash_netport.c:7:
/tmp/B.ffb7Nk/BUILD/ipset-7.6/kernel/net/netfilter/../../include/linux/jhash.h: In function 'jhash2':
/tmp/B.ffb7Nk/BUILD/ipset-7.6/kernel/net/netfilter/../../include/linux/jhash.h:136:12: warning: this statement may fall through [-Wimplicit-fallthrough=]
  136 |  case 3: c += k[2];
      |          ~~^~~~~~~
/tmp/B.ffb7Nk/BUILD/ipset-7.6/kernel/net/netfilter/../../include/linux/jhash.h:137:2: note: here
  137 |  case 2: b += k[1];
      |  ^~~~
/tmp/B.ffb7Nk/BUILD/ipset-7.6/kernel/net/netfilter/../../include/linux/jhash.h:137:12: warning: this statement may fall through [-Wimplicit-fallthrough=]
  137 |  case 2: b += k[1];
      |          ~~^~~~~~~
/tmp/B.ffb7Nk/BUILD/ipset-7.6/kernel/net/netfilter/../../include/linux/jhash.h:138:2: note: here
  138 |  case 1: a += k[0];
      |  ^~~~
  CC [M]  /tmp/B.ffb7Nk/BUILD/ipset-7.6/kernel/net/netfilter/ipset/ip_set_hash_net.o
In file included from /tmp/B.ffb7Nk/BUILD/ipset-7.6/kernel/net/netfilter/ipset/ip_set_hash_net.c:7:
/tmp/B.ffb7Nk/BUILD/ipset-7.6/kernel/net/netfilter/../../include/linux/jhash.h: In function 'jhash2':
/tmp/B.ffb7Nk/BUILD/ipset-7.6/kernel/net/netfilter/../../include/linux/jhash.h:136:12: warning: this statement may fall through [-Wimplicit-fallthrough=]
  136 |  case 3: c += k[2];
      |          ~~^~~~~~~
/tmp/B.ffb7Nk/BUILD/ipset-7.6/kernel/net/netfilter/../../include/linux/jhash.h:137:2: note: here
  137 |  case 2: b += k[1];
      |  ^~~~
/tmp/B.ffb7Nk/BUILD/ipset-7.6/kernel/net/netfilter/../../include/linux/jhash.h:137:12: warning: this statement may fall through [-Wimplicit-fallthrough=]
  137 |  case 2: b += k[1];
      |          ~~^~~~~~~
/tmp/B.ffb7Nk/BUILD/ipset-7.6/kernel/net/netfilter/../../include/linux/jhash.h:138:2: note: here
  138 |  case 1: a += k[0];
      |  ^~~~
  CC [M]  /tmp/B.ffb7Nk/BUILD/ipset-7.6/kernel/net/netfilter/ipset/ip_set_hash_netiface.o
/tmp/B.ffb7Nk/BUILD/ipset-7.6/kernel/net/netfilter/ipset/ip_set_hash_netiface.c: In function 'hash_netiface4_uadt':
/tmp/B.ffb7Nk/BUILD/ipset-7.6/kernel/net/netfilter/ipset/ip_set_hash_netiface.c:229:2: error: implicit declaration of function 'nla_strlcpy'; did you mean 'nla_strscpy'? [-Werror=implicit-function-declaration]
  229 |  nla_strlcpy(e.iface, tb[IPSET_ATTR_IFACE], IFNAMSIZ);
      |  ^~~~~~~~~~~
      |  nla_strscpy
In file included from /tmp/B.ffb7Nk/BUILD/ipset-7.6/kernel/net/netfilter/ipset/ip_set_hash_netiface.c:7:
/tmp/B.ffb7Nk/BUILD/ipset-7.6/kernel/net/netfilter/../../include/linux/jhash.h: In function 'jhash2':
/tmp/B.ffb7Nk/BUILD/ipset-7.6/kernel/net/netfilter/../../include/linux/jhash.h:136:12: warning: this statement may fall through [-Wimplicit-fallthrough=]
  136 |  case 3: c += k[2];
      |          ~~^~~~~~~
/tmp/B.ffb7Nk/BUILD/ipset-7.6/kernel/net/netfilter/../../include/linux/jhash.h:137:2: note: here
  137 |  case 2: b += k[1];
      |  ^~~~
/tmp/B.ffb7Nk/BUILD/ipset-7.6/kernel/net/netfilter/../../include/linux/jhash.h:137:12: warning: this statement may fall through [-Wimplicit-fallthrough=]
  137 |  case 2: b += k[1];
      |          ~~^~~~~~~
/tmp/B.ffb7Nk/BUILD/ipset-7.6/kernel/net/netfilter/../../include/linux/jhash.h:138:2: note: here
  138 |  case 1: a += k[0];
      |  ^~~~
cc1: some warnings being treated as errors
make[2]: *** [scripts/Makefile.build:279: /tmp/B.ffb7Nk/BUILD/ipset-7.6/kernel/net/netfilter/ipset/ip_set_hash_netiface.o] Error 1
make[2]: *** Waiting for unfinished jobs....
  CC [M]  /tmp/B.ffb7Nk/BUILD/ipset-7.6/kernel/net/netfilter/ipset/ip_set_list_set.o
  CC [M]  /tmp/B.ffb7Nk/BUILD/ipset-7.6/kernel/net/netfilter/ipset/ip_set_hash_mac.o
In file included from /tmp/B.ffb7Nk/BUILD/ipset-7.6/kernel/net/netfilter/ipset/ip_set_hash_mac.c:7:
/tmp/B.ffb7Nk/BUILD/ipset-7.6/kernel/net/netfilter/../../include/linux/jhash.h: In function 'jhash2':
/tmp/B.ffb7Nk/BUILD/ipset-7.6/kernel/net/netfilter/../../include/linux/jhash.h:136:12: warning: this statement may fall through [-Wimplicit-fallthrough=]
  136 |  case 3: c += k[2];
      |          ~~^~~~~~~
/tmp/B.ffb7Nk/BUILD/ipset-7.6/kernel/net/netfilter/../../include/linux/jhash.h:137:2: note: here
  137 |  case 2: b += k[1];
      |  ^~~~
/tmp/B.ffb7Nk/BUILD/ipset-7.6/kernel/net/netfilter/../../include/linux/jhash.h:137:12: warning: this statement may fall through [-Wimplicit-fallthrough=]
  137 |  case 2: b += k[1];
      |          ~~^~~~~~~
/tmp/B.ffb7Nk/BUILD/ipset-7.6/kernel/net/netfilter/../../include/linux/jhash.h:138:2: note: here
  138 |  case 1: a += k[0];
      |  ^~~~
  CC [M]  /tmp/B.ffb7Nk/BUILD/ipset-7.6/kernel/net/netfilter/ipset/ip_set_hash_netnet.o
In file included from /tmp/B.ffb7Nk/BUILD/ipset-7.6/kernel/net/netfilter/ipset/ip_set_hash_netnet.c:8:
/tmp/B.ffb7Nk/BUILD/ipset-7.6/kernel/net/netfilter/../../include/linux/jhash.h: In function 'jhash2':
/tmp/B.ffb7Nk/BUILD/ipset-7.6/kernel/net/netfilter/../../include/linux/jhash.h:136:12: warning: this statement may fall through [-Wimplicit-fallthrough=]
  136 |  case 3: c += k[2];
      |          ~~^~~~~~~
/tmp/B.ffb7Nk/BUILD/ipset-7.6/kernel/net/netfilter/../../include/linux/jhash.h:137:2: note: here
  137 |  case 2: b += k[1];
      |  ^~~~
/tmp/B.ffb7Nk/BUILD/ipset-7.6/kernel/net/netfilter/../../include/linux/jhash.h:137:12: warning: this statement may fall through [-Wimplicit-fallthrough=]
  137 |  case 2: b += k[1];
      |          ~~^~~~~~~
/tmp/B.ffb7Nk/BUILD/ipset-7.6/kernel/net/netfilter/../../include/linux/jhash.h:138:2: note: here
  138 |  case 1: a += k[0];
      |  ^~~~
  CC [M]  /tmp/B.ffb7Nk/BUILD/ipset-7.6/kernel/net/netfilter/ipset/ip_set_hash_netportnet.o
In file included from /tmp/B.ffb7Nk/BUILD/ipset-7.6/kernel/net/netfilter/ipset/ip_set_hash_netportnet.c:7:
/tmp/B.ffb7Nk/BUILD/ipset-7.6/kernel/net/netfilter/../../include/linux/jhash.h: In function 'jhash2':
/tmp/B.ffb7Nk/BUILD/ipset-7.6/kernel/net/netfilter/../../include/linux/jhash.h:136:12: warning: this statement may fall through [-Wimplicit-fallthrough=]
  136 |  case 3: c += k[2];
      |          ~~^~~~~~~
/tmp/B.ffb7Nk/BUILD/ipset-7.6/kernel/net/netfilter/../../include/linux/jhash.h:137:2: note: here
  137 |  case 2: b += k[1];
      |  ^~~~
/tmp/B.ffb7Nk/BUILD/ipset-7.6/kernel/net/netfilter/../../include/linux/jhash.h:137:12: warning: this statement may fall through [-Wimplicit-fallthrough=]
  137 |  case 2: b += k[1];
      |          ~~^~~~~~~
/tmp/B.ffb7Nk/BUILD/ipset-7.6/kernel/net/netfilter/../../include/linux/jhash.h:138:2: note: here
  138 |  case 1: a += k[0];
      |  ^~~~
make[1]: *** [scripts/Makefile.build:496: /tmp/B.ffb7Nk/BUILD/ipset-7.6/kernel/net/netfilter/ipset] Error 2
make: *** [Makefile:1800: /tmp/B.ffb7Nk/BUILD/ipset-7.6/kernel/net/netfilter] Error 2
error: Bad exit status from /tmp/B.ffb7Nk/BUILD/tmp/rpm-tmp.pYuQB7 (%build)


RPM build errors:
    Could not canonicalize hostname: nereid
    Bad exit status from /tmp/B.ffb7Nk/BUILD/tmp/rpm-tmp.pYuQB7 (%build)
ended at: Tue Feb 23 13:06:40 2021, done in 0:00:53.834516
error: No files produced.
+ chmod -R u+rwX /tmp/B.ffb7Nk/BUILD
+ rm -rf /tmp/B.ffb7Nk/tmp /tmp/B.ffb7Nk/BUILD
+ rm -rf /tmp/B.ffb7Nk
Begin-PLD-Builder-Info
Build-Time: user:154.04s sys:28.34s real:74.21s (faults io:43 non-io:6249995)

End-PLD-Builder-Info
[Back to list of logs] [View rpm -qa of builder]