FailedOk

th/SRPMS[OK]
th/x32[OK]
th/i686[OK]
th/x86_64[OK]

ac/SRPMS[OK]
ac/i386[OK]
ac/i586[OK]
ac/i686[OK]
ac/alpha[OK]
ac/amd64[OK]
ac/athlon[OK]
ac/ppc[OK]
ac/sparc[OK]
ac/sparc64[OK]

Advanced Search
main()
Powered by PLD Linux
(c) 2002-2018 PLD Team
$Revision: 1.37 $
Powered by php.
Your IP: 54.80.198.173

isdn4k-utils 96bc6632-91d7-466b-b083-e3065712fd7a

Status:Failed
Source URL:ftp://buildlogs.pld-linux.org/th/i686/FAIL/isdn4k-utils,96bc6632-91d7-466b-b083-e3065712fd7a.bz2
text/plain URL:View!
full text:View!
rpm -qa of builder:View!
Date:2018/03/07 10:51:19
Runtime:0:01:20.794181

Toc:

  • error 1
  • make[1]: *** [Makefile:179: dest.cdb] Error 2
  • error 2
  • error: Bad exit status from /tmp/B.iT72eq/BUILD/tmp/rpm-tmp.77657 (%build)
  • error 3
  • RPM build errors:
  • error 4
  • error: No files produced.

Content:

  value.dptr = val;
             ^
mkzonedb.c:272:17: warning: pointer targets in passing argument 1 of 'tools_pack16' differ in signedness [-Wpointer-sign]
    tools_pack16(val, count);
                 ^~~
In file included from mkzonedb.c:64:0:
upack.h:6:6: note: expected 'unsigned char *' but argument is of type 'char *'
 void tools_pack16(unsigned char *buf, US num);
      ^~~~~~~~~~~~
mkzonedb.c:273:15: warning: pointer targets in assignment differ in signedness [-Wpointer-sign]
    value.dptr = val;
               ^
mkzonedb.c:318:18: warning: pointer targets in passing argument 1 of 'tools_pack16' differ in signedness [-Wpointer-sign]
     tools_pack16(&val[vlen], us);
                  ^
In file included from mkzonedb.c:64:0:
upack.h:6:6: note: expected 'unsigned char *' but argument is of type 'char *'
 void tools_pack16(unsigned char *buf, US num);
      ^~~~~~~~~~~~
mkzonedb.c:323:18: warning: pointer targets in passing argument 1 of 'tools_pack32' differ in signedness [-Wpointer-sign]
     tools_pack32(&val[vlen], ul);
                  ^
In file included from mkzonedb.c:64:0:
upack.h:4:6: note: expected 'unsigned char *' but argument is of type 'char *'
 void tools_pack32(unsigned char *buf, UL num);
      ^~~~~~~~~~~~
mkzonedb.c:332:15: warning: pointer targets in passing argument 1 of 'tools_pack16' differ in signedness [-Wpointer-sign]
  tools_pack16(val, count);
               ^~~
In file included from mkzonedb.c:64:0:
upack.h:6:6: note: expected 'unsigned char *' but argument is of type 'char *'
 void tools_pack16(unsigned char *buf, US num);
      ^~~~~~~~~~~~
mkzonedb.c:334:13: warning: pointer targets in assignment differ in signedness [-Wpointer-sign]
  value.dptr = val;
             ^
i686-pld-linux-gcc -Wall -g   -c -o upack.o upack.c
In file included from upack.c:2:0:
common.h:6:14: warning: 'dbv' defined but not used [-Wunused-variable]
  static char dbv[]="CDB"; /* don't change */
              ^~~
i686-pld-linux-gcc -Wall -g mkzonedb.o upack.o ../cdb/i4l_cdb.a  -o mkzonedb
/usr/bin/make DE
make[2]: Entering directory '/tmp/B.iT72eq/BUILD/isdn4k-utils/isdnlog/tools/zone'
if [ ! -e ../../zone-de-dtag.cdb ] ; then \
bzip2 -dc de/01033/zred.dtag.bz2 | ./mkzonedb -d ../../zone-de-dtag.cdb -r - -v; \
fi
Reading -
157147
Sorting
Writing
157147
make[2]: Leaving directory '/tmp/B.iT72eq/BUILD/isdn4k-utils/isdnlog/tools/zone'
make[1]: Leaving directory '/tmp/B.iT72eq/BUILD/isdn4k-utils/isdnlog/tools/zone'
make[1]: Entering directory '/tmp/B.iT72eq/BUILD/isdn4k-utils/isdnlog/tools/dest'
i686-pld-linux-gcc -DSTANDALONE -DDESTTEST  -Wall -g ../dest.c ../cdb/i4l_cdb.a  -o dest
../dest.c: In function 'initDest':
../dest.c:171:12: warning: pointer targets in assignment differ in signedness [-Wpointer-sign]
   key.dptr = vinfo;
            ^
../dest.c: In function 'getDest':
../dest.c:264:12: warning: pointer targets in assignment differ in signedness [-Wpointer-sign]
   key.dptr = number;
            ^
../dest.c:279:18: warning: pointer targets in passing argument 1 of 'isKey' differ in signedness [-Wpointer-sign]
       if (!isKey(value.dptr + 1)) {
                  ^~~~~
../dest.c:203:13: note: expected 'const char *' but argument is of type 'unsigned char *'
 static bool isKey(const char *p)
             ^~~~~
../dest.c:280:16: warning: pointer targets in passing argument 1 of 'strdup' differ in signedness [-Wpointer-sign]
  city = strdup(value.dptr + 1);
                ^~~~~
In file included from ../dest.c:37:0:
/usr/include/string.h:166:14: note: expected 'const char *' but argument is of type 'unsigned char *'
 extern char *strdup (const char *__s)
              ^~~~~~
../dest.c:286:20: warning: pointer targets in passing argument 2 of 'append' differ in signedness [-Wpointer-sign]
  append(num->keys, value.dptr + 1);
                    ^~~~~
../dest.c:192:13: note: expected 'char *' but argument is of type 'unsigned char *'
 static void append(char *dest, char *what)
             ^~~~~~
../dest.c:287:21: warning: pointer targets in passing argument 2 of 'Strncpy' differ in signedness [-Wpointer-sign]
         Strncpy(tld,value.dptr+1,TN_MAX_TLD_LEN);
                     ^~~~~
../dest.c:64:9: note: expected 'const char *' but argument is of type 'unsigned char *'
 char   *Strncpy(char *dest, const char *src, int len);
         ^~~~~~~
../dest.c:308:7: warning: pointer targets in assignment differ in signedness [-Wpointer-sign]
     s = value.dptr;
       ^
../dest.c:386:16: warning: pointer targets in assignment differ in signedness [-Wpointer-sign]
       key.dptr = p + 1;
                ^
Building destination database dest.cdb ...
./makedest -v 
Can't locate wld.pm in @INC (you may need to install the wld module) (@INC contains: /usr/local/lib/perl5/5.26.0/i686-pld-linux-thread-multi /usr/local/share/perl5 /usr/lib/perl5/vendor_perl/5.26.0/i686-pld-linux-thread-multi /usr/share/perl5/vendor_perl /usr/lib/perl5/5.26.1/i686-pld-linux-thread-multi /usr/share/perl5/5.26.1) at ./makedest line 33.
BEGIN failed--compilation aborted at ./makedest line 33.
make[1]: *** [Makefile:179: dest.cdb] Error 2
make[1]: Leaving directory '/tmp/B.iT72eq/BUILD/isdn4k-utils/isdnlog/tools/dest'
make: *** [Makefile:121: subtargets] Error 2
error: Bad exit status from /tmp/B.iT72eq/BUILD/tmp/rpm-tmp.77657 (%build)


RPM build errors:
    Bad exit status from /tmp/B.iT72eq/BUILD/tmp/rpm-tmp.77657 (%build)
ended at: Wed Mar  7 10:51:19 2018, done in 0:01:20.794181
error: No files produced.
+ chmod -R u+rwX /tmp/B.iT72eq/BUILD
+ rm -rf /tmp/B.iT72eq/tmp /tmp/B.iT72eq/BUILD
+ rm -rf /tmp/B.iT72eq
Begin-PLD-Builder-Info
Build-Time: user:29.79s sys:5.45s real:87.75s (faults io:0 non-io:3097825)

End-PLD-Builder-Info
[Back to list of logs] [View rpm -qa of builder]