FailedOk

th/SRPMS[OK]
th/x32[OK]
th/i686[OK]
th/x86_64[OK]

ac/SRPMS[OK]
ac/i386[OK]
ac/i586[OK]
ac/i686[OK]
ac/alpha[OK]
ac/amd64[OK]
ac/athlon[OK]
ac/ppc[OK]
ac/sparc[OK]
ac/sparc64[OK]

Advanced Search
main()
Powered by PLD Linux
(c) 2002-2020 PLD Team
$Revision: 1.37 $
Powered by Dark Side of the Force.
Your IP: 3.236.11.52

kde4-kdesdk-kioslaves b455f37a-f77c-4cf4-bfbc-4076921da604

Status:Failed
Source URL:https://buildlogs.pld-linux.org/pld/th/i686/FAIL/kde4-kdesdk-kioslaves,b455f37a-f77c-4cf4-bfbc-4076921da604.bz2
text/plain URL:View!
full text:View!
rpm -qa of builder:View!
Date:2020/06/02 09:42:51
Runtime:0:00:07.718512

Toc:

  • error 1
  • rpm: error: Failed build dependencies:
  • error 2
  • rpm: error: Failed build dependencies:
  • prep
  • Executing(%prep): /bin/sh -e /tmp/B.RqkkiH/BUILD/tmp/rpm-tmp.15794
  • build
  • Executing(%build): /bin/sh -e /tmp/B.RqkkiH/BUILD/tmp/rpm-tmp.15794
  • error 3
  • /tmp/B.RqkkiH/BUILD/kdesdk-kioslaves-4.14.3/svn/svn.cpp:112:49: error: invalid use of incomplete type 'const svn_sort__item_t' {aka 'const struct svn_sort__item_t'}
  • error 4
  • /tmp/B.RqkkiH/BUILD/kdesdk-kioslaves-4.14.3/svn/svn.cpp:112:71: error: invalid use of incomplete type 'const svn_sort__item_t' {aka 'const struct svn_sort__item_t'}
  • error 5
  • /tmp/B.RqkkiH/BUILD/kdesdk-kioslaves-4.14.3/svn/svn.cpp:553:11: error: 'svn_sort__hash' was not declared in this scope; did you mean 'svn_sort__item_t'?
  • error 6
  • /tmp/B.RqkkiH/BUILD/kdesdk-kioslaves-4.14.3/svn/svn.cpp:562:12: error: invalid use of incomplete type 'struct svn_sort__item_t'
  • error 7
  • /tmp/B.RqkkiH/BUILD/kdesdk-kioslaves-4.14.3/svn/svn.cpp:564:38: error: invalid use of incomplete type 'svn_sort__item_t' {aka 'struct svn_sort__item_t'}
  • error 8
  • /tmp/B.RqkkiH/BUILD/kdesdk-kioslaves-4.14.3/svn/svn.cpp:566:71: error: invalid use of incomplete type 'svn_sort__item_t' {aka 'struct svn_sort__item_t'}
  • error 9
  • make[2]: *** [svn/CMakeFiles/kio_svn.dir/build.make:110: svn/CMakeFiles/kio_svn.dir/svn.cpp.o] Error 1
  • error 10
  • make[1]: *** [CMakeFiles/Makefile2:232: svn/CMakeFiles/kio_svn.dir/all] Error 2
  • error 11
  • error: Bad exit status from /tmp/B.RqkkiH/BUILD/tmp/rpm-tmp.15794 (%build)
  • error 12
  • RPM build errors:
  • error 13
  • error: No files produced.

Content:

checking if we should skip the build
started at: Tue Jun  2 09:42:31 2020
killing old processes on a builder
sending signal 9 to pid -1
Killed
cleaning up /tmp
fetching https://srcbuilder.pld-linux.org/th//srpms/b455f37a-f77c-4cf4-bfbc-4076921da604/kde4-kdesdk-kioslaves-4.14.3-2.src.rpm
fetched 373633 bytes, 919.9 K/s
installing srpm: kde4-kdesdk-kioslaves-4.14.3-2.src.rpm
+ install -d /tmp/B.RqkkiH/BUILD /tmp/B.RqkkiH/RPMS
+ LC_ALL=en_US.UTF-8
+ rpm -qp --changelog kde4-kdesdk-kioslaves-4.14.3-2.src.rpm
* Tue Jun 02 2020 PLD Linux Team <feedback@pld-linux.org>
- For complete changelog see: http://git.pld-linux.org/?p=packages/kde4-kdesdk-kioslaves.git;a=log;h=master
* Wed Oct 02 2019 Jan Rękorajski <baggins@pld-linux.org> 734f7c9
- rebuild for g++ ABI changes - release 2 (by relup.sh) + rpm -Uhv --nodeps --define '_topdir /tmp/B.RqkkiH' --define '_specdir %{_topdir}' --define '_sourcedir %{_specdir}' --define '_rpmdir %{_topdir}/RPMS' --define '_builddir %{_topdir}/BUILD' kde4-kdesdk-kioslaves-4.14.3-2.src.rpm Preparing... ################################################## kde4-kdesdk-kioslaves ################################################## + rm -f kde4-kdesdk-kioslaves-4.14.3-2.src.rpm + install -m 700 -d /tmp/B.RqkkiH/BUILD/tmp + TMPDIR=/tmp/B.RqkkiH/BUILD/tmp + exec nice -n 0 rpmbuild -bp --short-circuit --nodeps --define '_topdir /tmp/B.RqkkiH' --define '_specdir %{_topdir}' --define '_sourcedir %{_specdir}' --define '_rpmdir %{_topdir}/RPMS' --define '_builddir %{_topdir}/BUILD' --target i686-pld-linux --define 'prep exit 0' /tmp/B.RqkkiH/kde4-kdesdk-kioslaves.spec Building target platforms: i686-pld-linux checking BuildConflict-ing packages no BuildConflicts found checking BR rpm: error: Failed build dependencies: rpm: subversion-devel is needed by kde4-kdesdk-kioslaves-4.14.3-2.src rpm: Building target platforms: i686-pld-linux updating poldek cache... ready is up to date th is up to date th is up to date th-ready is up to date th-ready is up to date th-test is up to date th-test is up to date checking conflicting packages in BRed packages poldek: Loading [pndir]ready... poldek: Loading [pndir]th-test... poldek: Loading [pndir]th-test... poldek: Loading [pndir]th-ready... poldek: Loading [pndir]th-ready... poldek: Loading [pndir]th... poldek: Loading [pndir]th... poldek: 31627 packages read poldek: Removed 3185 duplicate packages from available set poldek: Processing dependencies... poldek: There are 1 package to install: poldek: A subversion-devel-1.14.0-1.i686 poldek: This operation will use 1.8MB of disk space. poldek: Need to get 291.1KB of archives. poldek: Executing pm-command.sh --upgrade -vh --test --root / --define _check_dirname_deps 1... poldek: Preparing... ################################################## no conflicts found checking BR rpm: error: Failed build dependencies: rpm: subversion-devel is needed by kde4-kdesdk-kioslaves-4.14.3-2.src rpm: Building target platforms: i686-pld-linux installing BR: subversion\-devel + poldek --noask --caplookup -Q -v '--ignore=hhvm-*' '--ignore=php4-*' '--ignore=php52-*' '--ignore=php54-*' '--ignore=php55-*' '--ignore=php56-*' '--ignore=php70-*' '--ignore=php71-*' '--ignore=php72-*' '--ignore=php73-*' '--ignore=php74-*' --upgrade subversion-devel Loading [pndir]ready... Loading [pndir]th-test... Loading [pndir]th-test... Loading [pndir]th-ready... Loading [pndir]th-ready... Loading [pndir]th... Loading [pndir]th... 31627 packages read Removed 3185 duplicate packages from available set Processing dependencies... There are 1 package to install: A subversion-devel-1.14.0-1.i686 This operation will use 1.8MB of disk space. Need to get 291.1KB of archives. Executing pm-command.sh --upgrade -vh --root / --define _check_dirname_deps 1... Preparing... ################################################## subversion-devel ################################################## building RPM using: set -ex; : build-id: b455f37a-f77c-4cf4-bfbc-4076921da604; TMPDIR=/tmp/B.RqkkiH/BUILD/tmp exec nice -n 0 rpmbuild -bb --define '_smp_mflags -j9' --define '_make_opts -Otarget' --define '_pld_builder 1' --define '_topdir /tmp/B.RqkkiH' --define '_specdir %{_topdir}' --define '_sourcedir %{_specdir}' --define '_rpmdir %{_topdir}/RPMS' --define '_builddir %{_topdir}/BUILD' --target i686-pld-linux /tmp/B.RqkkiH/kde4-kdesdk-kioslaves.spec + : build-id: b455f37a-f77c-4cf4-bfbc-4076921da604 + TMPDIR=/tmp/B.RqkkiH/BUILD/tmp + exec nice -n 0 rpmbuild -bb --define '_smp_mflags -j9' --define '_make_opts -Otarget' --define '_pld_builder 1' --define '_topdir /tmp/B.RqkkiH' --define '_specdir %{_topdir}' --define '_sourcedir %{_specdir}' --define '_rpmdir %{_topdir}/RPMS' --define '_builddir %{_topdir}/BUILD' --target i686-pld-linux /tmp/B.RqkkiH/kde4-kdesdk-kioslaves.spec Building target platforms: i686-pld-linux Executing(%prep): /bin/sh -e /tmp/B.RqkkiH/BUILD/tmp/rpm-tmp.15794 + umask 022 + cd /tmp/B.RqkkiH/BUILD + cd /tmp/B.RqkkiH/BUILD + rm -rf kdesdk-kioslaves-4.14.3 + /usr/bin/xz -dc /tmp/B.RqkkiH/kdesdk-kioslaves-4.14.3.tar.xz + /bin/tar -xf - + STATUS=0 + '[' 0 -ne 0 ']' + cd kdesdk-kioslaves-4.14.3 + /bin/id -u + '[' 1001 '=' 0 ']' + /bin/id -u + '[' 1001 '=' 0 ']' + /bin/chmod -Rf a+rX,u+w,g-w,o-w . + exit 0 Executing(%build): /bin/sh -e /tmp/B.RqkkiH/BUILD/tmp/rpm-tmp.15794 TMP=/home/users/builder/tmp HOME=/home/users/builder PATH=/home/users/builder/GNUstep/Tools:/bin:/usr/bin:/usr/local/bin:/home/users/builder/bin TMPDIR=/tmp/B.RqkkiH/BUILD/tmp + umask 022 + cd /tmp/B.RqkkiH/BUILD + cd kdesdk-kioslaves-4.14.3 + install -d build + cd build + CC=i686-pld-linux-gcc CXX=i686-pld-linux-g++ CPPFLAGS='' /usr/bin/cmake -Wno-dev '-DCMAKE_VERBOSE_MAKEFILE=ON' '-DCMAKE_BUILD_TYPE=PLD' '-DCMAKE_INSTALL_BINDIR:PATH=/usr/bin' '-DCMAKE_INSTALL_SBINDIR:PATH=/usr/sbin' '-DCMAKE_INSTALL_LIBEXECDIR:PATH=/usr/libexec' '-DCMAKE_INSTALL_SYSCONFDIR:PATH=/etc' '-DCMAKE_INSTALL_SHAREDSTATEDIRPATH:PATH=/var/lib' '-DCMAKE_INSTALL_LOCALSTATEDIRPATH:PATH=/var' '-DCMAKE_INSTALL_LIBDIR:PATH=/usr/lib' '-DCMAKE_INSTALL_INCLUDEDIR:PATH=/usr/include' '-DCMAKE_INSTALL_OLDINCLUDEDIR:PATH=/usr/include' '-DCMAKE_INSTALL_DATAROOTDIR:PATH=/usr/share' '-DCMAKE_INSTALL_DATADIR:PATH=/usr/share' '-DCMAKE_INSTALL_INFODIR:PATH=/usr/share/info' '-DCMAKE_INSTALL_LOCALEDIR:PATH=/usr/share/locale' '-DCMAKE_INSTALL_MANDIR:PATH=/usr/share/man' '-DCMAKE_INSTALL_DOCDIR:PATH=/usr/share/doc' '-DCMAKE_INSTALL_PREFIX:PATH=/usr' '-DSYSCONF_INSTALL_DIR:PATH=/etc' '-DCMAKE_CXX_FLAGS_PLD=-O2 -fwrapv -pipe -Wformat -Werror=format-security -gdwarf-4 -fno-debug-types-section -fvar-tracking-assignments -g2 -Wp,-D_FORTIFY_SOURCE=2 -fstack-protector-strong --param=ssp-buffer-size=4 -Werror=trampolines -fomit-frame-pointer -march=i686 -fasynchronous-unwind-tables -mtune=pentium4 -gdwarf-4 -fno-debug-types-section -fvar-tracking-assignments -g2 -DNDEBUG -DQT_NO_DEBUG' '-DCMAKE_C_FLAGS_PLD=-O2 -fwrapv -pipe -Wformat -Werror=format-security -gdwarf-4 -fno-debug-types-section -fvar-tracking-assignments -g2 -Wp,-D_FORTIFY_SOURCE=2 -fstack-protector-strong --param=ssp-buffer-size=4 -Werror=trampolines -fomit-frame-pointer -march=i686 -fasynchronous-unwind-tables -mtune=pentium4 -gdwarf-4 -fno-debug-types-section -fvar-tracking-assignments -g2 -DNDEBUG -DQT_NO_DEBUG' '-DCMAKE_Fortran_FLAGS_PLD=-O2 -fwrapv -pipe -Wformat -Werror=format-security -gdwarf-4 -fno-debug-types-section -fvar-tracking-assignments -g2 -Wp,-D_FORTIFY_SOURCE=2 -fstack-protector-strong --param=ssp-buffer-size=4 -Werror=trampolines -fomit-frame-pointer -march=i686 -fasynchronous-unwind-tables -mtune=pentium4 -gdwarf-4 -fno-debug-types-section -fvar-tracking-assignments -g2 -DNDEBUG -DQT_NO_DEBUG' '-DCMAKE_EXE_LINKER_FLAGS_PLD=-Wl,--as-needed -Wl,--no-copy-dt-needed-entries -Wl,-z,relro -Wl,-z,combreloc ' '-DCMAKE_SHARED_LINKER_FLAGS_PLD=-Wl,--as-needed -Wl,--no-copy-dt-needed-entries -Wl,-z,relro -Wl,-z,combreloc ' '-DCMAKE_MODULE_LINKER_FLAGS_PLD=-Wl,--as-needed -Wl,--no-copy-dt-needed-entries -Wl,-z,relro -Wl,-z,combreloc ' '-DBUILD_SHARED_LIBS:BOOL=ON' ../ -- The C compiler identification is GNU 10.1.0 -- The CXX compiler identification is GNU 10.1.0 -- Check for working C compiler: /usr/bin/i686-pld-linux-gcc -- Check for working C compiler: /usr/bin/i686-pld-linux-gcc - works -- Detecting C compiler ABI info -- Detecting C compiler ABI info - done -- Detecting C compile features -- Detecting C compile features - done -- Check for working CXX compiler: /usr/bin/i686-pld-linux-g++ -- Check for working CXX compiler: /usr/bin/i686-pld-linux-g++ - works -- Detecting CXX compiler ABI info -- Detecting CXX compiler ABI info - done -- Detecting CXX compile features -- Detecting CXX compile features - done -- Looking for Q_WS_X11 -- Looking for Q_WS_X11 - found -- Looking for Q_WS_WIN -- Looking for Q_WS_WIN - not found -- Looking for Q_WS_QWS -- Looking for Q_WS_QWS - not found -- Looking for Q_WS_MAC -- Looking for Q_WS_MAC - not found -- Found Qt-Version 4.8.7 (using /usr/bin/qmake-qt4) -- Looking for XOpenDisplay in /usr/lib/libX11.so;/usr/lib/libXext.so;/usr/lib/libXft.so;/usr/lib/libXau.so;/usr/lib/libXdmcp.so;/usr/lib/libXpm.so -- Looking for XOpenDisplay in /usr/lib/libX11.so;/usr/lib/libXext.so;/usr/lib/libXft.so;/usr/lib/libXau.so;/usr/lib/libXdmcp.so;/usr/lib/libXpm.so - found -- Looking for gethostbyname -- Looking for gethostbyname - found -- Looking for connect -- Looking for connect - found -- Looking for remove -- Looking for remove - found -- Looking for shmat -- Looking for shmat - found -- Looking for IceConnectionNumber in ICE -- Looking for IceConnectionNumber in ICE - found -- Found X11: /usr/lib/libX11.so -- Looking for pthread.h -- Looking for pthread.h - found -- Performing Test CMAKE_HAVE_LIBC_PTHREAD -- Performing Test CMAKE_HAVE_LIBC_PTHREAD - Failed -- Looking for pthread_create in pthreads -- Looking for pthread_create in pthreads - not found -- Looking for pthread_create in pthread -- Looking for pthread_create in pthread - found -- Found Threads: TRUE -- Found OpenSSL: /usr/lib/libcrypto.so (found version "1.1.1g") -- Looking for _POSIX_TIMERS -- Looking for _POSIX_TIMERS - found -- Found Automoc4: /usr/bin/automoc4 -- Found Perl: /usr/bin/perl (found version "5.30.2") -- Found Phonon: /usr/include (Required is at least version "4.3.80") -- Performing Test _OFFT_IS_64BIT -- Performing Test _OFFT_IS_64BIT - Failed -- Performing Test HAVE_FPIE_SUPPORT -- Performing Test HAVE_FPIE_SUPPORT - Success -- Performing Test __KDE_HAVE_W_OVERLOADED_VIRTUAL -- Performing Test __KDE_HAVE_W_OVERLOADED_VIRTUAL - Success -- Performing Test __KDE_HAVE_GCC_VISIBILITY -- Performing Test __KDE_HAVE_GCC_VISIBILITY - Success -- Found KDE 4.12 include dir: /usr/include -- Found KDE 4.12 library dir: /usr/lib -- Found the KDE4 kconfig_compiler preprocessor: /usr/bin/kconfig_compiler -- Found automoc4: /usr/bin/automoc4 -- Found svn lib: /usr/lib/libsvn_client-1.so;/usr/lib/libsvn_subr-1.so;/usr/lib/libsvn_ra-1.so;/usr/lib/libsvn_fs-1.so;/usr/lib/libsvn_delta-1.so;/usr/lib/libapr-1.so -- Found Perl: /usr/bin/perl (found suitable version "5.30.2", minimum required is "5.10") -- Configuring done -- Generating done CMake Warning: Manually-specified variables were not used by the project: CMAKE_Fortran_FLAGS_PLD CMAKE_INSTALL_BINDIR CMAKE_INSTALL_DATADIR CMAKE_INSTALL_DATAROOTDIR CMAKE_INSTALL_DOCDIR CMAKE_INSTALL_INCLUDEDIR CMAKE_INSTALL_INFODIR CMAKE_INSTALL_LIBDIR CMAKE_INSTALL_LIBEXECDIR CMAKE_INSTALL_LOCALEDIR CMAKE_INSTALL_LOCALSTATEDIRPATH CMAKE_INSTALL_MANDIR CMAKE_INSTALL_OLDINCLUDEDIR CMAKE_INSTALL_SBINDIR CMAKE_INSTALL_SHAREDSTATEDIRPATH CMAKE_INSTALL_SYSCONFDIR -- Build files have been written to: /tmp/B.RqkkiH/BUILD/kdesdk-kioslaves-4.14.3/build + /usr/bin/make -Otarget -j9 /usr/bin/cmake -S/tmp/B.RqkkiH/BUILD/kdesdk-kioslaves-4.14.3 -B/tmp/B.RqkkiH/BUILD/kdesdk-kioslaves-4.14.3/build --check-build-system CMakeFiles/Makefile.cmake 0 /usr/bin/cmake -E cmake_progress_start /tmp/B.RqkkiH/BUILD/kdesdk-kioslaves-4.14.3/build/CMakeFiles /tmp/B.RqkkiH/BUILD/kdesdk-kioslaves-4.14.3/build/CMakeFiles/progress.marks /usr/bin/make -f CMakeFiles/Makefile2 all /usr/bin/make -f svn/CMakeFiles/kio_svn_automoc.dir/build.make svn/CMakeFiles/kio_svn_automoc.dir/depend /usr/bin/make -f svn/ksvnd/CMakeFiles/kded_ksvnd_automoc.dir/build.make svn/ksvnd/CMakeFiles/kded_ksvnd_automoc.dir/depend /usr/bin/make -f svn/svnhelper/CMakeFiles/kio_svn_helper_automoc.dir/build.make svn/svnhelper/CMakeFiles/kio_svn_helper_automoc.dir/depend /usr/bin/make -f perldoc/CMakeFiles/kio_perldoc_automoc.dir/build.make perldoc/CMakeFiles/kio_perldoc_automoc.dir/depend make[2]: Entering directory '/tmp/B.RqkkiH/BUILD/kdesdk-kioslaves-4.14.3/build' cd /tmp/B.RqkkiH/BUILD/kdesdk-kioslaves-4.14.3/build && /usr/bin/cmake -E cmake_depends "Unix Makefiles" /tmp/B.RqkkiH/BUILD/kdesdk-kioslaves-4.14.3 /tmp/B.RqkkiH/BUILD/kdesdk-kioslaves-4.14.3/svn/ksvnd /tmp/B.RqkkiH/BUILD/kdesdk-kioslaves-4.14.3/build /tmp/B.RqkkiH/BUILD/kdesdk-kioslaves-4.14.3/build/svn/ksvnd /tmp/B.RqkkiH/BUILD/kdesdk-kioslaves-4.14.3/build/svn/ksvnd/CMakeFiles/kded_ksvnd_automoc.dir/DependInfo.cmake --color= Scanning dependencies of target kded_ksvnd_automoc make[2]: Leaving directory '/tmp/B.RqkkiH/BUILD/kdesdk-kioslaves-4.14.3/build' make[2]: Entering directory '/tmp/B.RqkkiH/BUILD/kdesdk-kioslaves-4.14.3/build' cd /tmp/B.RqkkiH/BUILD/kdesdk-kioslaves-4.14.3/build && /usr/bin/cmake -E cmake_depends "Unix Makefiles" /tmp/B.RqkkiH/BUILD/kdesdk-kioslaves-4.14.3 /tmp/B.RqkkiH/BUILD/kdesdk-kioslaves-4.14.3/svn/svnhelper /tmp/B.RqkkiH/BUILD/kdesdk-kioslaves-4.14.3/build /tmp/B.RqkkiH/BUILD/kdesdk-kioslaves-4.14.3/build/svn/svnhelper /tmp/B.RqkkiH/BUILD/kdesdk-kioslaves-4.14.3/build/svn/svnhelper/CMakeFiles/kio_svn_helper_automoc.dir/DependInfo.cmake --color= Scanning dependencies of target kio_svn_helper_automoc make[2]: Leaving directory '/tmp/B.RqkkiH/BUILD/kdesdk-kioslaves-4.14.3/build' make[2]: Entering directory '/tmp/B.RqkkiH/BUILD/kdesdk-kioslaves-4.14.3/build' cd /tmp/B.RqkkiH/BUILD/kdesdk-kioslaves-4.14.3/build && /usr/bin/cmake -E cmake_depends "Unix Makefiles" /tmp/B.RqkkiH/BUILD/kdesdk-kioslaves-4.14.3 /tmp/B.RqkkiH/BUILD/kdesdk-kioslaves-4.14.3/svn /tmp/B.RqkkiH/BUILD/kdesdk-kioslaves-4.14.3/build /tmp/B.RqkkiH/BUILD/kdesdk-kioslaves-4.14.3/build/svn /tmp/B.RqkkiH/BUILD/kdesdk-kioslaves-4.14.3/build/svn/CMakeFiles/kio_svn_automoc.dir/DependInfo.cmake --color= Scanning dependencies of target kio_svn_automoc make[2]: Leaving directory '/tmp/B.RqkkiH/BUILD/kdesdk-kioslaves-4.14.3/build' /usr/bin/make -f svn/ksvnd/CMakeFiles/kded_ksvnd_automoc.dir/build.make svn/ksvnd/CMakeFiles/kded_ksvnd_automoc.dir/build /usr/bin/make -f svn/svnhelper/CMakeFiles/kio_svn_helper_automoc.dir/build.make svn/svnhelper/CMakeFiles/kio_svn_helper_automoc.dir/build /usr/bin/make -f svn/CMakeFiles/kio_svn_automoc.dir/build.make svn/CMakeFiles/kio_svn_automoc.dir/build make[2]: Entering directory '/tmp/B.RqkkiH/BUILD/kdesdk-kioslaves-4.14.3/build' cd /tmp/B.RqkkiH/BUILD/kdesdk-kioslaves-4.14.3/build && /usr/bin/cmake -E cmake_depends "Unix Makefiles" /tmp/B.RqkkiH/BUILD/kdesdk-kioslaves-4.14.3 /tmp/B.RqkkiH/BUILD/kdesdk-kioslaves-4.14.3/perldoc /tmp/B.RqkkiH/BUILD/kdesdk-kioslaves-4.14.3/build /tmp/B.RqkkiH/BUILD/kdesdk-kioslaves-4.14.3/build/perldoc /tmp/B.RqkkiH/BUILD/kdesdk-kioslaves-4.14.3/build/perldoc/CMakeFiles/kio_perldoc_automoc.dir/DependInfo.cmake --color= Scanning dependencies of target kio_perldoc_automoc make[2]: Leaving directory '/tmp/B.RqkkiH/BUILD/kdesdk-kioslaves-4.14.3/build' /usr/bin/make -f perldoc/CMakeFiles/kio_perldoc_automoc.dir/build.make perldoc/CMakeFiles/kio_perldoc_automoc.dir/build make[2]: Entering directory '/tmp/B.RqkkiH/BUILD/kdesdk-kioslaves-4.14.3/build' cd /tmp/B.RqkkiH/BUILD/kdesdk-kioslaves-4.14.3/build/perldoc && /usr/bin/automoc4 /tmp/B.RqkkiH/BUILD/kdesdk-kioslaves-4.14.3/build/perldoc/kio_perldoc_automoc.cpp /tmp/B.RqkkiH/BUILD/kdesdk-kioslaves-4.14.3/perldoc /tmp/B.RqkkiH/BUILD/kdesdk-kioslaves-4.14.3/build/perldoc /usr/lib/qt4/bin/moc /usr/bin/cmake make[2]: Leaving directory '/tmp/B.RqkkiH/BUILD/kdesdk-kioslaves-4.14.3/build' make[2]: Entering directory '/tmp/B.RqkkiH/BUILD/kdesdk-kioslaves-4.14.3/build' cd /tmp/B.RqkkiH/BUILD/kdesdk-kioslaves-4.14.3/build/svn && /usr/bin/automoc4 /tmp/B.RqkkiH/BUILD/kdesdk-kioslaves-4.14.3/build/svn/kio_svn_automoc.cpp /tmp/B.RqkkiH/BUILD/kdesdk-kioslaves-4.14.3/svn /tmp/B.RqkkiH/BUILD/kdesdk-kioslaves-4.14.3/build/svn /usr/lib/qt4/bin/moc /usr/bin/cmake make[2]: Leaving directory '/tmp/B.RqkkiH/BUILD/kdesdk-kioslaves-4.14.3/build' make[1]: Entering directory '/tmp/B.RqkkiH/BUILD/kdesdk-kioslaves-4.14.3/build' [ 0%] Built target kio_perldoc_automoc make[1]: Leaving directory '/tmp/B.RqkkiH/BUILD/kdesdk-kioslaves-4.14.3/build' /usr/bin/make -f perldoc/CMakeFiles/kio_perldoc.dir/build.make perldoc/CMakeFiles/kio_perldoc.dir/depend make[1]: Entering directory '/tmp/B.RqkkiH/BUILD/kdesdk-kioslaves-4.14.3/build' [ 0%] Built target kio_svn_automoc make[1]: Leaving directory '/tmp/B.RqkkiH/BUILD/kdesdk-kioslaves-4.14.3/build' /usr/bin/make -f svn/CMakeFiles/kio_svn.dir/build.make svn/CMakeFiles/kio_svn.dir/depend make[2]: Entering directory '/tmp/B.RqkkiH/BUILD/kdesdk-kioslaves-4.14.3/build' [ 4%] Generating ksvndinterface.cpp, ksvndinterface.h cd /tmp/B.RqkkiH/BUILD/kdesdk-kioslaves-4.14.3/build/svn && /usr/lib/qt4/bin/qdbusxml2cpp -m -p ksvndinterface /tmp/B.RqkkiH/BUILD/kdesdk-kioslaves-4.14.3/svn/ksvnd/org.kde.ksvnd.xml make[2]: Leaving directory '/tmp/B.RqkkiH/BUILD/kdesdk-kioslaves-4.14.3/build' make[2]: Entering directory '/tmp/B.RqkkiH/BUILD/kdesdk-kioslaves-4.14.3/build' cd /tmp/B.RqkkiH/BUILD/kdesdk-kioslaves-4.14.3/build && /usr/bin/cmake -E cmake_depends "Unix Makefiles" /tmp/B.RqkkiH/BUILD/kdesdk-kioslaves-4.14.3 /tmp/B.RqkkiH/BUILD/kdesdk-kioslaves-4.14.3/perldoc /tmp/B.RqkkiH/BUILD/kdesdk-kioslaves-4.14.3/build /tmp/B.RqkkiH/BUILD/kdesdk-kioslaves-4.14.3/build/perldoc /tmp/B.RqkkiH/BUILD/kdesdk-kioslaves-4.14.3/build/perldoc/CMakeFiles/kio_perldoc.dir/DependInfo.cmake --color= Scanning dependencies of target kio_perldoc make[2]: Leaving directory '/tmp/B.RqkkiH/BUILD/kdesdk-kioslaves-4.14.3/build' /usr/bin/make -f perldoc/CMakeFiles/kio_perldoc.dir/build.make perldoc/CMakeFiles/kio_perldoc.dir/build make[2]: Entering directory '/tmp/B.RqkkiH/BUILD/kdesdk-kioslaves-4.14.3/build' cd /tmp/B.RqkkiH/BUILD/kdesdk-kioslaves-4.14.3/build/svn/ksvnd && /usr/bin/automoc4 /tmp/B.RqkkiH/BUILD/kdesdk-kioslaves-4.14.3/build/svn/ksvnd/kded_ksvnd_automoc.cpp /tmp/B.RqkkiH/BUILD/kdesdk-kioslaves-4.14.3/svn/ksvnd /tmp/B.RqkkiH/BUILD/kdesdk-kioslaves-4.14.3/build/svn/ksvnd /usr/lib/qt4/bin/moc /usr/bin/cmake Generating ksvnd.moc make[2]: Leaving directory '/tmp/B.RqkkiH/BUILD/kdesdk-kioslaves-4.14.3/build' make[2]: Entering directory '/tmp/B.RqkkiH/BUILD/kdesdk-kioslaves-4.14.3/build' [ 17%] Building CXX object perldoc/CMakeFiles/kio_perldoc.dir/kio_perldoc_automoc.cpp.o cd /tmp/B.RqkkiH/BUILD/kdesdk-kioslaves-4.14.3/build/perldoc && /usr/bin/i686-pld-linux-g++ -DMAKE_KIO_PERLDOC_LIB -D_BSD_SOURCE -D_DEFAULT_SOURCE -I/tmp/B.RqkkiH/BUILD/kdesdk-kioslaves-4.14.3/build/perldoc -I/tmp/B.RqkkiH/BUILD/kdesdk-kioslaves-4.14.3/perldoc -I/tmp/B.RqkkiH/BUILD/kdesdk-kioslaves-4.14.3 -I/tmp/B.RqkkiH/BUILD/kdesdk-kioslaves-4.14.3/build -I/usr/include/KDE -I/usr/include/qt4/phonon -I/usr/include/qt4/QtXmlPatterns -I/usr/include/qt4/QtXml -I/usr/include/qt4/QtWebKit -I/usr/include/qt4/QtUiTools -I/usr/include/qt4/QtTest -I/usr/include/qt4/QtSvg -I/usr/include/qt4/QtSql -I/usr/include/qt4/QtScriptTools -I/usr/include/qt4/QtScript -I/usr/include/qt4/QtOpenGL -I/usr/include/qt4/QtNetwork -I/usr/include/qt4/QtMultimedia -I/usr/include/qt4/QtHelp -I/usr/include/qt4/QtDesigner -I/usr/include/qt4/QtDeclarative -I/usr/include/qt4/QtDBus -I/usr/include/qt4/QtAssistant -I/usr/include/qt4/Qt3Support -I/usr/include/qt4/QtGui -I/usr/include/qt4/QtCore -I/usr/include/qt4/Qt -I/usr/share/qt4/mkspecs/default -I/usr/include/qt4 -Wnon-virtual-dtor -Wno-long-long -Wundef -Wcast-align -Wchar-subscripts -Wall -W -Wpointer-arith -Wformat-security -fno-exceptions -DQT_NO_EXCEPTIONS -fno-check-new -fno-common -Woverloaded-virtual -O2 -fwrapv -pipe -Wformat -Werror=format-security -gdwarf-4 -fno-debug-types-section -fvar-tracking-assignments -g2 -Wp,-D_FORTIFY_SOURCE=2 -fstack-protector-strong --param=ssp-buffer-size=4 -Werror=trampolines -fomit-frame-pointer -march=i686 -fasynchronous-unwind-tables -mtune=pentium4 -gdwarf-4 -fno-debug-types-section -fvar-tracking-assignments -g2 -DNDEBUG -DQT_NO_DEBUG -DNDEBUG -DQT_NO_DEBUG -fPIC -o CMakeFiles/kio_perldoc.dir/kio_perldoc_automoc.cpp.o -c /tmp/B.RqkkiH/BUILD/kdesdk-kioslaves-4.14.3/build/perldoc/kio_perldoc_automoc.cpp make[2]: Leaving directory '/tmp/B.RqkkiH/BUILD/kdesdk-kioslaves-4.14.3/build' make[1]: Entering directory '/tmp/B.RqkkiH/BUILD/kdesdk-kioslaves-4.14.3/build' [ 17%] Built target kded_ksvnd_automoc make[1]: Leaving directory '/tmp/B.RqkkiH/BUILD/kdesdk-kioslaves-4.14.3/build' /usr/bin/make -f svn/ksvnd/CMakeFiles/kded_ksvnd.dir/build.make svn/ksvnd/CMakeFiles/kded_ksvnd.dir/depend make[2]: Entering directory '/tmp/B.RqkkiH/BUILD/kdesdk-kioslaves-4.14.3/build' cd /tmp/B.RqkkiH/BUILD/kdesdk-kioslaves-4.14.3/build/svn/svnhelper && /usr/bin/automoc4 /tmp/B.RqkkiH/BUILD/kdesdk-kioslaves-4.14.3/build/svn/svnhelper/kio_svn_helper_automoc.cpp /tmp/B.RqkkiH/BUILD/kdesdk-kioslaves-4.14.3/svn/svnhelper /tmp/B.RqkkiH/BUILD/kdesdk-kioslaves-4.14.3/build/svn/svnhelper /usr/lib/qt4/bin/moc /usr/bin/cmake Generating kio_svn_helper.moc make[2]: Leaving directory '/tmp/B.RqkkiH/BUILD/kdesdk-kioslaves-4.14.3/build' make[1]: Entering directory '/tmp/B.RqkkiH/BUILD/kdesdk-kioslaves-4.14.3/build' [ 26%] Built target kio_svn_helper_automoc make[1]: Leaving directory '/tmp/B.RqkkiH/BUILD/kdesdk-kioslaves-4.14.3/build' /usr/bin/make -f svn/svnhelper/CMakeFiles/kio_svn_helper.dir/build.make svn/svnhelper/CMakeFiles/kio_svn_helper.dir/depend make[2]: Entering directory '/tmp/B.RqkkiH/BUILD/kdesdk-kioslaves-4.14.3/build' [ 26%] Generating ksvndadaptor.cpp, ksvndadaptor.h cd /tmp/B.RqkkiH/BUILD/kdesdk-kioslaves-4.14.3/build/svn/ksvnd && /usr/lib/qt4/bin/qdbusxml2cpp -m -a ksvndadaptor -i ksvnd.h -l KSvnd /tmp/B.RqkkiH/BUILD/kdesdk-kioslaves-4.14.3/svn/ksvnd/org.kde.ksvnd.xml make[2]: Leaving directory '/tmp/B.RqkkiH/BUILD/kdesdk-kioslaves-4.14.3/build' make[2]: Entering directory '/tmp/B.RqkkiH/BUILD/kdesdk-kioslaves-4.14.3/build' [ 26%] Generating ui_commitdlg.h cd /tmp/B.RqkkiH/BUILD/kdesdk-kioslaves-4.14.3/build/svn/ksvnd && /usr/bin/cmake -DKDE4_HEADER:BOOL=ON -DKDE_UIC_EXECUTABLE:FILEPATH=/usr/lib/qt4/bin/uic -DKDE_UIC_FILE:FILEPATH=/tmp/B.RqkkiH/BUILD/kdesdk-kioslaves-4.14.3/svn/ksvnd/commitdlg.ui -DKDE_UIC_H_FILE:FILEPATH=/tmp/B.RqkkiH/BUILD/kdesdk-kioslaves-4.14.3/build/svn/ksvnd/ui_commitdlg.h -DKDE_UIC_BASENAME:STRING=commitdlg -P /usr/share/apps/cmake/modules/kde4uic.cmake make[2]: Leaving directory '/tmp/B.RqkkiH/BUILD/kdesdk-kioslaves-4.14.3/build' make[2]: Entering directory '/tmp/B.RqkkiH/BUILD/kdesdk-kioslaves-4.14.3/build' [ 34%] Generating ui_subversionlog.h cd /tmp/B.RqkkiH/BUILD/kdesdk-kioslaves-4.14.3/build/svn/svnhelper && /usr/bin/cmake -DKDE4_HEADER:BOOL=ON -DKDE_UIC_EXECUTABLE:FILEPATH=/usr/lib/qt4/bin/uic -DKDE_UIC_FILE:FILEPATH=/tmp/B.RqkkiH/BUILD/kdesdk-kioslaves-4.14.3/svn/svnhelper/subversionlog.ui -DKDE_UIC_H_FILE:FILEPATH=/tmp/B.RqkkiH/BUILD/kdesdk-kioslaves-4.14.3/build/svn/svnhelper/ui_subversionlog.h -DKDE_UIC_BASENAME:STRING=subversionlog -P /usr/share/apps/cmake/modules/kde4uic.cmake make[2]: Leaving directory '/tmp/B.RqkkiH/BUILD/kdesdk-kioslaves-4.14.3/build' make[2]: Entering directory '/tmp/B.RqkkiH/BUILD/kdesdk-kioslaves-4.14.3/build' [ 39%] Generating ui_subversioncheckout.h cd /tmp/B.RqkkiH/BUILD/kdesdk-kioslaves-4.14.3/build/svn/svnhelper && /usr/bin/cmake -DKDE4_HEADER:BOOL=ON -DKDE_UIC_EXECUTABLE:FILEPATH=/usr/lib/qt4/bin/uic -DKDE_UIC_FILE:FILEPATH=/tmp/B.RqkkiH/BUILD/kdesdk-kioslaves-4.14.3/svn/svnhelper/subversioncheckout.ui -DKDE_UIC_H_FILE:FILEPATH=/tmp/B.RqkkiH/BUILD/kdesdk-kioslaves-4.14.3/build/svn/svnhelper/ui_subversioncheckout.h -DKDE_UIC_BASENAME:STRING=subversioncheckout -P /usr/share/apps/cmake/modules/kde4uic.cmake make[2]: Leaving directory '/tmp/B.RqkkiH/BUILD/kdesdk-kioslaves-4.14.3/build' make[2]: Entering directory '/tmp/B.RqkkiH/BUILD/kdesdk-kioslaves-4.14.3/build' [ 34%] Generating ui_subversionswitch.h cd /tmp/B.RqkkiH/BUILD/kdesdk-kioslaves-4.14.3/build/svn/svnhelper && /usr/bin/cmake -DKDE4_HEADER:BOOL=ON -DKDE_UIC_EXECUTABLE:FILEPATH=/usr/lib/qt4/bin/uic -DKDE_UIC_FILE:FILEPATH=/tmp/B.RqkkiH/BUILD/kdesdk-kioslaves-4.14.3/svn/svnhelper/subversionswitch.ui -DKDE_UIC_H_FILE:FILEPATH=/tmp/B.RqkkiH/BUILD/kdesdk-kioslaves-4.14.3/build/svn/svnhelper/ui_subversionswitch.h -DKDE_UIC_BASENAME:STRING=subversionswitch -P /usr/share/apps/cmake/modules/kde4uic.cmake make[2]: Leaving directory '/tmp/B.RqkkiH/BUILD/kdesdk-kioslaves-4.14.3/build' make[2]: Entering directory '/tmp/B.RqkkiH/BUILD/kdesdk-kioslaves-4.14.3/build' [ 43%] Generating ui_subversiondiff.h cd /tmp/B.RqkkiH/BUILD/kdesdk-kioslaves-4.14.3/build/svn/svnhelper && /usr/bin/cmake -DKDE4_HEADER:BOOL=ON -DKDE_UIC_EXECUTABLE:FILEPATH=/usr/lib/qt4/bin/uic -DKDE_UIC_FILE:FILEPATH=/tmp/B.RqkkiH/BUILD/kdesdk-kioslaves-4.14.3/svn/svnhelper/subversiondiff.ui -DKDE_UIC_H_FILE:FILEPATH=/tmp/B.RqkkiH/BUILD/kdesdk-kioslaves-4.14.3/build/svn/svnhelper/ui_subversiondiff.h -DKDE_UIC_BASENAME:STRING=subversiondiff -P /usr/share/apps/cmake/modules/kde4uic.cmake make[2]: Leaving directory '/tmp/B.RqkkiH/BUILD/kdesdk-kioslaves-4.14.3/build' make[2]: Entering directory '/tmp/B.RqkkiH/BUILD/kdesdk-kioslaves-4.14.3/build' [ 8%] Generating ksvndinterface.moc cd /tmp/B.RqkkiH/BUILD/kdesdk-kioslaves-4.14.3/build/svn && /usr/lib/qt4/bin/moc -I/tmp/B.RqkkiH/BUILD/kdesdk-kioslaves-4.14.3 -I/tmp/B.RqkkiH/BUILD/kdesdk-kioslaves-4.14.3/build -I/usr/include -I/usr/include/KDE -I/usr/include/KDE -I/usr/include -I/usr/include/qt4/phonon -I/usr/include/qt4/QtXmlPatterns -I/usr/include/qt4/QtXml -I/usr/include/qt4/QtWebKit -I/usr/include/qt4/QtUiTools -I/usr/include/qt4/QtTest -I/usr/include/qt4/QtSvg -I/usr/include/qt4/QtSql -I/usr/include/qt4/QtScriptTools -I/usr/include/qt4/QtScript -I/usr/include/qt4/QtOpenGL -I/usr/include/qt4/QtNetwork -I/usr/include/qt4/QtMultimedia -I/usr/include/qt4/QtHelp -I/usr/include/qt4/QtDesigner -I/usr/include/qt4/QtDesigner -I/usr/include/qt4/QtDeclarative -I/usr/include/qt4/QtDBus -I/usr/include/qt4/QtAssistant -I/usr/include/qt4/QtAssistant -I/usr/include/qt4/Qt3Support -I/usr/include/qt4/QtGui -I/usr/include/qt4/QtCore -I/usr/include/qt4/Qt -I/usr/share/qt4/mkspecs/default -I/usr/include/qt4 -I/usr/include -I/usr/include -I/usr/include -I/usr/include -I/usr/include -I/usr/include -I/usr/include -I/usr/include -I/usr/include -I/usr/include -I/usr/include -I/usr/include -I/usr/include -I/usr/include -I/usr/include -I/usr/include -I/usr/include -I/usr/include -I/usr/include -I/usr/include -I/usr/include -I/usr/include -I/usr/include -I/usr/include -I/usr/include -I/usr/include -I/usr/include -I/usr/include/apr -I/usr/include/apr-util -I/usr/include -I/usr/include/apr -D_DEFAULT_SOURCE -D_BSD_SOURCE -o /tmp/B.RqkkiH/BUILD/kdesdk-kioslaves-4.14.3/build/svn/ksvndinterface.moc /tmp/B.RqkkiH/BUILD/kdesdk-kioslaves-4.14.3/build/svn/ksvndinterface.h make[2]: Leaving directory '/tmp/B.RqkkiH/BUILD/kdesdk-kioslaves-4.14.3/build' make[2]: Entering directory '/tmp/B.RqkkiH/BUILD/kdesdk-kioslaves-4.14.3/build' cd /tmp/B.RqkkiH/BUILD/kdesdk-kioslaves-4.14.3/build && /usr/bin/cmake -E cmake_depends "Unix Makefiles" /tmp/B.RqkkiH/BUILD/kdesdk-kioslaves-4.14.3 /tmp/B.RqkkiH/BUILD/kdesdk-kioslaves-4.14.3/svn/svnhelper /tmp/B.RqkkiH/BUILD/kdesdk-kioslaves-4.14.3/build /tmp/B.RqkkiH/BUILD/kdesdk-kioslaves-4.14.3/build/svn/svnhelper /tmp/B.RqkkiH/BUILD/kdesdk-kioslaves-4.14.3/build/svn/svnhelper/CMakeFiles/kio_svn_helper.dir/DependInfo.cmake --color= Scanning dependencies of target kio_svn_helper make[2]: Leaving directory '/tmp/B.RqkkiH/BUILD/kdesdk-kioslaves-4.14.3/build' /usr/bin/make -f svn/svnhelper/CMakeFiles/kio_svn_helper.dir/build.make svn/svnhelper/CMakeFiles/kio_svn_helper.dir/build make[2]: Entering directory '/tmp/B.RqkkiH/BUILD/kdesdk-kioslaves-4.14.3/build' cd /tmp/B.RqkkiH/BUILD/kdesdk-kioslaves-4.14.3/build && /usr/bin/cmake -E cmake_depends "Unix Makefiles" /tmp/B.RqkkiH/BUILD/kdesdk-kioslaves-4.14.3 /tmp/B.RqkkiH/BUILD/kdesdk-kioslaves-4.14.3/svn /tmp/B.RqkkiH/BUILD/kdesdk-kioslaves-4.14.3/build /tmp/B.RqkkiH/BUILD/kdesdk-kioslaves-4.14.3/build/svn /tmp/B.RqkkiH/BUILD/kdesdk-kioslaves-4.14.3/build/svn/CMakeFiles/kio_svn.dir/DependInfo.cmake --color= Scanning dependencies of target kio_svn make[2]: Leaving directory '/tmp/B.RqkkiH/BUILD/kdesdk-kioslaves-4.14.3/build' /usr/bin/make -f svn/CMakeFiles/kio_svn.dir/build.make svn/CMakeFiles/kio_svn.dir/build make[2]: Entering directory '/tmp/B.RqkkiH/BUILD/kdesdk-kioslaves-4.14.3/build' [ 47%] Generating ksvndadaptor.moc cd /tmp/B.RqkkiH/BUILD/kdesdk-kioslaves-4.14.3/build/svn/ksvnd && /usr/lib/qt4/bin/moc -I/tmp/B.RqkkiH/BUILD/kdesdk-kioslaves-4.14.3 -I/tmp/B.RqkkiH/BUILD/kdesdk-kioslaves-4.14.3/build -I/usr/include -I/usr/include/KDE -I/usr/include/KDE -I/usr/include -I/usr/include/qt4/phonon -I/usr/include/qt4/QtXmlPatterns -I/usr/include/qt4/QtXml -I/usr/include/qt4/QtWebKit -I/usr/include/qt4/QtUiTools -I/usr/include/qt4/QtTest -I/usr/include/qt4/QtSvg -I/usr/include/qt4/QtSql -I/usr/include/qt4/QtScriptTools -I/usr/include/qt4/QtScript -I/usr/include/qt4/QtOpenGL -I/usr/include/qt4/QtNetwork -I/usr/include/qt4/QtMultimedia -I/usr/include/qt4/QtHelp -I/usr/include/qt4/QtDesigner -I/usr/include/qt4/QtDesigner -I/usr/include/qt4/QtDeclarative -I/usr/include/qt4/QtDBus -I/usr/include/qt4/QtAssistant -I/usr/include/qt4/QtAssistant -I/usr/include/qt4/Qt3Support -I/usr/include/qt4/QtGui -I/usr/include/qt4/QtCore -I/usr/include/qt4/Qt -I/usr/share/qt4/mkspecs/default -I/usr/include/qt4 -I/usr/include -I/usr/include -I/usr/include -I/usr/include -I/usr/include -I/usr/include -I/usr/include -I/usr/include -I/usr/include -I/usr/include -I/usr/include -I/usr/include -I/usr/include -I/usr/include -I/usr/include -I/usr/include -I/usr/include -I/usr/include -I/usr/include -I/usr/include -I/usr/include -I/usr/include -I/usr/include -I/usr/include -I/usr/include -I/usr/include -I/usr/include -I/usr/include/apr -I/usr/include/apr-util -I/usr/include -I/usr/include/apr -D_DEFAULT_SOURCE -D_BSD_SOURCE -o /tmp/B.RqkkiH/BUILD/kdesdk-kioslaves-4.14.3/build/svn/ksvnd/ksvndadaptor.moc /tmp/B.RqkkiH/BUILD/kdesdk-kioslaves-4.14.3/build/svn/ksvnd/ksvndadaptor.h make[2]: Leaving directory '/tmp/B.RqkkiH/BUILD/kdesdk-kioslaves-4.14.3/build' make[2]: Entering directory '/tmp/B.RqkkiH/BUILD/kdesdk-kioslaves-4.14.3/build' [ 52%] Building CXX object svn/svnhelper/CMakeFiles/kio_svn_helper.dir/kio_svn_helper_automoc.cpp.o cd /tmp/B.RqkkiH/BUILD/kdesdk-kioslaves-4.14.3/build/svn/svnhelper && /usr/bin/i686-pld-linux-g++ -D_BSD_SOURCE -D_DEFAULT_SOURCE -I/tmp/B.RqkkiH/BUILD/kdesdk-kioslaves-4.14.3/build/svn/svnhelper -I/tmp/B.RqkkiH/BUILD/kdesdk-kioslaves-4.14.3/svn/svnhelper -I/tmp/B.RqkkiH/BUILD/kdesdk-kioslaves-4.14.3 -I/tmp/B.RqkkiH/BUILD/kdesdk-kioslaves-4.14.3/build -I/usr/include/KDE -I/usr/include/qt4/phonon -I/usr/include/qt4/QtXmlPatterns -I/usr/include/qt4/QtXml -I/usr/include/qt4/QtWebKit -I/usr/include/qt4/QtUiTools -I/usr/include/qt4/QtTest -I/usr/include/qt4/QtSvg -I/usr/include/qt4/QtSql -I/usr/include/qt4/QtScriptTools -I/usr/include/qt4/QtScript -I/usr/include/qt4/QtOpenGL -I/usr/include/qt4/QtNetwork -I/usr/include/qt4/QtMultimedia -I/usr/include/qt4/QtHelp -I/usr/include/qt4/QtDesigner -I/usr/include/qt4/QtDeclarative -I/usr/include/qt4/QtDBus -I/usr/include/qt4/QtAssistant -I/usr/include/qt4/Qt3Support -I/usr/include/qt4/QtGui -I/usr/include/qt4/QtCore -I/usr/include/qt4/Qt -I/usr/share/qt4/mkspecs/default -I/usr/include/qt4 -I/usr/include/apr -I/usr/include/apr-util -Wnon-virtual-dtor -Wno-long-long -Wundef -Wcast-align -Wchar-subscripts -Wall -W -Wpointer-arith -Wformat-security -fno-exceptions -DQT_NO_EXCEPTIONS -fno-check-new -fno-common -Woverloaded-virtual -O2 -fwrapv -pipe -Wformat -Werror=format-security -gdwarf-4 -fno-debug-types-section -fvar-tracking-assignments -g2 -Wp,-D_FORTIFY_SOURCE=2 -fstack-protector-strong --param=ssp-buffer-size=4 -Werror=trampolines -fomit-frame-pointer -march=i686 -fasynchronous-unwind-tables -mtune=pentium4 -gdwarf-4 -fno-debug-types-section -fvar-tracking-assignments -g2 -DNDEBUG -DQT_NO_DEBUG -DNDEBUG -DQT_NO_DEBUG -o CMakeFiles/kio_svn_helper.dir/kio_svn_helper_automoc.cpp.o -c /tmp/B.RqkkiH/BUILD/kdesdk-kioslaves-4.14.3/build/svn/svnhelper/kio_svn_helper_automoc.cpp make[2]: Leaving directory '/tmp/B.RqkkiH/BUILD/kdesdk-kioslaves-4.14.3/build' make[2]: Entering directory '/tmp/B.RqkkiH/BUILD/kdesdk-kioslaves-4.14.3/build' [ 65%] Building CXX object svn/CMakeFiles/kio_svn.dir/kio_svn_automoc.cpp.o cd /tmp/B.RqkkiH/BUILD/kdesdk-kioslaves-4.14.3/build/svn && /usr/bin/i686-pld-linux-g++ -DMAKE_KIO_SVN_LIB -D_BSD_SOURCE -D_DEFAULT_SOURCE -I/tmp/B.RqkkiH/BUILD/kdesdk-kioslaves-4.14.3/build/svn -I/tmp/B.RqkkiH/BUILD/kdesdk-kioslaves-4.14.3/svn -I/tmp/B.RqkkiH/BUILD/kdesdk-kioslaves-4.14.3 -I/tmp/B.RqkkiH/BUILD/kdesdk-kioslaves-4.14.3/build -I/usr/include/KDE -I/usr/include/qt4/phonon -I/usr/include/qt4/QtXmlPatterns -I/usr/include/qt4/QtXml -I/usr/include/qt4/QtWebKit -I/usr/include/qt4/QtUiTools -I/usr/include/qt4/QtTest -I/usr/include/qt4/QtSvg -I/usr/include/qt4/QtSql -I/usr/include/qt4/QtScriptTools -I/usr/include/qt4/QtScript -I/usr/include/qt4/QtOpenGL -I/usr/include/qt4/QtNetwork -I/usr/include/qt4/QtMultimedia -I/usr/include/qt4/QtHelp -I/usr/include/qt4/QtDesigner -I/usr/include/qt4/QtDeclarative -I/usr/include/qt4/QtDBus -I/usr/include/qt4/QtAssistant -I/usr/include/qt4/Qt3Support -I/usr/include/qt4/QtGui -I/usr/include/qt4/QtCore -I/usr/include/qt4/Qt -I/usr/share/qt4/mkspecs/default -I/usr/include/qt4 -I/usr/include/apr -I/usr/include/apr-util -Wnon-virtual-dtor -Wno-long-long -Wundef -Wcast-align -Wchar-subscripts -Wall -W -Wpointer-arith -Wformat-security -fno-exceptions -DQT_NO_EXCEPTIONS -fno-check-new -fno-common -Woverloaded-virtual -O2 -fwrapv -pipe -Wformat -Werror=format-security -gdwarf-4 -fno-debug-types-section -fvar-tracking-assignments -g2 -Wp,-D_FORTIFY_SOURCE=2 -fstack-protector-strong --param=ssp-buffer-size=4 -Werror=trampolines -fomit-frame-pointer -march=i686 -fasynchronous-unwind-tables -mtune=pentium4 -gdwarf-4 -fno-debug-types-section -fvar-tracking-assignments -g2 -DNDEBUG -DQT_NO_DEBUG -DNDEBUG -DQT_NO_DEBUG -fPIC -o CMakeFiles/kio_svn.dir/kio_svn_automoc.cpp.o -c /tmp/B.RqkkiH/BUILD/kdesdk-kioslaves-4.14.3/build/svn/kio_svn_automoc.cpp make[2]: Leaving directory '/tmp/B.RqkkiH/BUILD/kdesdk-kioslaves-4.14.3/build' make[2]: Entering directory '/tmp/B.RqkkiH/BUILD/kdesdk-kioslaves-4.14.3/build' cd /tmp/B.RqkkiH/BUILD/kdesdk-kioslaves-4.14.3/build && /usr/bin/cmake -E cmake_depends "Unix Makefiles" /tmp/B.RqkkiH/BUILD/kdesdk-kioslaves-4.14.3 /tmp/B.RqkkiH/BUILD/kdesdk-kioslaves-4.14.3/svn/ksvnd /tmp/B.RqkkiH/BUILD/kdesdk-kioslaves-4.14.3/build /tmp/B.RqkkiH/BUILD/kdesdk-kioslaves-4.14.3/build/svn/ksvnd /tmp/B.RqkkiH/BUILD/kdesdk-kioslaves-4.14.3/build/svn/ksvnd/CMakeFiles/kded_ksvnd.dir/DependInfo.cmake --color= Scanning dependencies of target kded_ksvnd make[2]: Leaving directory '/tmp/B.RqkkiH/BUILD/kdesdk-kioslaves-4.14.3/build' /usr/bin/make -f svn/ksvnd/CMakeFiles/kded_ksvnd.dir/build.make svn/ksvnd/CMakeFiles/kded_ksvnd.dir/build make[2]: Entering directory '/tmp/B.RqkkiH/BUILD/kdesdk-kioslaves-4.14.3/build' [ 73%] Building CXX object svn/ksvnd/CMakeFiles/kded_ksvnd.dir/kded_ksvnd_automoc.cpp.o cd /tmp/B.RqkkiH/BUILD/kdesdk-kioslaves-4.14.3/build/svn/ksvnd && /usr/bin/i686-pld-linux-g++ -DMAKE_KDED_KSVND_LIB -D_BSD_SOURCE -D_DEFAULT_SOURCE -I/tmp/B.RqkkiH/BUILD/kdesdk-kioslaves-4.14.3/build/svn/ksvnd -I/tmp/B.RqkkiH/BUILD/kdesdk-kioslaves-4.14.3/svn/ksvnd -I/tmp/B.RqkkiH/BUILD/kdesdk-kioslaves-4.14.3 -I/tmp/B.RqkkiH/BUILD/kdesdk-kioslaves-4.14.3/build -I/usr/include/KDE -I/usr/include/qt4/phonon -I/usr/include/qt4/QtXmlPatterns -I/usr/include/qt4/QtXml -I/usr/include/qt4/QtWebKit -I/usr/include/qt4/QtUiTools -I/usr/include/qt4/QtTest -I/usr/include/qt4/QtSvg -I/usr/include/qt4/QtSql -I/usr/include/qt4/QtScriptTools -I/usr/include/qt4/QtScript -I/usr/include/qt4/QtOpenGL -I/usr/include/qt4/QtNetwork -I/usr/include/qt4/QtMultimedia -I/usr/include/qt4/QtHelp -I/usr/include/qt4/QtDesigner -I/usr/include/qt4/QtDeclarative -I/usr/include/qt4/QtDBus -I/usr/include/qt4/QtAssistant -I/usr/include/qt4/Qt3Support -I/usr/include/qt4/QtGui -I/usr/include/qt4/QtCore -I/usr/include/qt4/Qt -I/usr/share/qt4/mkspecs/default -I/usr/include/qt4 -I/usr/include/apr -I/usr/include/apr-util -Wnon-virtual-dtor -Wno-long-long -Wundef -Wcast-align -Wchar-subscripts -Wall -W -Wpointer-arith -Wformat-security -fno-exceptions -DQT_NO_EXCEPTIONS -fno-check-new -fno-common -Woverloaded-virtual -O2 -fwrapv -pipe -Wformat -Werror=format-security -gdwarf-4 -fno-debug-types-section -fvar-tracking-assignments -g2 -Wp,-D_FORTIFY_SOURCE=2 -fstack-protector-strong --param=ssp-buffer-size=4 -Werror=trampolines -fomit-frame-pointer -march=i686 -fasynchronous-unwind-tables -mtune=pentium4 -gdwarf-4 -fno-debug-types-section -fvar-tracking-assignments -g2 -DNDEBUG -DQT_NO_DEBUG -DNDEBUG -DQT_NO_DEBUG -fPIC -o CMakeFiles/kded_ksvnd.dir/kded_ksvnd_automoc.cpp.o -c /tmp/B.RqkkiH/BUILD/kdesdk-kioslaves-4.14.3/build/svn/ksvnd/kded_ksvnd_automoc.cpp make[2]: Leaving directory '/tmp/B.RqkkiH/BUILD/kdesdk-kioslaves-4.14.3/build' make[2]: Entering directory '/tmp/B.RqkkiH/BUILD/kdesdk-kioslaves-4.14.3/build' [ 17%] Building CXX object perldoc/CMakeFiles/kio_perldoc.dir/perldoc.cpp.o cd /tmp/B.RqkkiH/BUILD/kdesdk-kioslaves-4.14.3/build/perldoc && /usr/bin/i686-pld-linux-g++ -DMAKE_KIO_PERLDOC_LIB -D_BSD_SOURCE -D_DEFAULT_SOURCE -I/tmp/B.RqkkiH/BUILD/kdesdk-kioslaves-4.14.3/build/perldoc -I/tmp/B.RqkkiH/BUILD/kdesdk-kioslaves-4.14.3/perldoc -I/tmp/B.RqkkiH/BUILD/kdesdk-kioslaves-4.14.3 -I/tmp/B.RqkkiH/BUILD/kdesdk-kioslaves-4.14.3/build -I/usr/include/KDE -I/usr/include/qt4/phonon -I/usr/include/qt4/QtXmlPatterns -I/usr/include/qt4/QtXml -I/usr/include/qt4/QtWebKit -I/usr/include/qt4/QtUiTools -I/usr/include/qt4/QtTest -I/usr/include/qt4/QtSvg -I/usr/include/qt4/QtSql -I/usr/include/qt4/QtScriptTools -I/usr/include/qt4/QtScript -I/usr/include/qt4/QtOpenGL -I/usr/include/qt4/QtNetwork -I/usr/include/qt4/QtMultimedia -I/usr/include/qt4/QtHelp -I/usr/include/qt4/QtDesigner -I/usr/include/qt4/QtDeclarative -I/usr/include/qt4/QtDBus -I/usr/include/qt4/QtAssistant -I/usr/include/qt4/Qt3Support -I/usr/include/qt4/QtGui -I/usr/include/qt4/QtCore -I/usr/include/qt4/Qt -I/usr/share/qt4/mkspecs/default -I/usr/include/qt4 -Wnon-virtual-dtor -Wno-long-long -Wundef -Wcast-align -Wchar-subscripts -Wall -W -Wpointer-arith -Wformat-security -fno-exceptions -DQT_NO_EXCEPTIONS -fno-check-new -fno-common -Woverloaded-virtual -O2 -fwrapv -pipe -Wformat -Werror=format-security -gdwarf-4 -fno-debug-types-section -fvar-tracking-assignments -g2 -Wp,-D_FORTIFY_SOURCE=2 -fstack-protector-strong --param=ssp-buffer-size=4 -Werror=trampolines -fomit-frame-pointer -march=i686 -fasynchronous-unwind-tables -mtune=pentium4 -gdwarf-4 -fno-debug-types-section -fvar-tracking-assignments -g2 -DNDEBUG -DQT_NO_DEBUG -DNDEBUG -DQT_NO_DEBUG -fPIC -o CMakeFiles/kio_perldoc.dir/perldoc.cpp.o -c /tmp/B.RqkkiH/BUILD/kdesdk-kioslaves-4.14.3/perldoc/perldoc.cpp make[2]: Leaving directory '/tmp/B.RqkkiH/BUILD/kdesdk-kioslaves-4.14.3/build' make[2]: Entering directory '/tmp/B.RqkkiH/BUILD/kdesdk-kioslaves-4.14.3/build' [ 69%] Building CXX object svn/CMakeFiles/kio_svn.dir/ksvndinterface.cpp.o cd /tmp/B.RqkkiH/BUILD/kdesdk-kioslaves-4.14.3/build/svn && /usr/bin/i686-pld-linux-g++ -DMAKE_KIO_SVN_LIB -D_BSD_SOURCE -D_DEFAULT_SOURCE -I/tmp/B.RqkkiH/BUILD/kdesdk-kioslaves-4.14.3/build/svn -I/tmp/B.RqkkiH/BUILD/kdesdk-kioslaves-4.14.3/svn -I/tmp/B.RqkkiH/BUILD/kdesdk-kioslaves-4.14.3 -I/tmp/B.RqkkiH/BUILD/kdesdk-kioslaves-4.14.3/build -I/usr/include/KDE -I/usr/include/qt4/phonon -I/usr/include/qt4/QtXmlPatterns -I/usr/include/qt4/QtXml -I/usr/include/qt4/QtWebKit -I/usr/include/qt4/QtUiTools -I/usr/include/qt4/QtTest -I/usr/include/qt4/QtSvg -I/usr/include/qt4/QtSql -I/usr/include/qt4/QtScriptTools -I/usr/include/qt4/QtScript -I/usr/include/qt4/QtOpenGL -I/usr/include/qt4/QtNetwork -I/usr/include/qt4/QtMultimedia -I/usr/include/qt4/QtHelp -I/usr/include/qt4/QtDesigner -I/usr/include/qt4/QtDeclarative -I/usr/include/qt4/QtDBus -I/usr/include/qt4/QtAssistant -I/usr/include/qt4/Qt3Support -I/usr/include/qt4/QtGui -I/usr/include/qt4/QtCore -I/usr/include/qt4/Qt -I/usr/share/qt4/mkspecs/default -I/usr/include/qt4 -I/usr/include/apr -I/usr/include/apr-util -Wnon-virtual-dtor -Wno-long-long -Wundef -Wcast-align -Wchar-subscripts -Wall -W -Wpointer-arith -Wformat-security -fno-exceptions -DQT_NO_EXCEPTIONS -fno-check-new -fno-common -Woverloaded-virtual -O2 -fwrapv -pipe -Wformat -Werror=format-security -gdwarf-4 -fno-debug-types-section -fvar-tracking-assignments -g2 -Wp,-D_FORTIFY_SOURCE=2 -fstack-protector-strong --param=ssp-buffer-size=4 -Werror=trampolines -fomit-frame-pointer -march=i686 -fasynchronous-unwind-tables -mtune=pentium4 -gdwarf-4 -fno-debug-types-section -fvar-tracking-assignments -g2 -DNDEBUG -DQT_NO_DEBUG -DNDEBUG -DQT_NO_DEBUG -fPIC -o CMakeFiles/kio_svn.dir/ksvndinterface.cpp.o -c /tmp/B.RqkkiH/BUILD/kdesdk-kioslaves-4.14.3/build/svn/ksvndinterface.cpp In file included from /usr/include/qt4/QtCore/qobject.h:48, from /usr/include/qt4/QtCore/QObject:1, from /tmp/B.RqkkiH/BUILD/kdesdk-kioslaves-4.14.3/build/svn/ksvndinterface.h:14, from /tmp/B.RqkkiH/BUILD/kdesdk-kioslaves-4.14.3/build/svn/ksvndinterface.cpp:12: /usr/include/qt4/QtCore/qstring.h: In member function 'int QStringRef::compare(QLatin1String, Qt::CaseSensitivity) const': /usr/include/qt4/QtCore/qstring.h:1254:62: warning: implicitly-declared 'constexpr QLatin1String::QLatin1String(const QLatin1String&)' is deprecated [-Wdeprecated-copy] 1254 | { return QString::compare_helper(constData(), length(), s, cs); } | ^ /usr/include/qt4/QtCore/qstring.h:658:27: note: because 'QLatin1String' has user-provided 'QLatin1String& QLatin1String::operator=(const QLatin1String&)' 658 | inline QLatin1String &operator=(const QLatin1String &other) | ^~~~~~~~ /usr/include/qt4/QtCore/qstring.h:634:45: note: initializing argument 3 of 'static int QString::compare_helper(const QChar*, int, QLatin1String, Qt::CaseSensitivity)' 634 | QLatin1String s2, | ~~~~~~~~~~~~~~^~ /usr/include/qt4/QtCore/qstring.h: In static member function 'static int QStringRef::compare(const QStringRef&, QLatin1String, Qt::CaseSensitivity)': /usr/include/qt4/QtCore/qstring.h:1260:69: warning: implicitly-declared 'constexpr QLatin1String::QLatin1String(const QLatin1String&)' is deprecated [-Wdeprecated-copy] 1260 | { return QString::compare_helper(s1.constData(), s1.length(), s2, cs); } | ^ /usr/include/qt4/QtCore/qstring.h:658:27: note: because 'QLatin1String' has user-provided 'QLatin1String& QLatin1String::operator=(const QLatin1String&)' 658 | inline QLatin1String &operator=(const QLatin1String &other) | ^~~~~~~~ /usr/include/qt4/QtCore/qstring.h:634:45: note: initializing argument 3 of 'static int QString::compare_helper(const QChar*, int, QLatin1String, Qt::CaseSensitivity)' 634 | QLatin1String s2, | ~~~~~~~~~~~~~~^~ /usr/include/qt4/QtCore/qstring.h: In member function 'QBool QStringRef::contains(QLatin1String, Qt::CaseSensitivity) const': /usr/include/qt4/QtCore/qstring.h:1278:32: warning: implicitly-declared 'constexpr QLatin1String::QLatin1String(const QLatin1String&)' is deprecated [-Wdeprecated-copy] 1278 | { return QBool(indexOf(s, 0, cs) != -1); } | ^ /usr/include/qt4/QtCore/qstring.h:658:27: note: because 'QLatin1String' has user-provided 'QLatin1String& QLatin1String::operator=(const QLatin1String&)' 658 | inline QLatin1String &operator=(const QLatin1String &other) | ^~~~~~~~ /usr/include/qt4/QtCore/qstring.h:1125:31: note: initializing argument 1 of 'int QStringRef::indexOf(QLatin1String, int, Qt::CaseSensitivity) const' 1125 | int indexOf(QLatin1String str, int from = 0, Qt::CaseSensitivity cs = Qt::CaseSensitive) const; | ~~~~~~~~~~~~~~^~~ In file included from /usr/include/qt4/QtCore/qvariant.h:48, from /usr/include/qt4/QtCore/QVariant:1, from /tmp/B.RqkkiH/BUILD/kdesdk-kioslaves-4.14.3/build/svn/ksvndinterface.h:20, from /tmp/B.RqkkiH/BUILD/kdesdk-kioslaves-4.14.3/build/svn/ksvndinterface.cpp:12: /usr/include/qt4/QtCore/qmetatype.h: In instantiation of 'void* qMetaTypeConstructHelper(const T*) [with T = QDBusObjectPath]': /usr/include/qt4/QtCore/qmetatype.h:196:18: required from 'int qRegisterMetaType(const char*, T*) [with T = QDBusObjectPath]' /usr/include/qt4/QtDBus/qdbusextratypes.h:185:1: required from here /usr/include/qt4/QtCore/qmetatype.h:142:12: warning: implicitly-declared 'QDBusObjectPath::QDBusObjectPath(const QDBusObjectPath&)' is deprecated [-Wdeprecated-copy] 142 | return new T(*static_cast<const T*>(t)); | ^~~~~~~~~~~~~~~~~~~~~~~~~~~~~~~~ In file included from /usr/include/qt4/QtDBus/qdbusabstractinterface.h:51, from /usr/include/qt4/QtDBus/QtDBus:5, from /tmp/B.RqkkiH/BUILD/kdesdk-kioslaves-4.14.3/build/svn/ksvndinterface.h:21, from /tmp/B.RqkkiH/BUILD/kdesdk-kioslaves-4.14.3/build/svn/ksvndinterface.cpp:12: /usr/include/qt4/QtDBus/qdbusextratypes.h:93:25: note: because 'QDBusObjectPath' has user-provided 'QDBusObjectPath& QDBusObjectPath::operator=(const QDBusObjectPath&)' 93 | inline QDBusObjectPath &QDBusObjectPath::operator=(const QDBusObjectPath &_path) | ^~~~~~~~~~~~~~~ In file included from /usr/include/qt4/QtCore/qvariant.h:48, from /usr/include/qt4/QtCore/QVariant:1, from /tmp/B.RqkkiH/BUILD/kdesdk-kioslaves-4.14.3/build/svn/ksvndinterface.h:20, from /tmp/B.RqkkiH/BUILD/kdesdk-kioslaves-4.14.3/build/svn/ksvndinterface.cpp:12: /usr/include/qt4/QtCore/qmetatype.h: In instantiation of 'void* qMetaTypeConstructHelper(const T*) [with T = QDBusSignature]': /usr/include/qt4/QtCore/qmetatype.h:196:18: required from 'int qRegisterMetaType(const char*, T*) [with T = QDBusSignature]' /usr/include/qt4/QtDBus/qdbusextratypes.h:187:1: required from here /usr/include/qt4/QtCore/qmetatype.h:142:12: warning: implicitly-declared 'QDBusSignature::QDBusSignature(const QDBusSignature&)' is deprecated [-Wdeprecated-copy] 142 | return new T(*static_cast<const T*>(t)); | ^~~~~~~~~~~~~~~~~~~~~~~~~~~~~~~~ In file included from /usr/include/qt4/QtDBus/qdbusabstractinterface.h:51, from /usr/include/qt4/QtDBus/QtDBus:5, from /tmp/B.RqkkiH/BUILD/kdesdk-kioslaves-4.14.3/build/svn/ksvndinterface.h:21, from /tmp/B.RqkkiH/BUILD/kdesdk-kioslaves-4.14.3/build/svn/ksvndinterface.cpp:12: /usr/include/qt4/QtDBus/qdbusextratypes.h:143:24: note: because 'QDBusSignature' has user-provided 'QDBusSignature& QDBusSignature::operator=(const QDBusSignature&)' 143 | inline QDBusSignature &QDBusSignature::operator=(const QDBusSignature &dbusSignature) | ^~~~~~~~~~~~~~ In file included from /usr/include/qt4/QtCore/qobject.h:50, from /usr/include/qt4/QtCore/QObject:1, from /tmp/B.RqkkiH/BUILD/kdesdk-kioslaves-4.14.3/build/svn/ksvndinterface.h:14, from /tmp/B.RqkkiH/BUILD/kdesdk-kioslaves-4.14.3/build/svn/ksvndinterface.cpp:12: /usr/include/qt4/QtCore/qlist.h: In instantiation of 'void QList<T>::node_copy(QList<T>::Node*, QList<T>::Node*, QList<T>::Node*) [with T = QDBusObjectPath]': /usr/include/qt4/QtCore/qlist.h:711:9: required from 'void QList<T>::detach_helper(int) [with T = QDBusObjectPath]' /usr/include/qt4/QtCore/qlist.h:725:18: required from 'void QList<T>::detach_helper() [with T = QDBusObjectPath]' /usr/include/qt4/QtCore/qlist.h:122:93: required from 'QList<T>::QList(const QList<T>&) [with T = QDBusObjectPath]' /usr/include/qt4/QtCore/qmetatype.h:142:12: required from 'void* qMetaTypeConstructHelper(const T*) [with T = QList<QDBusObjectPath>]' /usr/include/qt4/QtCore/qmetatype.h:196:18: required from 'int qRegisterMetaType(const char*, T*) [with T = QList<QDBusObjectPath>]' /usr/include/qt4/QtDBus/qdbusextratypes.h:186:1: required from here /usr/include/qt4/QtCore/qlist.h:399:30: warning: implicitly-declared 'QDBusObjectPath::QDBusObjectPath(const QDBusObjectPath&)' is deprecated [-Wdeprecated-copy] 399 | current->v = new T(*reinterpret_cast<T*>(src->v)); | ^~~~~~~~~~~~~~~~~~~~~~~~~~~~~~~~~~~~ In file included from /usr/include/qt4/QtDBus/qdbusabstractinterface.h:51, from /usr/include/qt4/QtDBus/QtDBus:5, from /tmp/B.RqkkiH/BUILD/kdesdk-kioslaves-4.14.3/build/svn/ksvndinterface.h:21, from /tmp/B.RqkkiH/BUILD/kdesdk-kioslaves-4.14.3/build/svn/ksvndinterface.cpp:12: /usr/include/qt4/QtDBus/qdbusextratypes.h:93:25: note: because 'QDBusObjectPath' has user-provided 'QDBusObjectPath& QDBusObjectPath::operator=(const QDBusObjectPath&)' 93 | inline QDBusObjectPath &QDBusObjectPath::operator=(const QDBusObjectPath &_path) | ^~~~~~~~~~~~~~~ In file included from /usr/include/qt4/QtCore/qobject.h:50, from /usr/include/qt4/QtCore/QObject:1, from /tmp/B.RqkkiH/BUILD/kdesdk-kioslaves-4.14.3/build/svn/ksvndinterface.h:14, from /tmp/B.RqkkiH/BUILD/kdesdk-kioslaves-4.14.3/build/svn/ksvndinterface.cpp:12: /usr/include/qt4/QtCore/qlist.h:412:17: warning: implicitly-declared 'QDBusObjectPath::QDBusObjectPath(const QDBusObjectPath&)' is deprecated [-Wdeprecated-copy] 412 | new (current) T(*reinterpret_cast<T*>(src)); | ^~~~~~~~~~~~~~~~~~~~~~~~~~~~~~~~~~~~~~~~~~~ In file included from /usr/include/qt4/QtDBus/qdbusabstractinterface.h:51, from /usr/include/qt4/QtDBus/QtDBus:5, from /tmp/B.RqkkiH/BUILD/kdesdk-kioslaves-4.14.3/build/svn/ksvndinterface.h:21, from /tmp/B.RqkkiH/BUILD/kdesdk-kioslaves-4.14.3/build/svn/ksvndinterface.cpp:12: /usr/include/qt4/QtDBus/qdbusextratypes.h:93:25: note: because 'QDBusObjectPath' has user-provided 'QDBusObjectPath& QDBusObjectPath::operator=(const QDBusObjectPath&)' 93 | inline QDBusObjectPath &QDBusObjectPath::operator=(const QDBusObjectPath &_path) | ^~~~~~~~~~~~~~~ In file included from /usr/include/qt4/QtCore/qobject.h:50, from /usr/include/qt4/QtCore/QObject:1, from /tmp/B.RqkkiH/BUILD/kdesdk-kioslaves-4.14.3/build/svn/ksvndinterface.h:14, from /tmp/B.RqkkiH/BUILD/kdesdk-kioslaves-4.14.3/build/svn/ksvndinterface.cpp:12: /usr/include/qt4/QtCore/qlist.h: In instantiation of 'void QList<T>::node_copy(QList<T>::Node*, QList<T>::Node*, QList<T>::Node*) [with T = QDBusSignature]': /usr/include/qt4/QtCore/qlist.h:711:9: required from 'void QList<T>::detach_helper(int) [with T = QDBusSignature]' /usr/include/qt4/QtCore/qlist.h:725:18: required from 'void QList<T>::detach_helper() [with T = QDBusSignature]' /usr/include/qt4/QtCore/qlist.h:122:93: required from 'QList<T>::QList(const QList<T>&) [with T = QDBusSignature]' /usr/include/qt4/QtCore/qmetatype.h:142:12: required from 'void* qMetaTypeConstructHelper(const T*) [with T = QList<QDBusSignature>]' /usr/include/qt4/QtCore/qmetatype.h:196:18: required from 'int qRegisterMetaType(const char*, T*) [with T = QList<QDBusSignature>]' /usr/include/qt4/QtDBus/qdbusextratypes.h:188:1: required from here /usr/include/qt4/QtCore/qlist.h:399:30: warning: implicitly-declared 'QDBusSignature::QDBusSignature(const QDBusSignature&)' is deprecated [-Wdeprecated-copy] 399 | current->v = new T(*reinterpret_cast<T*>(src->v)); | ^~~~~~~~~~~~~~~~~~~~~~~~~~~~~~~~~~~~ In file included from /usr/include/qt4/QtDBus/qdbusabstractinterface.h:51, from /usr/include/qt4/QtDBus/QtDBus:5, from /tmp/B.RqkkiH/BUILD/kdesdk-kioslaves-4.14.3/build/svn/ksvndinterface.h:21, from /tmp/B.RqkkiH/BUILD/kdesdk-kioslaves-4.14.3/build/svn/ksvndinterface.cpp:12: /usr/include/qt4/QtDBus/qdbusextratypes.h:143:24: note: because 'QDBusSignature' has user-provided 'QDBusSignature& QDBusSignature::operator=(const QDBusSignature&)' 143 | inline QDBusSignature &QDBusSignature::operator=(const QDBusSignature &dbusSignature) | ^~~~~~~~~~~~~~ In file included from /usr/include/qt4/QtCore/qobject.h:50, from /usr/include/qt4/QtCore/QObject:1, from /tmp/B.RqkkiH/BUILD/kdesdk-kioslaves-4.14.3/build/svn/ksvndinterface.h:14, from /tmp/B.RqkkiH/BUILD/kdesdk-kioslaves-4.14.3/build/svn/ksvndinterface.cpp:12: /usr/include/qt4/QtCore/qlist.h:412:17: warning: implicitly-declared 'QDBusSignature::QDBusSignature(const QDBusSignature&)' is deprecated [-Wdeprecated-copy] 412 | new (current) T(*reinterpret_cast<T*>(src)); | ^~~~~~~~~~~~~~~~~~~~~~~~~~~~~~~~~~~~~~~~~~~ In file included from /usr/include/qt4/QtDBus/qdbusabstractinterface.h:51, from /usr/include/qt4/QtDBus/QtDBus:5, from /tmp/B.RqkkiH/BUILD/kdesdk-kioslaves-4.14.3/build/svn/ksvndinterface.h:21, from /tmp/B.RqkkiH/BUILD/kdesdk-kioslaves-4.14.3/build/svn/ksvndinterface.cpp:12: /usr/include/qt4/QtDBus/qdbusextratypes.h:143:24: note: because 'QDBusSignature' has user-provided 'QDBusSignature& QDBusSignature::operator=(const QDBusSignature&)' 143 | inline QDBusSignature &QDBusSignature::operator=(const QDBusSignature &dbusSignature) | ^~~~~~~~~~~~~~ make[2]: Leaving directory '/tmp/B.RqkkiH/BUILD/kdesdk-kioslaves-4.14.3/build' make[2]: Entering directory '/tmp/B.RqkkiH/BUILD/kdesdk-kioslaves-4.14.3/build' [ 86%] Linking CXX shared module ../lib/kio_perldoc.so cd /tmp/B.RqkkiH/BUILD/kdesdk-kioslaves-4.14.3/build/perldoc && /usr/bin/cmake -E cmake_link_script CMakeFiles/kio_perldoc.dir/link.txt --verbose=1 /usr/bin/i686-pld-linux-g++ -fPIC -Wnon-virtual-dtor -Wno-long-long -Wundef -Wcast-align -Wchar-subscripts -Wall -W -Wpointer-arith -Wformat-security -fno-exceptions -DQT_NO_EXCEPTIONS -fno-check-new -fno-common -Woverloaded-virtual -O2 -fwrapv -pipe -Wformat -Werror=format-security -gdwarf-4 -fno-debug-types-section -fvar-tracking-assignments -g2 -Wp,-D_FORTIFY_SOURCE=2 -fstack-protector-strong --param=ssp-buffer-size=4 -Werror=trampolines -fomit-frame-pointer -march=i686 -fasynchronous-unwind-tables -mtune=pentium4 -gdwarf-4 -fno-debug-types-section -fvar-tracking-assignments -g2 -DNDEBUG -DQT_NO_DEBUG -DNDEBUG -DQT_NO_DEBUG -Wl,--enable-new-dtags -Wl,--fatal-warnings -Wl,--no-undefined -lc -Wl,--as-needed -Wl,--no-copy-dt-needed-entries -Wl,-z,relro -Wl,-z,combreloc -shared -o ../lib/kio_perldoc.so CMakeFiles/kio_perldoc.dir/kio_perldoc_automoc.cpp.o CMakeFiles/kio_perldoc.dir/perldoc.cpp.o /usr/lib/libkio.so.5.14.38 /usr/lib/libQtNetwork.so /usr/lib/libQtXml.so /usr/lib/libkdeui.so.5.14.38 /usr/lib/libQtGui.so /usr/lib/libQtSvg.so /usr/lib/libkdecore.so.5.14.38 /usr/lib/libQtDBus.so /usr/lib/libQtCore.so -lpthread make[2]: Leaving directory '/tmp/B.RqkkiH/BUILD/kdesdk-kioslaves-4.14.3/build' make[1]: Entering directory '/tmp/B.RqkkiH/BUILD/kdesdk-kioslaves-4.14.3/build' [ 86%] Built target kio_perldoc make[1]: Leaving directory '/tmp/B.RqkkiH/BUILD/kdesdk-kioslaves-4.14.3/build' make[2]: Entering directory '/tmp/B.RqkkiH/BUILD/kdesdk-kioslaves-4.14.3/build' [ 65%] Building CXX object svn/CMakeFiles/kio_svn.dir/svn.cpp.o cd /tmp/B.RqkkiH/BUILD/kdesdk-kioslaves-4.14.3/build/svn && /usr/bin/i686-pld-linux-g++ -DMAKE_KIO_SVN_LIB -D_BSD_SOURCE -D_DEFAULT_SOURCE -I/tmp/B.RqkkiH/BUILD/kdesdk-kioslaves-4.14.3/build/svn -I/tmp/B.RqkkiH/BUILD/kdesdk-kioslaves-4.14.3/svn -I/tmp/B.RqkkiH/BUILD/kdesdk-kioslaves-4.14.3 -I/tmp/B.RqkkiH/BUILD/kdesdk-kioslaves-4.14.3/build -I/usr/include/KDE -I/usr/include/qt4/phonon -I/usr/include/qt4/QtXmlPatterns -I/usr/include/qt4/QtXml -I/usr/include/qt4/QtWebKit -I/usr/include/qt4/QtUiTools -I/usr/include/qt4/QtTest -I/usr/include/qt4/QtSvg -I/usr/include/qt4/QtSql -I/usr/include/qt4/QtScriptTools -I/usr/include/qt4/QtScript -I/usr/include/qt4/QtOpenGL -I/usr/include/qt4/QtNetwork -I/usr/include/qt4/QtMultimedia -I/usr/include/qt4/QtHelp -I/usr/include/qt4/QtDesigner -I/usr/include/qt4/QtDeclarative -I/usr/include/qt4/QtDBus -I/usr/include/qt4/QtAssistant -I/usr/include/qt4/Qt3Support -I/usr/include/qt4/QtGui -I/usr/include/qt4/QtCore -I/usr/include/qt4/Qt -I/usr/share/qt4/mkspecs/default -I/usr/include/qt4 -I/usr/include/apr -I/usr/include/apr-util -Wnon-virtual-dtor -Wno-long-long -Wundef -Wcast-align -Wchar-subscripts -Wall -W -Wpointer-arith -Wformat-security -fno-exceptions -DQT_NO_EXCEPTIONS -fno-check-new -fno-common -Woverloaded-virtual -O2 -fwrapv -pipe -Wformat -Werror=format-security -gdwarf-4 -fno-debug-types-section -fvar-tracking-assignments -g2 -Wp,-D_FORTIFY_SOURCE=2 -fstack-protector-strong --param=ssp-buffer-size=4 -Werror=trampolines -fomit-frame-pointer -march=i686 -fasynchronous-unwind-tables -mtune=pentium4 -gdwarf-4 -fno-debug-types-section -fvar-tracking-assignments -g2 -DNDEBUG -DQT_NO_DEBUG -DNDEBUG -DQT_NO_DEBUG -fPIC -o CMakeFiles/kio_svn.dir/svn.cpp.o -c /tmp/B.RqkkiH/BUILD/kdesdk-kioslaves-4.14.3/svn/svn.cpp In file included from /usr/include/qt4/QtCore/qdatetime.h:45, from /usr/include/qt4/QtCore/QDateTime:1, from /tmp/B.RqkkiH/BUILD/kdesdk-kioslaves-4.14.3/svn/svn.cpp:22: /usr/include/qt4/QtCore/qstring.h: In member function 'int QStringRef::compare(QLatin1String, Qt::CaseSensitivity) const': /usr/include/qt4/QtCore/qstring.h:1254:62: warning: implicitly-declared 'constexpr QLatin1String::QLatin1String(const QLatin1String&)' is deprecated [-Wdeprecated-copy] 1254 | { return QString::compare_helper(constData(), length(), s, cs); } | ^ /usr/include/qt4/QtCore/qstring.h:658:27: note: because 'QLatin1String' has user-provided 'QLatin1String& QLatin1String::operator=(const QLatin1String&)' 658 | inline QLatin1String &operator=(const QLatin1String &other) | ^~~~~~~~ /usr/include/qt4/QtCore/qstring.h:634:45: note: initializing argument 3 of 'static int QString::compare_helper(const QChar*, int, QLatin1String, Qt::CaseSensitivity)' 634 | QLatin1String s2, | ~~~~~~~~~~~~~~^~ /usr/include/qt4/QtCore/qstring.h: In static member function 'static int QStringRef::compare(const QStringRef&, QLatin1String, Qt::CaseSensitivity)': /usr/include/qt4/QtCore/qstring.h:1260:69: warning: implicitly-declared 'constexpr QLatin1String::QLatin1String(const QLatin1String&)' is deprecated [-Wdeprecated-copy] 1260 | { return QString::compare_helper(s1.constData(), s1.length(), s2, cs); } | ^ /usr/include/qt4/QtCore/qstring.h:658:27: note: because 'QLatin1String' has user-provided 'QLatin1String& QLatin1String::operator=(const QLatin1String&)' 658 | inline QLatin1String &operator=(const QLatin1String &other) | ^~~~~~~~ /usr/include/qt4/QtCore/qstring.h:634:45: note: initializing argument 3 of 'static int QString::compare_helper(const QChar*, int, QLatin1String, Qt::CaseSensitivity)' 634 | QLatin1String s2, | ~~~~~~~~~~~~~~^~ /usr/include/qt4/QtCore/qstring.h: In member function 'QBool QStringRef::contains(QLatin1String, Qt::CaseSensitivity) const': /usr/include/qt4/QtCore/qstring.h:1278:32: warning: implicitly-declared 'constexpr QLatin1String::QLatin1String(const QLatin1String&)' is deprecated [-Wdeprecated-copy] 1278 | { return QBool(indexOf(s, 0, cs) != -1); } | ^ /usr/include/qt4/QtCore/qstring.h:658:27: note: because 'QLatin1String' has user-provided 'QLatin1String& QLatin1String::operator=(const QLatin1String&)' 658 | inline QLatin1String &operator=(const QLatin1String &other) | ^~~~~~~~ /usr/include/qt4/QtCore/qstring.h:1125:31: note: initializing argument 1 of 'int QStringRef::indexOf(QLatin1String, int, Qt::CaseSensitivity) const' 1125 | int indexOf(QLatin1String str, int from = 0, Qt::CaseSensitivity cs = Qt::CaseSensitive) const; | ~~~~~~~~~~~~~~^~~ /tmp/B.RqkkiH/BUILD/kdesdk-kioslaves-4.14.3/svn/svn.cpp: In function 'svn_error_t* open_tmp_file(apr_file_t**, void*, apr_pool_t*)': /tmp/B.RqkkiH/BUILD/kdesdk-kioslaves-4.14.3/svn/svn.cpp:95:55: warning: 'char* svn_path_join(const char*, const char*, apr_pool_t*)' is deprecated [-Wdeprecated-declarations] 95 | truepath = svn_path_join (truepath, "tempfile", pool); | ^ In file included from /tmp/B.RqkkiH/BUILD/kdesdk-kioslaves-4.14.3/svn/svn.cpp:42: /usr/include/subversion-1/svn_path.h:114:1: note: declared here 114 | svn_path_join(const char *base, const char *component, apr_pool_t *pool); | ^~~~~~~~~~~~~ In file included from /usr/include/subversion-1/svn_types.h:1242, from /usr/include/subversion-1/svn_path.h:55, from /tmp/B.RqkkiH/BUILD/kdesdk-kioslaves-4.14.3/svn/svn.cpp:42: /tmp/B.RqkkiH/BUILD/kdesdk-kioslaves-4.14.3/svn/svn.cpp:99:65: warning: 'svn_error_t* svn_io_open_unique_file(apr_file_t**, const char**, const char*, const char*, svn_boolean_t, apr_pool_t*)' is deprecated [-Wdeprecated-declarations] 99 | truepath, ".tmp", true, pool)); | ^ In file included from /usr/include/subversion-1/svn_delta.h:42, from /usr/include/subversion-1/svn_ra.h:39, from /tmp/B.RqkkiH/BUILD/kdesdk-kioslaves-4.14.3/svn/svn.cpp:44: /usr/include/subversion-1/svn_io.h:302:1: note: declared here 302 | svn_io_open_unique_file(apr_file_t **f, | ^~~~~~~~~~~~~~~~~~~~~~~ /tmp/B.RqkkiH/BUILD/kdesdk-kioslaves-4.14.3/svn/svn.cpp: In function 'int compare_items_as_paths(const svn_sort__item_t*, const svn_sort__item_t*)': /tmp/B.RqkkiH/BUILD/kdesdk-kioslaves-4.14.3/svn/svn.cpp:112:49: error: invalid use of incomplete type 'const svn_sort__item_t' {aka 'const struct svn_sort__item_t'} 112 | return svn_path_compare_paths ((const char *)a->key, (const char *)b->key); | ^~ In file included from /tmp/B.RqkkiH/BUILD/kdesdk-kioslaves-4.14.3/svn/svn.cpp:41: /usr/include/subversion-1/svn_sorts.h:55:16: note: forward declaration of 'svn_sort__item_t' {aka 'struct svn_sort__item_t'} 55 | typedef struct svn_sort__item_t svn_sort__item_t; | ^~~~~~~~~~~~~~~~ /tmp/B.RqkkiH/BUILD/kdesdk-kioslaves-4.14.3/svn/svn.cpp:112:71: error: invalid use of incomplete type 'const svn_sort__item_t' {aka 'const struct svn_sort__item_t'} 112 | return svn_path_compare_paths ((const char *)a->key, (const char *)b->key); | ^~ In file included from /tmp/B.RqkkiH/BUILD/kdesdk-kioslaves-4.14.3/svn/svn.cpp:41: /usr/include/subversion-1/svn_sorts.h:55:16: note: forward declaration of 'svn_sort__item_t' {aka 'struct svn_sort__item_t'} 55 | typedef struct svn_sort__item_t svn_sort__item_t; | ^~~~~~~~~~~~~~~~ /tmp/B.RqkkiH/BUILD/kdesdk-kioslaves-4.14.3/svn/svn.cpp: In constructor 'kio_svnProtocol::kio_svnProtocol(const QByteArray&, const QByteArray&)': /tmp/B.RqkkiH/BUILD/kdesdk-kioslaves-4.14.3/svn/svn.cpp:123:58: warning: 'svn_error_t* svn_client_create_context(svn_client_ctx_t**, apr_pool_t*)' is deprecated [-Wdeprecated-declarations] 123 | svn_error_t *err = svn_client_create_context(&ctx, pool); | ^ In file included from /tmp/B.RqkkiH/BUILD/kdesdk-kioslaves-4.14.3/svn/svn.h:30, from /tmp/B.RqkkiH/BUILD/kdesdk-kioslaves-4.14.3/svn/svn.cpp:54: /usr/include/subversion-1/svn_client.h:1117:1: note: declared here 1117 | svn_client_create_context(svn_client_ctx_t **ctx, | ^~~~~~~~~~~~~~~~~~~~~~~~~ /tmp/B.RqkkiH/BUILD/kdesdk-kioslaves-4.14.3/svn/svn.cpp:148:48: warning: 'void svn_client_get_simple_provider(svn_auth_provider_object_t**, apr_pool_t*)' is deprecated [-Wdeprecated-declarations] 148 | svn_client_get_simple_provider(&provider,pool); | ^ In file included from /tmp/B.RqkkiH/BUILD/kdesdk-kioslaves-4.14.3/svn/svn.h:30, from /tmp/B.RqkkiH/BUILD/kdesdk-kioslaves-4.14.3/svn/svn.cpp:54: /usr/include/subversion-1/svn_client.h:151:1: note: declared here 151 | svn_client_get_simple_provider(svn_auth_provider_object_t **provider, | ^~~~~~~~~~~~~~~~~~~~~~~~~~~~~~ /tmp/B.RqkkiH/BUILD/kdesdk-kioslaves-4.14.3/svn/svn.cpp:150:50: warning: 'void svn_client_get_username_provider(svn_auth_provider_object_t**, apr_pool_t*)' is deprecated [-Wdeprecated-declarations] 150 | svn_client_get_username_provider(&provider,pool); | ^ In file included from /tmp/B.RqkkiH/BUILD/kdesdk-kioslaves-4.14.3/svn/svn.h:30, from /tmp/B.RqkkiH/BUILD/kdesdk-kioslaves-4.14.3/svn/svn.cpp:54: /usr/include/subversion-1/svn_client.h:198:1: note: declared here 198 | svn_client_get_username_provider(svn_auth_provider_object_t **provider, | ^~~~~~~~~~~~~~~~~~~~~~~~~~~~~~~~ /tmp/B.RqkkiH/BUILD/kdesdk-kioslaves-4.14.3/svn/svn.cpp:154:90: warning: 'void svn_client_get_simple_prompt_provider(svn_auth_provider_object_t**, svn_auth_simple_prompt_func_t, void*, int, apr_pool_t*)' is deprecated [-Wdeprecated-declarations] 154 | svn_client_get_simple_prompt_provider (&provider,kio_svnProtocol::checkAuth,this,2,pool); | ^ In file included from /tmp/B.RqkkiH/BUILD/kdesdk-kioslaves-4.14.3/svn/svn.h:30, from /tmp/B.RqkkiH/BUILD/kdesdk-kioslaves-4.14.3/svn/svn.cpp:54: /usr/include/subversion-1/svn_client.h:103:1: note: declared here 103 | svn_client_get_simple_prompt_provider( | ^~~~~~~~~~~~~~~~~~~~~~~~~~~~~~~~~~~~~ /tmp/B.RqkkiH/BUILD/kdesdk-kioslaves-4.14.3/svn/svn.cpp:162:65: warning: 'void svn_client_get_ssl_server_trust_file_provider(svn_auth_provider_object_t**, apr_pool_t*)' is deprecated [-Wdeprecated-declarations] 162 | svn_client_get_ssl_server_trust_file_provider (&provider, pool); | ^ In file included from /tmp/B.RqkkiH/BUILD/kdesdk-kioslaves-4.14.3/svn/svn.h:30, from /tmp/B.RqkkiH/BUILD/kdesdk-kioslaves-4.14.3/svn/svn.cpp:54: /usr/include/subversion-1/svn_client.h:214:1: note: declared here 214 | svn_client_get_ssl_server_trust_file_provider( | ^~~~~~~~~~~~~~~~~~~~~~~~~~~~~~~~~~~~~~~~~~~~~ /tmp/B.RqkkiH/BUILD/kdesdk-kioslaves-4.14.3/svn/svn.cpp:164:64: warning: 'void svn_client_get_ssl_client_cert_file_provider(svn_auth_provider_object_t**, apr_pool_t*)' is deprecated [-Wdeprecated-declarations] 164 | svn_client_get_ssl_client_cert_file_provider (&provider, pool); | ^ In file included from /tmp/B.RqkkiH/BUILD/kdesdk-kioslaves-4.14.3/svn/svn.h:30, from /tmp/B.RqkkiH/BUILD/kdesdk-kioslaves-4.14.3/svn/svn.cpp:54: /usr/include/subversion-1/svn_client.h:231:1: note: declared here 231 | svn_client_get_ssl_client_cert_file_provider( | ^~~~~~~~~~~~~~~~~~~~~~~~~~~~~~~~~~~~~~~~~~~~ /tmp/B.RqkkiH/BUILD/kdesdk-kioslaves-4.14.3/svn/svn.cpp:166:67: warning: 'void svn_client_get_ssl_client_cert_pw_file_provider(svn_auth_provider_object_t**, apr_pool_t*)' is deprecated [-Wdeprecated-declarations] 166 | svn_client_get_ssl_client_cert_pw_file_provider (&provider, pool); | ^ In file included from /tmp/B.RqkkiH/BUILD/kdesdk-kioslaves-4.14.3/svn/svn.h:30, from /tmp/B.RqkkiH/BUILD/kdesdk-kioslaves-4.14.3/svn/svn.cpp:54: /usr/include/subversion-1/svn_client.h:248:1: note: declared here 248 | svn_client_get_ssl_client_cert_pw_file_provider( | ^~~~~~~~~~~~~~~~~~~~~~~~~~~~~~~~~~~~~~~~~~~~~~~ /tmp/B.RqkkiH/BUILD/kdesdk-kioslaves-4.14.3/svn/svn.cpp:170:106: warning: 'void svn_client_get_ssl_server_trust_prompt_provider(svn_auth_provider_object_t**, svn_auth_ssl_server_trust_prompt_func_t, void*, apr_pool_t*)' is deprecated [-Wdeprecated-declarations] 170 | svn_client_get_ssl_server_trust_prompt_provider (&provider, kio_svnProtocol::trustSSLPrompt, NULL, pool); | ^ In file included from /tmp/B.RqkkiH/BUILD/kdesdk-kioslaves-4.14.3/svn/svn.h:30, from /tmp/B.RqkkiH/BUILD/kdesdk-kioslaves-4.14.3/svn/svn.cpp:54: /usr/include/subversion-1/svn_client.h:265:1: note: declared here 265 | svn_client_get_ssl_server_trust_prompt_provider( | ^~~~~~~~~~~~~~~~~~~~~~~~~~~~~~~~~~~~~~~~~~~~~~~ /tmp/B.RqkkiH/BUILD/kdesdk-kioslaves-4.14.3/svn/svn.cpp:172:113: warning: 'void svn_client_get_ssl_client_cert_prompt_provider(svn_auth_provider_object_t**, svn_auth_ssl_client_cert_prompt_func_t, void*, int, apr_pool_t*)' is deprecated [-Wdeprecated-declarations] 172 | svn_client_get_ssl_client_cert_prompt_provider (&provider, kio_svnProtocol::clientCertSSLPrompt, NULL, 2, pool); | ^ In file included from /tmp/B.RqkkiH/BUILD/kdesdk-kioslaves-4.14.3/svn/svn.h:30, from /tmp/B.RqkkiH/BUILD/kdesdk-kioslaves-4.14.3/svn/svn.cpp:54: /usr/include/subversion-1/svn_client.h:286:1: note: declared here 286 | svn_client_get_ssl_client_cert_prompt_provider( | ^~~~~~~~~~~~~~~~~~~~~~~~~~~~~~~~~~~~~~~~~~~~~~ /tmp/B.RqkkiH/BUILD/kdesdk-kioslaves-4.14.3/svn/svn.cpp:174:119: warning: 'void svn_client_get_ssl_client_cert_pw_prompt_provider(svn_auth_provider_object_t**, svn_auth_ssl_client_cert_pw_prompt_func_t, void*, int, apr_pool_t*)' is deprecated [-Wdeprecated-declarations] 174 | svn_client_get_ssl_client_cert_pw_prompt_provider (&provider, kio_svnProtocol::clientCertPasswdPrompt, NULL, 2, pool); | ^ In file included from /tmp/B.RqkkiH/BUILD/kdesdk-kioslaves-4.14.3/svn/svn.h:30, from /tmp/B.RqkkiH/BUILD/kdesdk-kioslaves-4.14.3/svn/svn.cpp:54: /usr/include/subversion-1/svn_client.h:308:1: note: declared here 308 | svn_client_get_ssl_client_cert_pw_prompt_provider( | ^~~~~~~~~~~~~~~~~~~~~~~~~~~~~~~~~~~~~~~~~~~~~~~~~ /tmp/B.RqkkiH/BUILD/kdesdk-kioslaves-4.14.3/svn/svn.cpp: In member function 'virtual void kio_svnProtocol::get(const KUrl&)': /tmp/B.RqkkiH/BUILD/kdesdk-kioslaves-4.14.3/svn/svn.cpp:271:103: warning: 'const char* svn_path_canonicalize(const char*, apr_pool_t*)' is deprecated [-Wdeprecated-declarations] 271 | svn_error_t *err = svn_client_cat (bt->string_stream, svn_path_canonicalize( target.toUtf8(),subpool ),&rev,ctx, subpool); | ^ In file included from /tmp/B.RqkkiH/BUILD/kdesdk-kioslaves-4.14.3/svn/svn.cpp:42: /usr/include/subversion-1/svn_path.h:284:1: note: declared here 284 | svn_path_canonicalize(const char *path, apr_pool_t *pool); | ^~~~~~~~~~~~~~~~~~~~~ /tmp/B.RqkkiH/BUILD/kdesdk-kioslaves-4.14.3/svn/svn.cpp:271:122: warning: 'svn_error_t* svn_client_cat(svn_stream_t*, const char*, const svn_opt_revision_t*, svn_client_ctx_t*, apr_pool_t*)' is deprecated [-Wdeprecated-declarations] 271 | svn_error_t *err = svn_client_cat (bt->string_stream, svn_path_canonicalize( target.toUtf8(),subpool ),&rev,ctx, subpool); | ^ In file included from /tmp/B.RqkkiH/BUILD/kdesdk-kioslaves-4.14.3/svn/svn.h:30, from /tmp/B.RqkkiH/BUILD/kdesdk-kioslaves-4.14.3/svn/svn.cpp:54: /usr/include/subversion-1/svn_client.h:6997:1: note: declared here 6997 | svn_client_cat(svn_stream_t *out, | ^~~~~~~~~~~~~~ /tmp/B.RqkkiH/BUILD/kdesdk-kioslaves-4.14.3/svn/svn.cpp: In member function 'virtual void kio_svnProtocol::put(const KUrl&, int, KIO::JobFlags)': /tmp/B.RqkkiH/BUILD/kdesdk-kioslaves-4.14.3/svn/svn.cpp:327:69: warning: 'void svn_path_split(const char*, const char**, const char**, apr_pool_t*)' is deprecated [-Wdeprecated-declarations] 327 | svn_path_split (url.url().toUtf8(), &parent_URL, &basename, subpool); | ^ In file included from /tmp/B.RqkkiH/BUILD/kdesdk-kioslaves-4.14.3/svn/svn.cpp:42: /usr/include/subversion-1/svn_path.h:243:1: note: declared here 243 | svn_path_split(const char *path, | ^~~~~~~~~~~~~~ /tmp/B.RqkkiH/BUILD/kdesdk-kioslaves-4.14.3/svn/svn.cpp:329:44: warning: 'svn_error_t* svn_ra_init_ra_libs(void**, apr_pool_t*)' is deprecated [-Wdeprecated-declarations] 329 | err = svn_ra_init_ra_libs (&ra_baton, pool); | ^ In file included from /tmp/B.RqkkiH/BUILD/kdesdk-kioslaves-4.14.3/svn/svn.cpp:44: /usr/include/subversion-1/svn_ra.h:2634:1: note: declared here 2634 | svn_ra_init_ra_libs(void **ra_baton, | ^~~~~~~~~~~~~~~~~~~ /tmp/B.RqkkiH/BUILD/kdesdk-kioslaves-4.14.3/svn/svn.cpp:332:69: warning: 'svn_error_t* svn_ra_get_ra_library(svn_ra_plugin_t**, void*, const char*, apr_pool_t*)' is deprecated [-Wdeprecated-declarations] 332 | err = svn_ra_get_ra_library (&ra_lib, ra_baton, parent_URL, subpool); | ^ In file included from /tmp/B.RqkkiH/BUILD/kdesdk-kioslaves-4.14.3/svn/svn.cpp:44: /usr/include/subversion-1/svn_ra.h:2647:1: note: declared here 2647 | svn_ra_get_ra_library(svn_ra_plugin_t **library, | ^~~~~~~~~~~~~~~~~~~~~ /tmp/B.RqkkiH/BUILD/kdesdk-kioslaves-4.14.3/svn/svn.cpp:387:45: warning: 'svn_stream_t* svn_stream_from_aprfile(apr_file_t*, apr_pool_t*)' is deprecated [-Wdeprecated-declarations] 387 | contents = svn_stream_from_aprfile (f, pool); | ^ In file included from /usr/include/subversion-1/svn_delta.h:42, from /usr/include/subversion-1/svn_ra.h:39, from /tmp/B.RqkkiH/BUILD/kdesdk-kioslaves-4.14.3/svn/svn.cpp:44: /usr/include/subversion-1/svn_io.h:1120:1: note: declared here 1120 | svn_stream_from_aprfile(apr_file_t *file, | ^~~~~~~~~~~~~~~~~~~~~~~ /tmp/B.RqkkiH/BUILD/kdesdk-kioslaves-4.14.3/svn/svn.cpp: In member function 'virtual void kio_svnProtocol::stat(const KUrl&)': /tmp/B.RqkkiH/BUILD/kdesdk-kioslaves-4.14.3/svn/svn.cpp:476:77: warning: 'const char* svn_path_canonicalize(const char*, apr_pool_t*)' is deprecated [-Wdeprecated-declarations] 476 | err = svn_ra_open(&session,svn_path_canonicalize( target.toUtf8(), subpool ),cbtable,callbackbt,ctx->config,subpool); | ^ In file included from /tmp/B.RqkkiH/BUILD/kdesdk-kioslaves-4.14.3/svn/svn.cpp:42: /usr/include/subversion-1/svn_path.h:284:1: note: declared here 284 | svn_path_canonicalize(const char *path, apr_pool_t *pool); | ^~~~~~~~~~~~~~~~~~~~~ /tmp/B.RqkkiH/BUILD/kdesdk-kioslaves-4.14.3/svn/svn.cpp:476:117: warning: 'svn_error_t* svn_ra_open(svn_ra_session_t**, const char*, const svn_ra_callbacks_t*, void*, apr_hash_t*, apr_pool_t*)' is deprecated [-Wdeprecated-declarations] 476 | err = svn_ra_open(&session,svn_path_canonicalize( target.toUtf8(), subpool ),cbtable,callbackbt,ctx->config,subpool); | ^ In file included from /tmp/B.RqkkiH/BUILD/kdesdk-kioslaves-4.14.3/svn/svn.cpp:44: /usr/include/subversion-1/svn_ra.h:807:1: note: declared here 807 | svn_ra_open(svn_ra_session_t **session_p, | ^~~~~~~~~~~ /tmp/B.RqkkiH/BUILD/kdesdk-kioslaves-4.14.3/svn/svn.cpp:505:84: warning: 'const char* svn_path_canonicalize(const char*, apr_pool_t*)' is deprecated [-Wdeprecated-declarations] 505 | kDebug(7128) << "Checked Path" << svn_path_canonicalize( target.toUtf8(), subpool ); | ^ In file included from /tmp/B.RqkkiH/BUILD/kdesdk-kioslaves-4.14.3/svn/svn.cpp:42: /usr/include/subversion-1/svn_path.h:284:1: note: declared here 284 | svn_path_canonicalize(const char *path, apr_pool_t *pool); | ^~~~~~~~~~~~~~~~~~~~~ /tmp/B.RqkkiH/BUILD/kdesdk-kioslaves-4.14.3/svn/svn.cpp: In member function 'virtual void kio_svnProtocol::listDir(const KUrl&)': /tmp/B.RqkkiH/BUILD/kdesdk-kioslaves-4.14.3/svn/svn.cpp:543:94: warning: 'const char* svn_path_canonicalize(const char*, apr_pool_t*)' is deprecated [-Wdeprecated-declarations] 543 | svn_error_t *err = svn_client_ls (&dirents, svn_path_canonicalize( target.toUtf8(), subpool ), &rev, false, ctx, subpool); | ^ In file included from /tmp/B.RqkkiH/BUILD/kdesdk-kioslaves-4.14.3/svn/svn.cpp:42: /usr/include/subversion-1/svn_path.h:284:1: note: declared here 284 | svn_path_canonicalize(const char *path, apr_pool_t *pool); | ^~~~~~~~~~~~~~~~~~~~~ /tmp/B.RqkkiH/BUILD/kdesdk-kioslaves-4.14.3/svn/svn.cpp:543:122: warning: 'svn_error_t* svn_client_ls(apr_hash_t**, const char*, svn_opt_revision_t*, svn_boolean_t, svn_client_ctx_t*, apr_pool_t*)' is deprecated [-Wdeprecated-declarations] 543 | svn_error_t *err = svn_client_ls (&dirents, svn_path_canonicalize( target.toUtf8(), subpool ), &rev, false, ctx, subpool); | ^ In file included from /tmp/B.RqkkiH/BUILD/kdesdk-kioslaves-4.14.3/svn/svn.h:30, from /tmp/B.RqkkiH/BUILD/kdesdk-kioslaves-4.14.3/svn/svn.cpp:54: /usr/include/subversion-1/svn_client.h:6916:1: note: declared here 6916 | svn_client_ls(apr_hash_t **dirents, | ^~~~~~~~~~~~~ /tmp/B.RqkkiH/BUILD/kdesdk-kioslaves-4.14.3/svn/svn.cpp:553:11: error: 'svn_sort__hash' was not declared in this scope; did you mean 'svn_sort__item_t'? 553 | array = svn_sort__hash (dirents, compare_items_as_paths, subpool); | ^~~~~~~~~~~~~~ | svn_sort__item_t In file included from /usr/include/subversion-1/svn_sorts.h:33, from /tmp/B.RqkkiH/BUILD/kdesdk-kioslaves-4.14.3/svn/svn.cpp:41: /tmp/B.RqkkiH/BUILD/kdesdk-kioslaves-4.14.3/svn/svn.cpp:562:12: error: invalid use of incomplete type 'struct svn_sort__item_t' 562 | item = &APR_ARRAY_IDX (array, i, svn_sort__item_t); | ^~~~~~~~~~~~~ In file included from /tmp/B.RqkkiH/BUILD/kdesdk-kioslaves-4.14.3/svn/svn.cpp:41: /usr/include/subversion-1/svn_sorts.h:55:16: note: forward declaration of 'struct svn_sort__item_t' 55 | typedef struct svn_sort__item_t svn_sort__item_t; | ^~~~~~~~~~~~~~~~ /tmp/B.RqkkiH/BUILD/kdesdk-kioslaves-4.14.3/svn/svn.cpp:564:38: error: invalid use of incomplete type 'svn_sort__item_t' {aka 'struct svn_sort__item_t'} 564 | utf8_entryname = (const char*)item->key; | ^~ In file included from /tmp/B.RqkkiH/BUILD/kdesdk-kioslaves-4.14.3/svn/svn.cpp:41: /usr/include/subversion-1/svn_sorts.h:55:16: note: forward declaration of 'svn_sort__item_t' {aka 'struct svn_sort__item_t'} 55 | typedef struct svn_sort__item_t svn_sort__item_t; | ^~~~~~~~~~~~~~~~ /tmp/B.RqkkiH/BUILD/kdesdk-kioslaves-4.14.3/svn/svn.cpp:566:71: error: invalid use of incomplete type 'svn_sort__item_t' {aka 'struct svn_sort__item_t'} 566 | dirent = (svn_dirent_t*)apr_hash_get (dirents, utf8_entryname, item->klen); | ^~ In file included from /tmp/B.RqkkiH/BUILD/kdesdk-kioslaves-4.14.3/svn/svn.cpp:41: /usr/include/subversion-1/svn_sorts.h:55:16: note: forward declaration of 'svn_sort__item_t' {aka 'struct svn_sort__item_t'} 55 | typedef struct svn_sort__item_t svn_sort__item_t; | ^~~~~~~~~~~~~~~~ /tmp/B.RqkkiH/BUILD/kdesdk-kioslaves-4.14.3/svn/svn.cpp: In member function 'virtual void kio_svnProtocol::copy(const KUrl&, const KUrl&, int, KIO::JobFlags)': /tmp/B.RqkkiH/BUILD/kdesdk-kioslaves-4.14.3/svn/svn.cpp:642:104: warning: 'svn_error_t* svn_client_copy(svn_client_commit_info_t**, const char*, const svn_opt_revision_t*, const char*, svn_client_ctx_t*, apr_pool_t*)' is deprecated [-Wdeprecated-declarations] 642 | svn_error_t *err = svn_client_copy(&commit_info, srcsvn.toUtf8(), &rev, destsvn.toUtf8(), ctx, subpool); | ^ In file included from /tmp/B.RqkkiH/BUILD/kdesdk-kioslaves-4.14.3/svn/svn.h:30, from /tmp/B.RqkkiH/BUILD/kdesdk-kioslaves-4.14.3/svn/svn.cpp:54: /usr/include/subversion-1/svn_client.h:5724:1: note: declared here 5724 | svn_client_copy(svn_client_commit_info_t **commit_info_p, | ^~~~~~~~~~~~~~~ /tmp/B.RqkkiH/BUILD/kdesdk-kioslaves-4.14.3/svn/svn.cpp: In member function 'virtual void kio_svnProtocol::mkdir(const KUrl::List&, int)': /tmp/B.RqkkiH/BUILD/kdesdk-kioslaves-4.14.3/svn/svn.cpp:664:116: warning: 'const char* svn_path_canonicalize(const char*, apr_pool_t*)' is deprecated [-Wdeprecated-declarations] 664 | const char *_target = apr_pstrdup( subpool, svn_path_canonicalize( apr_pstrdup( subpool, cur.toUtf8() ), subpool ) ); | ^ In file included from /tmp/B.RqkkiH/BUILD/kdesdk-kioslaves-4.14.3/svn/svn.cpp:42: /usr/include/subversion-1/svn_path.h:284:1: note: declared here 284 | svn_path_canonicalize(const char *path, apr_pool_t *pool); | ^~~~~~~~~~~~~~~~~~~~~ /tmp/B.RqkkiH/BUILD/kdesdk-kioslaves-4.14.3/svn/svn.cpp:669:70: warning: 'svn_error_t* svn_client_mkdir(svn_client_commit_info_t**, const apr_array_header_t*, svn_client_ctx_t*, apr_pool_t*)' is deprecated [-Wdeprecated-declarations] 669 | svn_error_t *err = svn_client_mkdir(&commit_info,targets,ctx,subpool); | ^ In file included from /tmp/B.RqkkiH/BUILD/kdesdk-kioslaves-4.14.3/svn/svn.h:30, from /tmp/B.RqkkiH/BUILD/kdesdk-kioslaves-4.14.3/svn/svn.cpp:54: /usr/include/subversion-1/svn_client.h:1840:1: note: declared here 1840 | svn_client_mkdir(svn_client_commit_info_t **commit_info_p, | ^~~~~~~~~~~~~~~~ /tmp/B.RqkkiH/BUILD/kdesdk-kioslaves-4.14.3/svn/svn.cpp: In member function 'virtual void kio_svnProtocol::mkdir(const KUrl&, int)': /tmp/B.RqkkiH/BUILD/kdesdk-kioslaves-4.14.3/svn/svn.cpp:691:70: warning: 'svn_error_t* svn_client_mkdir(svn_client_commit_info_t**, const apr_array_header_t*, svn_client_ctx_t*, apr_pool_t*)' is deprecated [-Wdeprecated-declarations] 691 | svn_error_t *err = svn_client_mkdir(&commit_info,targets,ctx,subpool); | ^ In file included from /tmp/B.RqkkiH/BUILD/kdesdk-kioslaves-4.14.3/svn/svn.h:30, from /tmp/B.RqkkiH/BUILD/kdesdk-kioslaves-4.14.3/svn/svn.cpp:54: /usr/include/subversion-1/svn_client.h:1840:1: note: declared here 1840 | svn_client_mkdir(svn_client_commit_info_t **commit_info_p, | ^~~~~~~~~~~~~~~~ /tmp/B.RqkkiH/BUILD/kdesdk-kioslaves-4.14.3/svn/svn.cpp: In member function 'virtual void kio_svnProtocol::del(const KUrl&, bool)': /tmp/B.RqkkiH/BUILD/kdesdk-kioslaves-4.14.3/svn/svn.cpp:713:122: warning: 'svn_error_t* svn_client_delete(svn_client_commit_info_t**, const apr_array_header_t*, svn_boolean_t, svn_client_ctx_t*, apr_pool_t*)' is deprecated [-Wdeprecated-declarations] 713 | svn_error_t *err = svn_client_delete(&commit_info,targets,false/*force remove locally modified files in wc*/,ctx,subpool); | ^ In file included from /tmp/B.RqkkiH/BUILD/kdesdk-kioslaves-4.14.3/svn/svn.h:30, from /tmp/B.RqkkiH/BUILD/kdesdk-kioslaves-4.14.3/svn/svn.cpp:54: /usr/include/subversion-1/svn_client.h:1949:1: note: declared here 1949 | svn_client_delete(svn_client_commit_info_t **commit_info_p, | ^~~~~~~~~~~~~~~~~ /tmp/B.RqkkiH/BUILD/kdesdk-kioslaves-4.14.3/svn/svn.cpp: In member function 'virtual void kio_svnProtocol::rename(const KUrl&, const KUrl&, KIO::JobFlags)': /tmp/B.RqkkiH/BUILD/kdesdk-kioslaves-4.14.3/svn/svn.cpp:758:156: warning: 'svn_error_t* svn_client_move(svn_client_commit_info_t**, const char*, const svn_opt_revision_t*, const char*, svn_boolean_t, svn_client_ctx_t*, apr_pool_t*)' is deprecated [-Wdeprecated-declarations] 758 | svn_error_t *err = svn_client_move(&commit_info, srcsvn.toUtf8(), &rev, destsvn.toUtf8(), false/*force remove locally modified files in wc*/, ctx, subpool); | ^ In file included from /tmp/B.RqkkiH/BUILD/kdesdk-kioslaves-4.14.3/svn/svn.h:30, from /tmp/B.RqkkiH/BUILD/kdesdk-kioslaves-4.14.3/svn/svn.cpp:54: /usr/include/subversion-1/svn_client.h:5946:1: note: declared here 5946 | svn_client_move(svn_client_commit_info_t **commit_info_p, | ^~~~~~~~~~~~~~~ /tmp/B.RqkkiH/BUILD/kdesdk-kioslaves-4.14.3/svn/svn.cpp: In member function 'void kio_svnProtocol::svn_diff(const KUrl&, const KUrl&, int, int, const QString&, const QString&, bool)': /tmp/B.RqkkiH/BUILD/kdesdk-kioslaves-4.14.3/svn/svn.cpp:1014:94: warning: 'const char* svn_path_canonicalize(const char*, apr_pool_t*)' is deprecated [-Wdeprecated-declarations] 1014 | const char *path1 = svn_path_canonicalize( apr_pstrdup( subpool, source.toUtf8() ), subpool ); | ^ In file included from /tmp/B.RqkkiH/BUILD/kdesdk-kioslaves-4.14.3/svn/svn.cpp:42: /usr/include/subversion-1/svn_path.h:284:1: note: declared here 284 | svn_path_canonicalize(const char *path, apr_pool_t *pool); | ^~~~~~~~~~~~~~~~~~~~~ /tmp/B.RqkkiH/BUILD/kdesdk-kioslaves-4.14.3/svn/svn.cpp:1015:94: warning: 'const char* svn_path_canonicalize(const char*, apr_pool_t*)' is deprecated [-Wdeprecated-declarations] 1015 | const char *path2 = svn_path_canonicalize( apr_pstrdup( subpool, target.toUtf8() ), subpool ); | ^ In file included from /tmp/B.RqkkiH/BUILD/kdesdk-kioslaves-4.14.3/svn/svn.cpp:42: /usr/include/subversion-1/svn_path.h:284:1: note: declared here 284 | svn_path_canonicalize(const char *path, apr_pool_t *pool); | ^~~~~~~~~~~~~~~~~~~~~ /tmp/B.RqkkiH/BUILD/kdesdk-kioslaves-4.14.3/svn/svn.cpp:1018:89: warning: 'const char* svn_path_canonicalize(const char*, apr_pool_t*)' is deprecated [-Wdeprecated-declarations] 1018 | path1 = svn_path_canonicalize( apr_pstrdup( subpool, nurl1.path().toUtf8() ), subpool ); | ^ In file included from /tmp/B.RqkkiH/BUILD/kdesdk-kioslaves-4.14.3/svn/svn.cpp:42: /usr/include/subversion-1/svn_path.h:284:1: note: declared here 284 | svn_path_canonicalize(const char *path, apr_pool_t *pool); | ^~~~~~~~~~~~~~~~~~~~~ /tmp/B.RqkkiH/BUILD/kdesdk-kioslaves-4.14.3/svn/svn.cpp:1021:89: warning: 'const char* svn_path_canonicalize(const char*, apr_pool_t*)' is deprecated [-Wdeprecated-declarations] 1021 | path2 = svn_path_canonicalize( apr_pstrdup( subpool, nurl2.path().toUtf8() ), subpool ); | ^ In file included from /tmp/B.RqkkiH/BUILD/kdesdk-kioslaves-4.14.3/svn/svn.cpp:42: /usr/include/subversion-1/svn_path.h:284:1: note: declared here 284 | svn_path_canonicalize(const char *path, apr_pool_t *pool); | ^~~~~~~~~~~~~~~~~~~~~ /tmp/B.RqkkiH/BUILD/kdesdk-kioslaves-4.14.3/svn/svn.cpp:1035:134: warning: 'svn_error_t* svn_client_diff(const apr_array_header_t*, const char*, const svn_opt_revision_t*, const char*, const svn_opt_revision_t*, svn_boolean_t, svn_boolean_t, svn_boolean_t, apr_file_t*, apr_file_t*, svn_client_ctx_t*, apr_pool_t*)' is deprecated [-Wdeprecated-declarations] 1035 | svn_error_t *err = svn_client_diff (options, path1, &revision1, path2, &revision2, recurse, false, true, outfile, NULL, ctx, subpool); | ^ In file included from /tmp/B.RqkkiH/BUILD/kdesdk-kioslaves-4.14.3/svn/svn.h:30, from /tmp/B.RqkkiH/BUILD/kdesdk-kioslaves-4.14.3/svn/svn.cpp:54: /usr/include/subversion-1/svn_client.h:3369:1: note: declared here 3369 | svn_client_diff(const apr_array_header_t *diff_options, | ^~~~~~~~~~~~~~~ /tmp/B.RqkkiH/BUILD/kdesdk-kioslaves-4.14.3/svn/svn.cpp: In member function 'void kio_svnProtocol::svn_switch(const KUrl&, const KUrl&, int, const QString&, bool)': /tmp/B.RqkkiH/BUILD/kdesdk-kioslaves-4.14.3/svn/svn.cpp:1078:93: warning: 'const char* svn_path_canonicalize(const char*, apr_pool_t*)' is deprecated [-Wdeprecated-declarations] 1078 | const char *path = svn_path_canonicalize( apr_pstrdup( subpool, source.toUtf8() ), subpool ); | ^ In file included from /tmp/B.RqkkiH/BUILD/kdesdk-kioslaves-4.14.3/svn/svn.cpp:42: /usr/include/subversion-1/svn_path.h:284:1: note: declared here 284 | svn_path_canonicalize(const char *path, apr_pool_t *pool); | ^~~~~~~~~~~~~~~~~~~~~ /tmp/B.RqkkiH/BUILD/kdesdk-kioslaves-4.14.3/svn/svn.cpp:1079:92: warning: 'const char* svn_path_canonicalize(const char*, apr_pool_t*)' is deprecated [-Wdeprecated-declarations] 1079 | const char *url = svn_path_canonicalize( apr_pstrdup( subpool, target.toUtf8() ), subpool ); | ^ In file included from /tmp/B.RqkkiH/BUILD/kdesdk-kioslaves-4.14.3/svn/svn.cpp:42: /usr/include/subversion-1/svn_path.h:284:1: note: declared here 284 | svn_path_canonicalize(const char *path, apr_pool_t *pool); | ^~~~~~~~~~~~~~~~~~~~~ /tmp/B.RqkkiH/BUILD/kdesdk-kioslaves-4.14.3/svn/svn.cpp:1084:103: warning: 'svn_error_t* svn_client_switch(svn_revnum_t*, const char*, const char*, const svn_opt_revision_t*, svn_boolean_t, svn_client_ctx_t*, apr_pool_t*)' is deprecated [-Wdeprecated-declarations] 1084 | svn_error_t *err = svn_client_switch (NULL/*result revision*/, path, url, &rev, recurse, ctx, subpool); | ^ In file included from /tmp/B.RqkkiH/BUILD/kdesdk-kioslaves-4.14.3/svn/svn.h:30, from /tmp/B.RqkkiH/BUILD/kdesdk-kioslaves-4.14.3/svn/svn.cpp:54: /usr/include/subversion-1/svn_client.h:1578:1: note: declared here 1578 | svn_client_switch(svn_revnum_t *result_rev, | ^~~~~~~~~~~~~~~~~ /tmp/B.RqkkiH/BUILD/kdesdk-kioslaves-4.14.3/svn/svn.cpp: In member function 'void kio_svnProtocol::update(const KUrl&, int, const QString&)': /tmp/B.RqkkiH/BUILD/kdesdk-kioslaves-4.14.3/svn/svn.cpp:1108:94: warning: 'const char* svn_path_canonicalize(const char*, apr_pool_t*)' is deprecated [-Wdeprecated-declarations] 1108 | svn_error_t *err = svn_client_update (NULL, svn_path_canonicalize( target.toUtf8(), subpool ), &rev, true, ctx, subpool); | ^ In file included from /tmp/B.RqkkiH/BUILD/kdesdk-kioslaves-4.14.3/svn/svn.cpp:42: /usr/include/subversion-1/svn_path.h:284:1: note: declared here 284 | svn_path_canonicalize(const char *path, apr_pool_t *pool); | ^~~~~~~~~~~~~~~~~~~~~ /tmp/B.RqkkiH/BUILD/kdesdk-kioslaves-4.14.3/svn/svn.cpp:1108:121: warning: 'svn_error_t* svn_client_update(svn_revnum_t*, const char*, const svn_opt_revision_t*, svn_boolean_t, svn_client_ctx_t*, apr_pool_t*)' is deprecated [-Wdeprecated-declarations] 1108 | svn_error_t *err = svn_client_update (NULL, svn_path_canonicalize( target.toUtf8(), subpool ), &rev, true, ctx, subpool); | ^ In file included from /tmp/B.RqkkiH/BUILD/kdesdk-kioslaves-4.14.3/svn/svn.h:30, from /tmp/B.RqkkiH/BUILD/kdesdk-kioslaves-4.14.3/svn/svn.cpp:54: /usr/include/subversion-1/svn_client.h:1453:1: note: declared here 1453 | svn_client_update(svn_revnum_t *result_rev, | ^~~~~~~~~~~~~~~~~ /tmp/B.RqkkiH/BUILD/kdesdk-kioslaves-4.14.3/svn/svn.cpp: In member function 'void kio_svnProtocol::import(const KUrl&, const KUrl&)': /tmp/B.RqkkiH/BUILD/kdesdk-kioslaves-4.14.3/svn/svn.cpp:1133:93: warning: 'const char* svn_path_canonicalize(const char*, apr_pool_t*)' is deprecated [-Wdeprecated-declarations] 1133 | const char *path = svn_path_canonicalize( apr_pstrdup( subpool, source.toUtf8() ), subpool ); | ^ In file included from /tmp/B.RqkkiH/BUILD/kdesdk-kioslaves-4.14.3/svn/svn.cpp:42: /usr/include/subversion-1/svn_path.h:284:1: note: declared here 284 | svn_path_canonicalize(const char *path, apr_pool_t *pool); | ^~~~~~~~~~~~~~~~~~~~~ /tmp/B.RqkkiH/BUILD/kdesdk-kioslaves-4.14.3/svn/svn.cpp:1134:92: warning: 'const char* svn_path_canonicalize(const char*, apr_pool_t*)' is deprecated [-Wdeprecated-declarations] 1134 | const char *url = svn_path_canonicalize( apr_pstrdup( subpool, target.toUtf8() ), subpool ); | ^ In file included from /tmp/B.RqkkiH/BUILD/kdesdk-kioslaves-4.14.3/svn/svn.cpp:42: /usr/include/subversion-1/svn_path.h:284:1: note: declared here 284 | svn_path_canonicalize(const char *path, apr_pool_t *pool); | ^~~~~~~~~~~~~~~~~~~~~ /tmp/B.RqkkiH/BUILD/kdesdk-kioslaves-4.14.3/svn/svn.cpp:1137:85: warning: 'svn_error_t* svn_client_import(svn_client_commit_info_t**, const char*, const char*, svn_boolean_t, svn_client_ctx_t*, apr_pool_t*)' is deprecated [-Wdeprecated-declarations] 1137 | svn_error_t *err = svn_client_import(&commit_info,path,url,nonrecursive,ctx,subpool); | ^ In file included from /tmp/B.RqkkiH/BUILD/kdesdk-kioslaves-4.14.3/svn/svn.h:30, from /tmp/B.RqkkiH/BUILD/kdesdk-kioslaves-4.14.3/svn/svn.cpp:54: /usr/include/subversion-1/svn_client.h:2144:1: note: declared here 2144 | svn_client_import(svn_client_commit_info_t **commit_info_p, | ^~~~~~~~~~~~~~~~~ /tmp/B.RqkkiH/BUILD/kdesdk-kioslaves-4.14.3/svn/svn.cpp: In member function 'void kio_svnProtocol::checkout(const KUrl&, const KUrl&, int, const QString&)': /tmp/B.RqkkiH/BUILD/kdesdk-kioslaves-4.14.3/svn/svn.cpp:1161:125: warning: 'const char* svn_path_canonicalize(const char*, apr_pool_t*)' is deprecated [-Wdeprecated-declarations] 1161 | svn_error_t *err = svn_client_checkout (NULL/* rev actually checkedout */, svn_path_canonicalize( target.toUtf8(), subpool ), svn_path_canonicalize ( dpath.toUtf8(), subpool ), &rev, true, ctx, subpool); | ^ In file included from /tmp/B.RqkkiH/BUILD/kdesdk-kioslaves-4.14.3/svn/svn.cpp:42: /usr/include/subversion-1/svn_path.h:284:1: note: declared here 284 | svn_path_canonicalize(const char *path, apr_pool_t *pool); | ^~~~~~~~~~~~~~~~~~~~~ /tmp/B.RqkkiH/BUILD/kdesdk-kioslaves-4.14.3/svn/svn.cpp:1161:176: warning: 'const char* svn_path_canonicalize(const char*, apr_pool_t*)' is deprecated [-Wdeprecated-declarations] 1161 | svn_error_t *err = svn_client_checkout (NULL/* rev actually checkedout */, svn_path_canonicalize( target.toUtf8(), subpool ), svn_path_canonicalize ( dpath.toUtf8(), subpool ), &rev, true, ctx, subpool); | ^ In file included from /tmp/B.RqkkiH/BUILD/kdesdk-kioslaves-4.14.3/svn/svn.cpp:42: /usr/include/subversion-1/svn_path.h:284:1: note: declared here 284 | svn_path_canonicalize(const char *path, apr_pool_t *pool); | ^~~~~~~~~~~~~~~~~~~~~ /tmp/B.RqkkiH/BUILD/kdesdk-kioslaves-4.14.3/svn/svn.cpp:1161:203: warning: 'svn_error_t* svn_client_checkout(svn_revnum_t*, const char*, const char*, const svn_opt_revision_t*, svn_boolean_t, svn_client_ctx_t*, apr_pool_t*)' is deprecated [-Wdeprecated-declarations] 1161 | svn_error_t *err = svn_client_checkout (NULL/* rev actually checkedout */, svn_path_canonicalize( target.toUtf8(), subpool ), svn_path_canonicalize ( dpath.toUtf8(), subpool ), &rev, true, ctx, subpool); | ^ In file included from /tmp/B.RqkkiH/BUILD/kdesdk-kioslaves-4.14.3/svn/svn.h:30, from /tmp/B.RqkkiH/BUILD/kdesdk-kioslaves-4.14.3/svn/svn.cpp:54: /usr/include/subversion-1/svn_client.h:1305:1: note: declared here 1305 | svn_client_checkout(svn_revnum_t *result_rev, | ^~~~~~~~~~~~~~~~~~~ /tmp/B.RqkkiH/BUILD/kdesdk-kioslaves-4.14.3/svn/svn.cpp: In member function 'void kio_svnProtocol::commit(const KUrl::List&)': /tmp/B.RqkkiH/BUILD/kdesdk-kioslaves-4.14.3/svn/svn.cpp:1182:128: warning: 'const char* svn_path_canonicalize(const char*, apr_pool_t*)' is deprecated [-Wdeprecated-declarations] 1182 | (*(( const char ** )apr_array_push(( apr_array_header_t* )targets)) ) = svn_path_canonicalize( nurl.path().toUtf8(), subpool ); | ^ In file included from /tmp/B.RqkkiH/BUILD/kdesdk-kioslaves-4.14.3/svn/svn.cpp:42: /usr/include/subversion-1/svn_path.h:284:1: note: declared here 284 | svn_path_canonicalize(const char *path, apr_pool_t *pool); | ^~~~~~~~~~~~~~~~~~~~~ /tmp/B.RqkkiH/BUILD/kdesdk-kioslaves-4.14.3/svn/svn.cpp:1186:84: warning: 'svn_error_t* svn_client_commit(svn_client_commit_info_t**, const apr_array_header_t*, svn_boolean_t, svn_client_ctx_t*, apr_pool_t*)' is deprecated [-Wdeprecated-declarations] 1186 | svn_error_t *err = svn_client_commit(&commit_info,targets,nonrecursive,ctx,subpool); | ^ In file included from /tmp/B.RqkkiH/BUILD/kdesdk-kioslaves-4.14.3/svn/svn.h:30, from /tmp/B.RqkkiH/BUILD/kdesdk-kioslaves-4.14.3/svn/svn.cpp:54: /usr/include/subversion-1/svn_client.h:2348:1: note: declared here 2348 | svn_client_commit(svn_client_commit_info_t **commit_info_p, | ^~~~~~~~~~~~~~~~~ /tmp/B.RqkkiH/BUILD/kdesdk-kioslaves-4.14.3/svn/svn.cpp: In member function 'void kio_svnProtocol::add(const KUrl&)': /tmp/B.RqkkiH/BUILD/kdesdk-kioslaves-4.14.3/svn/svn.cpp:1229:89: warning: 'const char* svn_path_canonicalize(const char*, apr_pool_t*)' is deprecated [-Wdeprecated-declarations] 1229 | svn_error_t *err = svn_client_add(svn_path_canonicalize( nurl.path().toUtf8(), subpool ),nonrecursive,ctx,subpool); | ^ In file included from /tmp/B.RqkkiH/BUILD/kdesdk-kioslaves-4.14.3/svn/svn.cpp:42: /usr/include/subversion-1/svn_path.h:284:1: note: declared here 284 | svn_path_canonicalize(const char *path, apr_pool_t *pool); | ^~~~~~~~~~~~~~~~~~~~~ /tmp/B.RqkkiH/BUILD/kdesdk-kioslaves-4.14.3/svn/svn.cpp:1229:115: warning: 'svn_error_t* svn_client_add(const char*, svn_boolean_t, svn_client_ctx_t*, apr_pool_t*)' is deprecated [-Wdeprecated-declarations] 1229 | svn_error_t *err = svn_client_add(svn_path_canonicalize( nurl.path().toUtf8(), subpool ),nonrecursive,ctx,subpool); | ^ In file included from /tmp/B.RqkkiH/BUILD/kdesdk-kioslaves-4.14.3/svn/svn.h:30, from /tmp/B.RqkkiH/BUILD/kdesdk-kioslaves-4.14.3/svn/svn.cpp:54: /usr/include/subversion-1/svn_client.h:1742:1: note: declared here 1742 | svn_client_add(const char *path, | ^~~~~~~~~~~~~~ /tmp/B.RqkkiH/BUILD/kdesdk-kioslaves-4.14.3/svn/svn.cpp: In member function 'void kio_svnProtocol::wc_delete(const KUrl::List&)': /tmp/B.RqkkiH/BUILD/kdesdk-kioslaves-4.14.3/svn/svn.cpp:1250:128: warning: 'const char* svn_path_canonicalize(const char*, apr_pool_t*)' is deprecated [-Wdeprecated-declarations] 1250 | (*(( const char ** )apr_array_push(( apr_array_header_t* )targets)) ) = svn_path_canonicalize( nurl.path().toUtf8(), subpool ); | ^ In file included from /tmp/B.RqkkiH/BUILD/kdesdk-kioslaves-4.14.3/svn/svn.cpp:42: /usr/include/subversion-1/svn_path.h:284:1: note: declared here 284 | svn_path_canonicalize(const char *path, apr_pool_t *pool); | ^~~~~~~~~~~~~~~~~~~~~ /tmp/B.RqkkiH/BUILD/kdesdk-kioslaves-4.14.3/svn/svn.cpp:1254:84: warning: 'svn_error_t* svn_client_delete(svn_client_commit_info_t**, const apr_array_header_t*, svn_boolean_t, svn_client_ctx_t*, apr_pool_t*)' is deprecated [-Wdeprecated-declarations] 1254 | svn_error_t *err = svn_client_delete(&commit_info,targets,nonrecursive,ctx,subpool); | ^ In file included from /tmp/B.RqkkiH/BUILD/kdesdk-kioslaves-4.14.3/svn/svn.h:30, from /tmp/B.RqkkiH/BUILD/kdesdk-kioslaves-4.14.3/svn/svn.cpp:54: /usr/include/subversion-1/svn_client.h:1949:1: note: declared here 1949 | svn_client_delete(svn_client_commit_info_t **commit_info_p, | ^~~~~~~~~~~~~~~~~ /tmp/B.RqkkiH/BUILD/kdesdk-kioslaves-4.14.3/svn/svn.cpp: In member function 'void kio_svnProtocol::wc_revert(const KUrl::List&)': /tmp/B.RqkkiH/BUILD/kdesdk-kioslaves-4.14.3/svn/svn.cpp:1275:128: warning: 'const char* svn_path_canonicalize(const char*, apr_pool_t*)' is deprecated [-Wdeprecated-declarations] 1275 | (*(( const char ** )apr_array_push(( apr_array_header_t* )targets)) ) = svn_path_canonicalize( nurl.path().toUtf8(), subpool ); | ^ In file included from /tmp/B.RqkkiH/BUILD/kdesdk-kioslaves-4.14.3/svn/svn.cpp:42: /usr/include/subversion-1/svn_path.h:284:1: note: declared here 284 | svn_path_canonicalize(const char *path, apr_pool_t *pool); | ^~~~~~~~~~~~~~~~~~~~~ /tmp/B.RqkkiH/BUILD/kdesdk-kioslaves-4.14.3/svn/svn.cpp:1279:71: warning: 'svn_error_t* svn_client_revert(const apr_array_header_t*, svn_boolean_t, svn_client_ctx_t*, apr_pool_t*)' is deprecated [-Wdeprecated-declarations] 1279 | svn_error_t *err = svn_client_revert(targets,nonrecursive,ctx,subpool); | ^ In file included from /tmp/B.RqkkiH/BUILD/kdesdk-kioslaves-4.14.3/svn/svn.h:30, from /tmp/B.RqkkiH/BUILD/kdesdk-kioslaves-4.14.3/svn/svn.cpp:54: /usr/include/subversion-1/svn_client.h:4553:1: note: declared here 4553 | svn_client_revert(const apr_array_header_t *paths, | ^~~~~~~~~~~~~~~~~ /tmp/B.RqkkiH/BUILD/kdesdk-kioslaves-4.14.3/svn/svn.cpp: In member function 'void kio_svnProtocol::wc_status(const KUrl&, bool, bool, bool, int, const QString&)': /tmp/B.RqkkiH/BUILD/kdesdk-kioslaves-4.14.3/svn/svn.cpp:1301:105: warning: 'const char* svn_path_canonicalize(const char*, apr_pool_t*)' is deprecated [-Wdeprecated-declarations] 1301 | svn_error_t *err = svn_client_status(&result_rev, svn_path_canonicalize( nurl.path().toUtf8(), subpool ), &rev, kio_svnProtocol::status, this, fullRecurse, getAll, checkRepos, no_ignore, ctx, subpool); | ^ In file included from /tmp/B.RqkkiH/BUILD/kdesdk-kioslaves-4.14.3/svn/svn.cpp:42: /usr/include/subversion-1/svn_path.h:284:1: note: declared here 284 | svn_path_canonicalize(const char *path, apr_pool_t *pool); | ^~~~~~~~~~~~~~~~~~~~~ /tmp/B.RqkkiH/BUILD/kdesdk-kioslaves-4.14.3/svn/svn.cpp:1301:201: warning: 'svn_error_t* svn_client_status(svn_revnum_t*, const char*, svn_opt_revision_t*, svn_wc_status_func_t, void*, svn_boolean_t, svn_boolean_t, svn_boolean_t, svn_boolean_t, svn_client_ctx_t*, apr_pool_t*)' is deprecated [-Wdeprecated-declarations] 1301 | svn_error_t *err = svn_client_status(&result_rev, svn_path_canonicalize( nurl.path().toUtf8(), subpool ), &rev, kio_svnProtocol::status, this, fullRecurse, getAll, checkRepos, no_ignore, ctx, subpool); | ^ In file included from /tmp/B.RqkkiH/BUILD/kdesdk-kioslaves-4.14.3/svn/svn.h:30, from /tmp/B.RqkkiH/BUILD/kdesdk-kioslaves-4.14.3/svn/svn.cpp:54: /usr/include/subversion-1/svn_client.h:2749:1: note: declared here 2749 | svn_client_status(svn_revnum_t *result_rev, | ^~~~~~~~~~~~~~~~~ /tmp/B.RqkkiH/BUILD/kdesdk-kioslaves-4.14.3/svn/svn.cpp: In static member function 'static svn_error_t* kio_svnProtocol::commitLogPrompt(const char**, const char**, apr_array_header_t*, void*, apr_pool_t*)': /tmp/B.RqkkiH/BUILD/kdesdk-kioslaves-4.14.3/svn/svn.cpp:1383:19: warning: unused variable 'p' [-Wunused-variable] 1383 | kio_svnProtocol *p = ( kio_svnProtocol* )baton; | ^ /tmp/B.RqkkiH/BUILD/kdesdk-kioslaves-4.14.3/svn/svn.cpp: In member function 'void kio_svnProtocol::wc_resolve(const KUrl&, bool)': /tmp/B.RqkkiH/BUILD/kdesdk-kioslaves-4.14.3/svn/svn.cpp:1667:94: warning: 'const char* svn_path_canonicalize(const char*, apr_pool_t*)' is deprecated [-Wdeprecated-declarations] 1667 | svn_error_t *err = svn_client_resolved(svn_path_canonicalize( nurl.path().toUtf8(), subpool ), recurse,ctx,subpool); | ^ In file included from /tmp/B.RqkkiH/BUILD/kdesdk-kioslaves-4.14.3/svn/svn.cpp:42: /usr/include/subversion-1/svn_path.h:284:1: note: declared here 284 | svn_path_canonicalize(const char *path, apr_pool_t *pool); | ^~~~~~~~~~~~~~~~~~~~~ /tmp/B.RqkkiH/BUILD/kdesdk-kioslaves-4.14.3/svn/svn.cpp:1667:116: warning: 'svn_error_t* svn_client_resolved(const char*, svn_boolean_t, svn_client_ctx_t*, apr_pool_t*)' is deprecated [-Wdeprecated-declarations] 1667 | svn_error_t *err = svn_client_resolved(svn_path_canonicalize( nurl.path().toUtf8(), subpool ), recurse,ctx,subpool); | ^ In file included from /tmp/B.RqkkiH/BUILD/kdesdk-kioslaves-4.14.3/svn/svn.h:30, from /tmp/B.RqkkiH/BUILD/kdesdk-kioslaves-4.14.3/svn/svn.cpp:54: /usr/include/subversion-1/svn_client.h:5417:1: note: declared here 5417 | svn_client_resolved(const char *path, | ^~~~~~~~~~~~~~~~~~~ In file included from /usr/include/qt4/QtCore/qvariant.h:48, from /usr/include/qt4/QtCore/qlocale.h:45, from /usr/include/qt4/QtCore/qtextstream.h:48, from /usr/include/qt4/QtCore/QTextStream:1, from /tmp/B.RqkkiH/BUILD/kdesdk-kioslaves-4.14.3/svn/svn.cpp:24: /usr/include/qt4/QtCore/qmetatype.h: In instantiation of 'void* qMetaTypeConstructHelper(const T*) [with T = QDBusObjectPath]': /usr/include/qt4/QtCore/qmetatype.h:196:18: required from 'int qRegisterMetaType(const char*, T*) [with T = QDBusObjectPath]' /usr/include/qt4/QtDBus/qdbusextratypes.h:185:1: required from here /usr/include/qt4/QtCore/qmetatype.h:142:12: warning: implicitly-declared 'QDBusObjectPath::QDBusObjectPath(const QDBusObjectPath&)' is deprecated [-Wdeprecated-copy] 142 | return new T(*static_cast<const T*>(t)); | ^~~~~~~~~~~~~~~~~~~~~~~~~~~~~~~~ In file included from /usr/include/qt4/QtDBus/qdbusabstractinterface.h:51, from /usr/include/qt4/QtDBus/QtDBus:5, from /tmp/B.RqkkiH/BUILD/kdesdk-kioslaves-4.14.3/build/svn/ksvndinterface.h:21, from /tmp/B.RqkkiH/BUILD/kdesdk-kioslaves-4.14.3/svn/svn.cpp:40: /usr/include/qt4/QtDBus/qdbusextratypes.h:93:25: note: because 'QDBusObjectPath' has user-provided 'QDBusObjectPath& QDBusObjectPath::operator=(const QDBusObjectPath&)' 93 | inline QDBusObjectPath &QDBusObjectPath::operator=(const QDBusObjectPath &_path) | ^~~~~~~~~~~~~~~ In file included from /usr/include/qt4/QtCore/qvariant.h:48, from /usr/include/qt4/QtCore/qlocale.h:45, from /usr/include/qt4/QtCore/qtextstream.h:48, from /usr/include/qt4/QtCore/QTextStream:1, from /tmp/B.RqkkiH/BUILD/kdesdk-kioslaves-4.14.3/svn/svn.cpp:24: /usr/include/qt4/QtCore/qmetatype.h: In instantiation of 'void* qMetaTypeConstructHelper(const T*) [with T = QDBusSignature]': /usr/include/qt4/QtCore/qmetatype.h:196:18: required from 'int qRegisterMetaType(const char*, T*) [with T = QDBusSignature]' /usr/include/qt4/QtDBus/qdbusextratypes.h:187:1: required from here /usr/include/qt4/QtCore/qmetatype.h:142:12: warning: implicitly-declared 'QDBusSignature::QDBusSignature(const QDBusSignature&)' is deprecated [-Wdeprecated-copy] 142 | return new T(*static_cast<const T*>(t)); | ^~~~~~~~~~~~~~~~~~~~~~~~~~~~~~~~ In file included from /usr/include/qt4/QtDBus/qdbusabstractinterface.h:51, from /usr/include/qt4/QtDBus/QtDBus:5, from /tmp/B.RqkkiH/BUILD/kdesdk-kioslaves-4.14.3/build/svn/ksvndinterface.h:21, from /tmp/B.RqkkiH/BUILD/kdesdk-kioslaves-4.14.3/svn/svn.cpp:40: /usr/include/qt4/QtDBus/qdbusextratypes.h:143:24: note: because 'QDBusSignature' has user-provided 'QDBusSignature& QDBusSignature::operator=(const QDBusSignature&)' 143 | inline QDBusSignature &QDBusSignature::operator=(const QDBusSignature &dbusSignature) | ^~~~~~~~~~~~~~ In file included from /usr/include/qt4/QtCore/qobject.h:50, from /usr/include/qt4/QtCore/qsharedpointer_impl.h:63, from /usr/include/qt4/QtCore/qsharedpointer.h:50, from /usr/include/qt4/QtCore/qdatetime.h:47, from /usr/include/qt4/QtCore/QDateTime:1, from /tmp/B.RqkkiH/BUILD/kdesdk-kioslaves-4.14.3/svn/svn.cpp:22: /usr/include/qt4/QtCore/qlist.h: In instantiation of 'void QList<T>::node_copy(QList<T>::Node*, QList<T>::Node*, QList<T>::Node*) [with T = QDBusObjectPath]': /usr/include/qt4/QtCore/qlist.h:711:9: required from 'void QList<T>::detach_helper(int) [with T = QDBusObjectPath]' /usr/include/qt4/QtCore/qlist.h:725:18: required from 'void QList<T>::detach_helper() [with T = QDBusObjectPath]' /usr/include/qt4/QtCore/qlist.h:122:93: required from 'QList<T>::QList(const QList<T>&) [with T = QDBusObjectPath]' /usr/include/qt4/QtCore/qmetatype.h:142:12: required from 'void* qMetaTypeConstructHelper(const T*) [with T = QList<QDBusObjectPath>]' /usr/include/qt4/QtCore/qmetatype.h:196:18: required from 'int qRegisterMetaType(const char*, T*) [with T = QList<QDBusObjectPath>]' /usr/include/qt4/QtDBus/qdbusextratypes.h:186:1: required from here /usr/include/qt4/QtCore/qlist.h:399:30: warning: implicitly-declared 'QDBusObjectPath::QDBusObjectPath(const QDBusObjectPath&)' is deprecated [-Wdeprecated-copy] 399 | current->v = new T(*reinterpret_cast<T*>(src->v)); | ^~~~~~~~~~~~~~~~~~~~~~~~~~~~~~~~~~~~ In file included from /usr/include/qt4/QtDBus/qdbusabstractinterface.h:51, from /usr/include/qt4/QtDBus/QtDBus:5, from /tmp/B.RqkkiH/BUILD/kdesdk-kioslaves-4.14.3/build/svn/ksvndinterface.h:21, from /tmp/B.RqkkiH/BUILD/kdesdk-kioslaves-4.14.3/svn/svn.cpp:40: /usr/include/qt4/QtDBus/qdbusextratypes.h:93:25: note: because 'QDBusObjectPath' has user-provided 'QDBusObjectPath& QDBusObjectPath::operator=(const QDBusObjectPath&)' 93 | inline QDBusObjectPath &QDBusObjectPath::operator=(const QDBusObjectPath &_path) | ^~~~~~~~~~~~~~~ In file included from /usr/include/qt4/QtCore/qobject.h:50, from /usr/include/qt4/QtCore/qsharedpointer_impl.h:63, from /usr/include/qt4/QtCore/qsharedpointer.h:50, from /usr/include/qt4/QtCore/qdatetime.h:47, from /usr/include/qt4/QtCore/QDateTime:1, from /tmp/B.RqkkiH/BUILD/kdesdk-kioslaves-4.14.3/svn/svn.cpp:22: /usr/include/qt4/QtCore/qlist.h:412:17: warning: implicitly-declared 'QDBusObjectPath::QDBusObjectPath(const QDBusObjectPath&)' is deprecated [-Wdeprecated-copy] 412 | new (current) T(*reinterpret_cast<T*>(src)); | ^~~~~~~~~~~~~~~~~~~~~~~~~~~~~~~~~~~~~~~~~~~ In file included from /usr/include/qt4/QtDBus/qdbusabstractinterface.h:51, from /usr/include/qt4/QtDBus/QtDBus:5, from /tmp/B.RqkkiH/BUILD/kdesdk-kioslaves-4.14.3/build/svn/ksvndinterface.h:21, from /tmp/B.RqkkiH/BUILD/kdesdk-kioslaves-4.14.3/svn/svn.cpp:40: /usr/include/qt4/QtDBus/qdbusextratypes.h:93:25: note: because 'QDBusObjectPath' has user-provided 'QDBusObjectPath& QDBusObjectPath::operator=(const QDBusObjectPath&)' 93 | inline QDBusObjectPath &QDBusObjectPath::operator=(const QDBusObjectPath &_path) | ^~~~~~~~~~~~~~~ In file included from /usr/include/qt4/QtCore/qobject.h:50, from /usr/include/qt4/QtCore/qsharedpointer_impl.h:63, from /usr/include/qt4/QtCore/qsharedpointer.h:50, from /usr/include/qt4/QtCore/qdatetime.h:47, from /usr/include/qt4/QtCore/QDateTime:1, from /tmp/B.RqkkiH/BUILD/kdesdk-kioslaves-4.14.3/svn/svn.cpp:22: /usr/include/qt4/QtCore/qlist.h: In instantiation of 'void QList<T>::node_copy(QList<T>::Node*, QList<T>::Node*, QList<T>::Node*) [with T = QDBusSignature]': /usr/include/qt4/QtCore/qlist.h:711:9: required from 'void QList<T>::detach_helper(int) [with T = QDBusSignature]' /usr/include/qt4/QtCore/qlist.h:725:18: required from 'void QList<T>::detach_helper() [with T = QDBusSignature]' /usr/include/qt4/QtCore/qlist.h:122:93: required from 'QList<T>::QList(const QList<T>&) [with T = QDBusSignature]' /usr/include/qt4/QtCore/qmetatype.h:142:12: required from 'void* qMetaTypeConstructHelper(const T*) [with T = QList<QDBusSignature>]' /usr/include/qt4/QtCore/qmetatype.h:196:18: required from 'int qRegisterMetaType(const char*, T*) [with T = QList<QDBusSignature>]' /usr/include/qt4/QtDBus/qdbusextratypes.h:188:1: required from here /usr/include/qt4/QtCore/qlist.h:399:30: warning: implicitly-declared 'QDBusSignature::QDBusSignature(const QDBusSignature&)' is deprecated [-Wdeprecated-copy] 399 | current->v = new T(*reinterpret_cast<T*>(src->v)); | ^~~~~~~~~~~~~~~~~~~~~~~~~~~~~~~~~~~~ In file included from /usr/include/qt4/QtDBus/qdbusabstractinterface.h:51, from /usr/include/qt4/QtDBus/QtDBus:5, from /tmp/B.RqkkiH/BUILD/kdesdk-kioslaves-4.14.3/build/svn/ksvndinterface.h:21, from /tmp/B.RqkkiH/BUILD/kdesdk-kioslaves-4.14.3/svn/svn.cpp:40: /usr/include/qt4/QtDBus/qdbusextratypes.h:143:24: note: because 'QDBusSignature' has user-provided 'QDBusSignature& QDBusSignature::operator=(const QDBusSignature&)' 143 | inline QDBusSignature &QDBusSignature::operator=(const QDBusSignature &dbusSignature) | ^~~~~~~~~~~~~~ In file included from /usr/include/qt4/QtCore/qobject.h:50, from /usr/include/qt4/QtCore/qsharedpointer_impl.h:63, from /usr/include/qt4/QtCore/qsharedpointer.h:50, from /usr/include/qt4/QtCore/qdatetime.h:47, from /usr/include/qt4/QtCore/QDateTime:1, from /tmp/B.RqkkiH/BUILD/kdesdk-kioslaves-4.14.3/svn/svn.cpp:22: /usr/include/qt4/QtCore/qlist.h:412:17: warning: implicitly-declared 'QDBusSignature::QDBusSignature(const QDBusSignature&)' is deprecated [-Wdeprecated-copy] 412 | new (current) T(*reinterpret_cast<T*>(src)); | ^~~~~~~~~~~~~~~~~~~~~~~~~~~~~~~~~~~~~~~~~~~ In file included from /usr/include/qt4/QtDBus/qdbusabstractinterface.h:51, from /usr/include/qt4/QtDBus/QtDBus:5, from /tmp/B.RqkkiH/BUILD/kdesdk-kioslaves-4.14.3/build/svn/ksvndinterface.h:21, from /tmp/B.RqkkiH/BUILD/kdesdk-kioslaves-4.14.3/svn/svn.cpp:40: /usr/include/qt4/QtDBus/qdbusextratypes.h:143:24: note: because 'QDBusSignature' has user-provided 'QDBusSignature& QDBusSignature::operator=(const QDBusSignature&)' 143 | inline QDBusSignature &QDBusSignature::operator=(const QDBusSignature &dbusSignature) | ^~~~~~~~~~~~~~ make[2]: *** [svn/CMakeFiles/kio_svn.dir/build.make:110: svn/CMakeFiles/kio_svn.dir/svn.cpp.o] Error 1 make[2]: Leaving directory '/tmp/B.RqkkiH/BUILD/kdesdk-kioslaves-4.14.3/build' make[1]: *** [CMakeFiles/Makefile2:232: svn/CMakeFiles/kio_svn.dir/all] Error 2 make[1]: *** Waiting for unfinished jobs.... make[2]: Entering directory '/tmp/B.RqkkiH/BUILD/kdesdk-kioslaves-4.14.3/build' [ 78%] Building CXX object svn/ksvnd/CMakeFiles/kded_ksvnd.dir/ksvndadaptor.cpp.o cd /tmp/B.RqkkiH/BUILD/kdesdk-kioslaves-4.14.3/build/svn/ksvnd && /usr/bin/i686-pld-linux-g++ -DMAKE_KDED_KSVND_LIB -D_BSD_SOURCE -D_DEFAULT_SOURCE -I/tmp/B.RqkkiH/BUILD/kdesdk-kioslaves-4.14.3/build/svn/ksvnd -I/tmp/B.RqkkiH/BUILD/kdesdk-kioslaves-4.14.3/svn/ksvnd -I/tmp/B.RqkkiH/BUILD/kdesdk-kioslaves-4.14.3 -I/tmp/B.RqkkiH/BUILD/kdesdk-kioslaves-4.14.3/build -I/usr/include/KDE -I/usr/include/qt4/phonon -I/usr/include/qt4/QtXmlPatterns -I/usr/include/qt4/QtXml -I/usr/include/qt4/QtWebKit -I/usr/include/qt4/QtUiTools -I/usr/include/qt4/QtTest -I/usr/include/qt4/QtSvg -I/usr/include/qt4/QtSql -I/usr/include/qt4/QtScriptTools -I/usr/include/qt4/QtScript -I/usr/include/qt4/QtOpenGL -I/usr/include/qt4/QtNetwork -I/usr/include/qt4/QtMultimedia -I/usr/include/qt4/QtHelp -I/usr/include/qt4/QtDesigner -I/usr/include/qt4/QtDeclarative -I/usr/include/qt4/QtDBus -I/usr/include/qt4/QtAssistant -I/usr/include/qt4/Qt3Support -I/usr/include/qt4/QtGui -I/usr/include/qt4/QtCore -I/usr/include/qt4/Qt -I/usr/share/qt4/mkspecs/default -I/usr/include/qt4 -I/usr/include/apr -I/usr/include/apr-util -Wnon-virtual-dtor -Wno-long-long -Wundef -Wcast-align -Wchar-subscripts -Wall -W -Wpointer-arith -Wformat-security -fno-exceptions -DQT_NO_EXCEPTIONS -fno-check-new -fno-common -Woverloaded-virtual -O2 -fwrapv -pipe -Wformat -Werror=format-security -gdwarf-4 -fno-debug-types-section -fvar-tracking-assignments -g2 -Wp,-D_FORTIFY_SOURCE=2 -fstack-protector-strong --param=ssp-buffer-size=4 -Werror=trampolines -fomit-frame-pointer -march=i686 -fasynchronous-unwind-tables -mtune=pentium4 -gdwarf-4 -fno-debug-types-section -fvar-tracking-assignments -g2 -DNDEBUG -DQT_NO_DEBUG -DNDEBUG -DQT_NO_DEBUG -fPIC -o CMakeFiles/kded_ksvnd.dir/ksvndadaptor.cpp.o -c /tmp/B.RqkkiH/BUILD/kdesdk-kioslaves-4.14.3/build/svn/ksvnd/ksvndadaptor.cpp In file included from /usr/include/qt4/QtCore/qobject.h:48, from /usr/include/qt4/QtCore/QObject:1, from /tmp/B.RqkkiH/BUILD/kdesdk-kioslaves-4.14.3/build/svn/ksvnd/ksvndadaptor.h:15, from /tmp/B.RqkkiH/BUILD/kdesdk-kioslaves-4.14.3/build/svn/ksvnd/ksvndadaptor.cpp:11: /usr/include/qt4/QtCore/qstring.h: In member function 'int QStringRef::compare(QLatin1String, Qt::CaseSensitivity) const': /usr/include/qt4/QtCore/qstring.h:1254:62: warning: implicitly-declared 'constexpr QLatin1String::QLatin1String(const QLatin1String&)' is deprecated [-Wdeprecated-copy] 1254 | { return QString::compare_helper(constData(), length(), s, cs); } | ^ /usr/include/qt4/QtCore/qstring.h:658:27: note: because 'QLatin1String' has user-provided 'QLatin1String& QLatin1String::operator=(const QLatin1String&)' 658 | inline QLatin1String &operator=(const QLatin1String &other) | ^~~~~~~~ /usr/include/qt4/QtCore/qstring.h:634:45: note: initializing argument 3 of 'static int QString::compare_helper(const QChar*, int, QLatin1String, Qt::CaseSensitivity)' 634 | QLatin1String s2, | ~~~~~~~~~~~~~~^~ /usr/include/qt4/QtCore/qstring.h: In static member function 'static int QStringRef::compare(const QStringRef&, QLatin1String, Qt::CaseSensitivity)': /usr/include/qt4/QtCore/qstring.h:1260:69: warning: implicitly-declared 'constexpr QLatin1String::QLatin1String(const QLatin1String&)' is deprecated [-Wdeprecated-copy] 1260 | { return QString::compare_helper(s1.constData(), s1.length(), s2, cs); } | ^ /usr/include/qt4/QtCore/qstring.h:658:27: note: because 'QLatin1String' has user-provided 'QLatin1String& QLatin1String::operator=(const QLatin1String&)' 658 | inline QLatin1String &operator=(const QLatin1String &other) | ^~~~~~~~ /usr/include/qt4/QtCore/qstring.h:634:45: note: initializing argument 3 of 'static int QString::compare_helper(const QChar*, int, QLatin1String, Qt::CaseSensitivity)' 634 | QLatin1String s2, | ~~~~~~~~~~~~~~^~ /usr/include/qt4/QtCore/qstring.h: In member function 'QBool QStringRef::contains(QLatin1String, Qt::CaseSensitivity) const': /usr/include/qt4/QtCore/qstring.h:1278:32: warning: implicitly-declared 'constexpr QLatin1String::QLatin1String(const QLatin1String&)' is deprecated [-Wdeprecated-copy] 1278 | { return QBool(indexOf(s, 0, cs) != -1); } | ^ /usr/include/qt4/QtCore/qstring.h:658:27: note: because 'QLatin1String' has user-provided 'QLatin1String& QLatin1String::operator=(const QLatin1String&)' 658 | inline QLatin1String &operator=(const QLatin1String &other) | ^~~~~~~~ /usr/include/qt4/QtCore/qstring.h:1125:31: note: initializing argument 1 of 'int QStringRef::indexOf(QLatin1String, int, Qt::CaseSensitivity) const' 1125 | int indexOf(QLatin1String str, int from = 0, Qt::CaseSensitivity cs = Qt::CaseSensitive) const; | ~~~~~~~~~~~~~~^~~ In file included from /tmp/B.RqkkiH/BUILD/kdesdk-kioslaves-4.14.3/build/svn/ksvnd/ksvndadaptor.cpp:97: /tmp/B.RqkkiH/BUILD/kdesdk-kioslaves-4.14.3/build/svn/ksvnd/ksvndadaptor.moc: In static member function 'static void KsvndAdaptor::qt_static_metacall(QObject*, QMetaObject::Call, int, void**)': /tmp/B.RqkkiH/BUILD/kdesdk-kioslaves-4.14.3/build/svn/ksvnd/ksvndadaptor.moc:110:66: warning: implicitly-declared 'QStringList& QStringList::operator=(const QStringList&)' is deprecated [-Wdeprecated-copy] 110 | if (_a[0]) *reinterpret_cast< QStringList*>(_a[0]) = _r; } break; | ^~ In file included from /usr/include/qt4/QtCore/QtCore:65, from /usr/include/qt4/QtDBus/QtDBus:3, from /tmp/B.RqkkiH/BUILD/kdesdk-kioslaves-4.14.3/build/svn/ksvnd/ksvndadaptor.h:16, from /tmp/B.RqkkiH/BUILD/kdesdk-kioslaves-4.14.3/build/svn/ksvnd/ksvndadaptor.cpp:11: /usr/include/qt4/QtCore/qstringlist.h:71:12: note: because 'QStringList' has user-provided 'QStringList::QStringList(const QStringList&)' 71 | inline QStringList(const QStringList &l) : QList<QString>(l) { } | ^~~~~~~~~~~ In file included from /tmp/B.RqkkiH/BUILD/kdesdk-kioslaves-4.14.3/build/svn/ksvnd/ksvndadaptor.cpp:97: /tmp/B.RqkkiH/BUILD/kdesdk-kioslaves-4.14.3/build/svn/ksvnd/ksvndadaptor.moc:112:66: warning: implicitly-declared 'QStringList& QStringList::operator=(const QStringList&)' is deprecated [-Wdeprecated-copy] 112 | if (_a[0]) *reinterpret_cast< QStringList*>(_a[0]) = _r; } break; | ^~ In file included from /usr/include/qt4/QtCore/QtCore:65, from /usr/include/qt4/QtDBus/QtDBus:3, from /tmp/B.RqkkiH/BUILD/kdesdk-kioslaves-4.14.3/build/svn/ksvnd/ksvndadaptor.h:16, from /tmp/B.RqkkiH/BUILD/kdesdk-kioslaves-4.14.3/build/svn/ksvnd/ksvndadaptor.cpp:11: /usr/include/qt4/QtCore/qstringlist.h:71:12: note: because 'QStringList' has user-provided 'QStringList::QStringList(const QStringList&)' 71 | inline QStringList(const QStringList &l) : QList<QString>(l) { } | ^~~~~~~~~~~ In file included from /usr/include/qt4/QtCore/qvariant.h:48, from /usr/include/qt4/QtCore/qabstractitemmodel.h:45, from /usr/include/qt4/QtCore/QtCore:4, from /usr/include/qt4/QtDBus/QtDBus:3, from /tmp/B.RqkkiH/BUILD/kdesdk-kioslaves-4.14.3/build/svn/ksvnd/ksvndadaptor.h:16, from /tmp/B.RqkkiH/BUILD/kdesdk-kioslaves-4.14.3/build/svn/ksvnd/ksvndadaptor.cpp:11: /usr/include/qt4/QtCore/qmetatype.h: In instantiation of 'void* qMetaTypeConstructHelper(const T*) [with T = QDBusObjectPath]': /usr/include/qt4/QtCore/qmetatype.h:196:18: required from 'int qRegisterMetaType(const char*, T*) [with T = QDBusObjectPath]' /usr/include/qt4/QtDBus/qdbusextratypes.h:185:1: required from here /usr/include/qt4/QtCore/qmetatype.h:142:12: warning: implicitly-declared 'QDBusObjectPath::QDBusObjectPath(const QDBusObjectPath&)' is deprecated [-Wdeprecated-copy] 142 | return new T(*static_cast<const T*>(t)); | ^~~~~~~~~~~~~~~~~~~~~~~~~~~~~~~~ In file included from /usr/include/qt4/QtDBus/qdbusabstractinterface.h:51, from /usr/include/qt4/QtDBus/QtDBus:5, from /tmp/B.RqkkiH/BUILD/kdesdk-kioslaves-4.14.3/build/svn/ksvnd/ksvndadaptor.h:16, from /tmp/B.RqkkiH/BUILD/kdesdk-kioslaves-4.14.3/build/svn/ksvnd/ksvndadaptor.cpp:11: /usr/include/qt4/QtDBus/qdbusextratypes.h:93:25: note: because 'QDBusObjectPath' has user-provided 'QDBusObjectPath& QDBusObjectPath::operator=(const QDBusObjectPath&)' 93 | inline QDBusObjectPath &QDBusObjectPath::operator=(const QDBusObjectPath &_path) | ^~~~~~~~~~~~~~~ In file included from /usr/include/qt4/QtCore/qvariant.h:48, from /usr/include/qt4/QtCore/qabstractitemmodel.h:45, from /usr/include/qt4/QtCore/QtCore:4, from /usr/include/qt4/QtDBus/QtDBus:3, from /tmp/B.RqkkiH/BUILD/kdesdk-kioslaves-4.14.3/build/svn/ksvnd/ksvndadaptor.h:16, from /tmp/B.RqkkiH/BUILD/kdesdk-kioslaves-4.14.3/build/svn/ksvnd/ksvndadaptor.cpp:11: /usr/include/qt4/QtCore/qmetatype.h: In instantiation of 'void* qMetaTypeConstructHelper(const T*) [with T = QDBusSignature]': /usr/include/qt4/QtCore/qmetatype.h:196:18: required from 'int qRegisterMetaType(const char*, T*) [with T = QDBusSignature]' /usr/include/qt4/QtDBus/qdbusextratypes.h:187:1: required from here /usr/include/qt4/QtCore/qmetatype.h:142:12: warning: implicitly-declared 'QDBusSignature::QDBusSignature(const QDBusSignature&)' is deprecated [-Wdeprecated-copy] 142 | return new T(*static_cast<const T*>(t)); | ^~~~~~~~~~~~~~~~~~~~~~~~~~~~~~~~ In file included from /usr/include/qt4/QtDBus/qdbusabstractinterface.h:51, from /usr/include/qt4/QtDBus/QtDBus:5, from /tmp/B.RqkkiH/BUILD/kdesdk-kioslaves-4.14.3/build/svn/ksvnd/ksvndadaptor.h:16, from /tmp/B.RqkkiH/BUILD/kdesdk-kioslaves-4.14.3/build/svn/ksvnd/ksvndadaptor.cpp:11: /usr/include/qt4/QtDBus/qdbusextratypes.h:143:24: note: because 'QDBusSignature' has user-provided 'QDBusSignature& QDBusSignature::operator=(const QDBusSignature&)' 143 | inline QDBusSignature &QDBusSignature::operator=(const QDBusSignature &dbusSignature) | ^~~~~~~~~~~~~~ In file included from /usr/include/qt4/QtCore/qobject.h:50, from /usr/include/qt4/QtCore/QObject:1, from /tmp/B.RqkkiH/BUILD/kdesdk-kioslaves-4.14.3/build/svn/ksvnd/ksvndadaptor.h:15, from /tmp/B.RqkkiH/BUILD/kdesdk-kioslaves-4.14.3/build/svn/ksvnd/ksvndadaptor.cpp:11: /usr/include/qt4/QtCore/qlist.h: In instantiation of 'void QList<T>::node_copy(QList<T>::Node*, QList<T>::Node*, QList<T>::Node*) [with T = QDBusObjectPath]': /usr/include/qt4/QtCore/qlist.h:711:9: required from 'void QList<T>::detach_helper(int) [with T = QDBusObjectPath]' /usr/include/qt4/QtCore/qlist.h:725:18: required from 'void QList<T>::detach_helper() [with T = QDBusObjectPath]' /usr/include/qt4/QtCore/qlist.h:122:93: required from 'QList<T>::QList(const QList<T>&) [with T = QDBusObjectPath]' /usr/include/qt4/QtCore/qmetatype.h:142:12: required from 'void* qMetaTypeConstructHelper(const T*) [with T = QList<QDBusObjectPath>]' /usr/include/qt4/QtCore/qmetatype.h:196:18: required from 'int qRegisterMetaType(const char*, T*) [with T = QList<QDBusObjectPath>]' /usr/include/qt4/QtDBus/qdbusextratypes.h:186:1: required from here /usr/include/qt4/QtCore/qlist.h:399:30: warning: implicitly-declared 'QDBusObjectPath::QDBusObjectPath(const QDBusObjectPath&)' is deprecated [-Wdeprecated-copy] 399 | current->v = new T(*reinterpret_cast<T*>(src->v)); | ^~~~~~~~~~~~~~~~~~~~~~~~~~~~~~~~~~~~ In file included from /usr/include/qt4/QtDBus/qdbusabstractinterface.h:51, from /usr/include/qt4/QtDBus/QtDBus:5, from /tmp/B.RqkkiH/BUILD/kdesdk-kioslaves-4.14.3/build/svn/ksvnd/ksvndadaptor.h:16, from /tmp/B.RqkkiH/BUILD/kdesdk-kioslaves-4.14.3/build/svn/ksvnd/ksvndadaptor.cpp:11: /usr/include/qt4/QtDBus/qdbusextratypes.h:93:25: note: because 'QDBusObjectPath' has user-provided 'QDBusObjectPath& QDBusObjectPath::operator=(const QDBusObjectPath&)' 93 | inline QDBusObjectPath &QDBusObjectPath::operator=(const QDBusObjectPath &_path) | ^~~~~~~~~~~~~~~ In file included from /usr/include/qt4/QtCore/qobject.h:50, from /usr/include/qt4/QtCore/QObject:1, from /tmp/B.RqkkiH/BUILD/kdesdk-kioslaves-4.14.3/build/svn/ksvnd/ksvndadaptor.h:15, from /tmp/B.RqkkiH/BUILD/kdesdk-kioslaves-4.14.3/build/svn/ksvnd/ksvndadaptor.cpp:11: /usr/include/qt4/QtCore/qlist.h:412:17: warning: implicitly-declared 'QDBusObjectPath::QDBusObjectPath(const QDBusObjectPath&)' is deprecated [-Wdeprecated-copy] 412 | new (current) T(*reinterpret_cast<T*>(src)); | ^~~~~~~~~~~~~~~~~~~~~~~~~~~~~~~~~~~~~~~~~~~ In file included from /usr/include/qt4/QtDBus/qdbusabstractinterface.h:51, from /usr/include/qt4/QtDBus/QtDBus:5, from /tmp/B.RqkkiH/BUILD/kdesdk-kioslaves-4.14.3/build/svn/ksvnd/ksvndadaptor.h:16, from /tmp/B.RqkkiH/BUILD/kdesdk-kioslaves-4.14.3/build/svn/ksvnd/ksvndadaptor.cpp:11: /usr/include/qt4/QtDBus/qdbusextratypes.h:93:25: note: because 'QDBusObjectPath' has user-provided 'QDBusObjectPath& QDBusObjectPath::operator=(const QDBusObjectPath&)' 93 | inline QDBusObjectPath &QDBusObjectPath::operator=(const QDBusObjectPath &_path) | ^~~~~~~~~~~~~~~ In file included from /usr/include/qt4/QtCore/qobject.h:50, from /usr/include/qt4/QtCore/QObject:1, from /tmp/B.RqkkiH/BUILD/kdesdk-kioslaves-4.14.3/build/svn/ksvnd/ksvndadaptor.h:15, from /tmp/B.RqkkiH/BUILD/kdesdk-kioslaves-4.14.3/build/svn/ksvnd/ksvndadaptor.cpp:11: /usr/include/qt4/QtCore/qlist.h: In instantiation of 'void QList<T>::node_copy(QList<T>::Node*, QList<T>::Node*, QList<T>::Node*) [with T = QDBusSignature]': /usr/include/qt4/QtCore/qlist.h:711:9: required from 'void QList<T>::detach_helper(int) [with T = QDBusSignature]' /usr/include/qt4/QtCore/qlist.h:725:18: required from 'void QList<T>::detach_helper() [with T = QDBusSignature]' /usr/include/qt4/QtCore/qlist.h:122:93: required from 'QList<T>::QList(const QList<T>&) [with T = QDBusSignature]' /usr/include/qt4/QtCore/qmetatype.h:142:12: required from 'void* qMetaTypeConstructHelper(const T*) [with T = QList<QDBusSignature>]' /usr/include/qt4/QtCore/qmetatype.h:196:18: required from 'int qRegisterMetaType(const char*, T*) [with T = QList<QDBusSignature>]' /usr/include/qt4/QtDBus/qdbusextratypes.h:188:1: required from here /usr/include/qt4/QtCore/qlist.h:399:30: warning: implicitly-declared 'QDBusSignature::QDBusSignature(const QDBusSignature&)' is deprecated [-Wdeprecated-copy] 399 | current->v = new T(*reinterpret_cast<T*>(src->v)); | ^~~~~~~~~~~~~~~~~~~~~~~~~~~~~~~~~~~~ In file included from /usr/include/qt4/QtDBus/qdbusabstractinterface.h:51, from /usr/include/qt4/QtDBus/QtDBus:5, from /tmp/B.RqkkiH/BUILD/kdesdk-kioslaves-4.14.3/build/svn/ksvnd/ksvndadaptor.h:16, from /tmp/B.RqkkiH/BUILD/kdesdk-kioslaves-4.14.3/build/svn/ksvnd/ksvndadaptor.cpp:11: /usr/include/qt4/QtDBus/qdbusextratypes.h:143:24: note: because 'QDBusSignature' has user-provided 'QDBusSignature& QDBusSignature::operator=(const QDBusSignature&)' 143 | inline QDBusSignature &QDBusSignature::operator=(const QDBusSignature &dbusSignature) | ^~~~~~~~~~~~~~ In file included from /usr/include/qt4/QtCore/qobject.h:50, from /usr/include/qt4/QtCore/QObject:1, from /tmp/B.RqkkiH/BUILD/kdesdk-kioslaves-4.14.3/build/svn/ksvnd/ksvndadaptor.h:15, from /tmp/B.RqkkiH/BUILD/kdesdk-kioslaves-4.14.3/build/svn/ksvnd/ksvndadaptor.cpp:11: /usr/include/qt4/QtCore/qlist.h:412:17: warning: implicitly-declared 'QDBusSignature::QDBusSignature(const QDBusSignature&)' is deprecated [-Wdeprecated-copy] 412 | new (current) T(*reinterpret_cast<T*>(src)); | ^~~~~~~~~~~~~~~~~~~~~~~~~~~~~~~~~~~~~~~~~~~ In file included from /usr/include/qt4/QtDBus/qdbusabstractinterface.h:51, from /usr/include/qt4/QtDBus/QtDBus:5, from /tmp/B.RqkkiH/BUILD/kdesdk-kioslaves-4.14.3/build/svn/ksvnd/ksvndadaptor.h:16, from /tmp/B.RqkkiH/BUILD/kdesdk-kioslaves-4.14.3/build/svn/ksvnd/ksvndadaptor.cpp:11: /usr/include/qt4/QtDBus/qdbusextratypes.h:143:24: note: because 'QDBusSignature' has user-provided 'QDBusSignature& QDBusSignature::operator=(const QDBusSignature&)' 143 | inline QDBusSignature &QDBusSignature::operator=(const QDBusSignature &dbusSignature) | ^~~~~~~~~~~~~~ make[2]: Leaving directory '/tmp/B.RqkkiH/BUILD/kdesdk-kioslaves-4.14.3/build' make[2]: Entering directory '/tmp/B.RqkkiH/BUILD/kdesdk-kioslaves-4.14.3/build' [ 56%] Building CXX object svn/svnhelper/CMakeFiles/kio_svn_helper.dir/kio_svn_helper.cpp.o cd /tmp/B.RqkkiH/BUILD/kdesdk-kioslaves-4.14.3/build/svn/svnhelper && /usr/bin/i686-pld-linux-g++ -D_BSD_SOURCE -D_DEFAULT_SOURCE -I/tmp/B.RqkkiH/BUILD/kdesdk-kioslaves-4.14.3/build/svn/svnhelper -I/tmp/B.RqkkiH/BUILD/kdesdk-kioslaves-4.14.3/svn/svnhelper -I/tmp/B.RqkkiH/BUILD/kdesdk-kioslaves-4.14.3 -I/tmp/B.RqkkiH/BUILD/kdesdk-kioslaves-4.14.3/build -I/usr/include/KDE -I/usr/include/qt4/phonon -I/usr/include/qt4/QtXmlPatterns -I/usr/include/qt4/QtXml -I/usr/include/qt4/QtWebKit -I/usr/include/qt4/QtUiTools -I/usr/include/qt4/QtTest -I/usr/include/qt4/QtSvg -I/usr/include/qt4/QtSql -I/usr/include/qt4/QtScriptTools -I/usr/include/qt4/QtScript -I/usr/include/qt4/QtOpenGL -I/usr/include/qt4/QtNetwork -I/usr/include/qt4/QtMultimedia -I/usr/include/qt4/QtHelp -I/usr/include/qt4/QtDesigner -I/usr/include/qt4/QtDeclarative -I/usr/include/qt4/QtDBus -I/usr/include/qt4/QtAssistant -I/usr/include/qt4/Qt3Support -I/usr/include/qt4/QtGui -I/usr/include/qt4/QtCore -I/usr/include/qt4/Qt -I/usr/share/qt4/mkspecs/default -I/usr/include/qt4 -I/usr/include/apr -I/usr/include/apr-util -Wnon-virtual-dtor -Wno-long-long -Wundef -Wcast-align -Wchar-subscripts -Wall -W -Wpointer-arith -Wformat-security -fno-exceptions -DQT_NO_EXCEPTIONS -fno-check-new -fno-common -Woverloaded-virtual -O2 -fwrapv -pipe -Wformat -Werror=format-security -gdwarf-4 -fno-debug-types-section -fvar-tracking-assignments -g2 -Wp,-D_FORTIFY_SOURCE=2 -fstack-protector-strong --param=ssp-buffer-size=4 -Werror=trampolines -fomit-frame-pointer -march=i686 -fasynchronous-unwind-tables -mtune=pentium4 -gdwarf-4 -fno-debug-types-section -fvar-tracking-assignments -g2 -DNDEBUG -DQT_NO_DEBUG -DNDEBUG -DQT_NO_DEBUG -o CMakeFiles/kio_svn_helper.dir/kio_svn_helper.cpp.o -c /tmp/B.RqkkiH/BUILD/kdesdk-kioslaves-4.14.3/svn/svnhelper/kio_svn_helper.cpp make[2]: Leaving directory '/tmp/B.RqkkiH/BUILD/kdesdk-kioslaves-4.14.3/build' make[2]: Entering directory '/tmp/B.RqkkiH/BUILD/kdesdk-kioslaves-4.14.3/build' [ 82%] Building CXX object svn/ksvnd/CMakeFiles/kded_ksvnd.dir/ksvnd.cpp.o cd /tmp/B.RqkkiH/BUILD/kdesdk-kioslaves-4.14.3/build/svn/ksvnd && /usr/bin/i686-pld-linux-g++ -DMAKE_KDED_KSVND_LIB -D_BSD_SOURCE -D_DEFAULT_SOURCE -I/tmp/B.RqkkiH/BUILD/kdesdk-kioslaves-4.14.3/build/svn/ksvnd -I/tmp/B.RqkkiH/BUILD/kdesdk-kioslaves-4.14.3/svn/ksvnd -I/tmp/B.RqkkiH/BUILD/kdesdk-kioslaves-4.14.3 -I/tmp/B.RqkkiH/BUILD/kdesdk-kioslaves-4.14.3/build -I/usr/include/KDE -I/usr/include/qt4/phonon -I/usr/include/qt4/QtXmlPatterns -I/usr/include/qt4/QtXml -I/usr/include/qt4/QtWebKit -I/usr/include/qt4/QtUiTools -I/usr/include/qt4/QtTest -I/usr/include/qt4/QtSvg -I/usr/include/qt4/QtSql -I/usr/include/qt4/QtScriptTools -I/usr/include/qt4/QtScript -I/usr/include/qt4/QtOpenGL -I/usr/include/qt4/QtNetwork -I/usr/include/qt4/QtMultimedia -I/usr/include/qt4/QtHelp -I/usr/include/qt4/QtDesigner -I/usr/include/qt4/QtDeclarative -I/usr/include/qt4/QtDBus -I/usr/include/qt4/QtAssistant -I/usr/include/qt4/Qt3Support -I/usr/include/qt4/QtGui -I/usr/include/qt4/QtCore -I/usr/include/qt4/Qt -I/usr/share/qt4/mkspecs/default -I/usr/include/qt4 -I/usr/include/apr -I/usr/include/apr-util -Wnon-virtual-dtor -Wno-long-long -Wundef -Wcast-align -Wchar-subscripts -Wall -W -Wpointer-arith -Wformat-security -fno-exceptions -DQT_NO_EXCEPTIONS -fno-check-new -fno-common -Woverloaded-virtual -O2 -fwrapv -pipe -Wformat -Werror=format-security -gdwarf-4 -fno-debug-types-section -fvar-tracking-assignments -g2 -Wp,-D_FORTIFY_SOURCE=2 -fstack-protector-strong --param=ssp-buffer-size=4 -Werror=trampolines -fomit-frame-pointer -march=i686 -fasynchronous-unwind-tables -mtune=pentium4 -gdwarf-4 -fno-debug-types-section -fvar-tracking-assignments -g2 -DNDEBUG -DQT_NO_DEBUG -DNDEBUG -DQT_NO_DEBUG -fPIC -o CMakeFiles/kded_ksvnd.dir/ksvnd.cpp.o -c /tmp/B.RqkkiH/BUILD/kdesdk-kioslaves-4.14.3/svn/ksvnd/ksvnd.cpp /tmp/B.RqkkiH/BUILD/kdesdk-kioslaves-4.14.3/svn/ksvnd/ksvnd.cpp: In member function 'QStringList KSvnd::getTopLevelActionMenu(const QStringList&)': /tmp/B.RqkkiH/BUILD/kdesdk-kioslaves-4.14.3/svn/ksvnd/ksvnd.cpp:345:40: warning: suggest parentheses around '&&' within '||' [-Wparentheses] 345 | if ( ( listStatus & AllParentsHaveSvn && | ~~~~~~~~~~~~~~~~~~~~~~~~~~~~~~~^~ 346 | ( ( listStatus & SomeAreExternalToParent ) || ( listStatus & SomeAreInParentsEntries ) ) | ~~~~~~~~~~~~~~~~~~~~~~~~~~~~~~~~~~~~~~~~~~~~~~~~~~~~~~~~~~~~~~~~~~~~~~~~~~~~~~~~~~~~~~~~ make[2]: Leaving directory '/tmp/B.RqkkiH/BUILD/kdesdk-kioslaves-4.14.3/build' make[2]: Entering directory '/tmp/B.RqkkiH/BUILD/kdesdk-kioslaves-4.14.3/build' [ 95%] Linking CXX shared module ../../lib/kded_ksvnd.so cd /tmp/B.RqkkiH/BUILD/kdesdk-kioslaves-4.14.3/build/svn/ksvnd && /usr/bin/cmake -E cmake_link_script CMakeFiles/kded_ksvnd.dir/link.txt --verbose=1 /usr/bin/i686-pld-linux-g++ -fPIC -Wnon-virtual-dtor -Wno-long-long -Wundef -Wcast-align -Wchar-subscripts -Wall -W -Wpointer-arith -Wformat-security -fno-exceptions -DQT_NO_EXCEPTIONS -fno-check-new -fno-common -Woverloaded-virtual -O2 -fwrapv -pipe -Wformat -Werror=format-security -gdwarf-4 -fno-debug-types-section -fvar-tracking-assignments -g2 -Wp,-D_FORTIFY_SOURCE=2 -fstack-protector-strong --param=ssp-buffer-size=4 -Werror=trampolines -fomit-frame-pointer -march=i686 -fasynchronous-unwind-tables -mtune=pentium4 -gdwarf-4 -fno-debug-types-section -fvar-tracking-assignments -g2 -DNDEBUG -DQT_NO_DEBUG -DNDEBUG -DQT_NO_DEBUG -Wl,--enable-new-dtags -Wl,--fatal-warnings -Wl,--no-undefined -lc -Wl,--as-needed -Wl,--no-copy-dt-needed-entries -Wl,-z,relro -Wl,-z,combreloc -shared -o ../../lib/kded_ksvnd.so CMakeFiles/kded_ksvnd.dir/kded_ksvnd_automoc.cpp.o CMakeFiles/kded_ksvnd.dir/ksvnd.cpp.o CMakeFiles/kded_ksvnd.dir/ksvndadaptor.cpp.o /usr/lib/libkio.so.5.14.38 /usr/lib/libQtNetwork.so /usr/lib/libQtXml.so /usr/lib/libkdeui.so.5.14.38 /usr/lib/libQtGui.so /usr/lib/libQtSvg.so /usr/lib/libkdecore.so.5.14.38 /usr/lib/libQtDBus.so /usr/lib/libQtCore.so -lpthread make[2]: Leaving directory '/tmp/B.RqkkiH/BUILD/kdesdk-kioslaves-4.14.3/build' make[1]: Entering directory '/tmp/B.RqkkiH/BUILD/kdesdk-kioslaves-4.14.3/build' [ 95%] Built target kded_ksvnd make[1]: Leaving directory '/tmp/B.RqkkiH/BUILD/kdesdk-kioslaves-4.14.3/build' make[2]: Entering directory '/tmp/B.RqkkiH/BUILD/kdesdk-kioslaves-4.14.3/build' [ 91%] Linking CXX executable kio_svn_helper cd /tmp/B.RqkkiH/BUILD/kdesdk-kioslaves-4.14.3/build/svn/svnhelper && /usr/bin/cmake -E cmake_link_script CMakeFiles/kio_svn_helper.dir/link.txt --verbose=1 /usr/bin/i686-pld-linux-g++ -Wnon-virtual-dtor -Wno-long-long -Wundef -Wcast-align -Wchar-subscripts -Wall -W -Wpointer-arith -Wformat-security -fno-exceptions -DQT_NO_EXCEPTIONS -fno-check-new -fno-common -Woverloaded-virtual -O2 -fwrapv -pipe -Wformat -Werror=format-security -gdwarf-4 -fno-debug-types-section -fvar-tracking-assignments -g2 -Wp,-D_FORTIFY_SOURCE=2 -fstack-protector-strong --param=ssp-buffer-size=4 -Werror=trampolines -fomit-frame-pointer -march=i686 -fasynchronous-unwind-tables -mtune=pentium4 -gdwarf-4 -fno-debug-types-section -fvar-tracking-assignments -g2 -DNDEBUG -DQT_NO_DEBUG -DNDEBUG -DQT_NO_DEBUG -Wl,--enable-new-dtags -Wl,--as-needed -Wl,--no-copy-dt-needed-entries -Wl,-z,relro -Wl,-z,combreloc -rdynamic CMakeFiles/kio_svn_helper.dir/kio_svn_helper_automoc.cpp.o CMakeFiles/kio_svn_helper.dir/kio_svn_helper.cpp.o -o kio_svn_helper /usr/lib/libkio.so.5.14.38 /usr/lib/libQtNetwork.so /usr/lib/libQtXml.so /usr/lib/libkdeui.so.5.14.38 /usr/lib/libQtGui.so /usr/lib/libQtSvg.so /usr/lib/libkdecore.so.5.14.38 /usr/lib/libQtDBus.so /usr/lib/libQtCore.so -lpthread cd /tmp/B.RqkkiH/BUILD/kdesdk-kioslaves-4.14.3/build/svn/svnhelper && /usr/bin/cmake -D_filename=/tmp/B.RqkkiH/BUILD/kdesdk-kioslaves-4.14.3/build/svn/svnhelper/kio_svn_helper.shell -D_library_path_variable=LD_LIBRARY_PATH -D_ld_library_path="/tmp/B.RqkkiH/BUILD/kdesdk-kioslaves-4.14.3/build/lib/./:/usr/lib:/usr/lib:/usr/lib" -D_executable=/tmp/B.RqkkiH/BUILD/kdesdk-kioslaves-4.14.3/build/svn/svnhelper/kio_svn_helper -P /usr/share/apps/cmake/modules/kde4_exec_via_sh.cmake make[2]: Leaving directory '/tmp/B.RqkkiH/BUILD/kdesdk-kioslaves-4.14.3/build' make[1]: Entering directory '/tmp/B.RqkkiH/BUILD/kdesdk-kioslaves-4.14.3/build' [ 95%] Built target kio_svn_helper make[1]: Leaving directory '/tmp/B.RqkkiH/BUILD/kdesdk-kioslaves-4.14.3/build' make: *** [Makefile:164: all] Error 2 error: Bad exit status from /tmp/B.RqkkiH/BUILD/tmp/rpm-tmp.15794 (%build) RPM build errors: Bad exit status from /tmp/B.RqkkiH/BUILD/tmp/rpm-tmp.15794 (%build) ended at: Tue Jun 2 09:42:51 2020, done in 0:00:07.718512 error: No files produced. + chmod -R u+rwX /tmp/B.RqkkiH/BUILD + rm -rf /tmp/B.RqkkiH/tmp /tmp/B.RqkkiH/BUILD + rm -rf /tmp/B.RqkkiH Begin-PLD-Builder-Info Build-Time: user:23.56s sys:3.07s real:20.50s (faults io:19 non-io:750163) End-PLD-Builder-Info
[Back to list of logs] [View rpm -qa of builder]