FailedOk

th/SRPMS[OK]
th/x32[OK]
th/i686[OK]
th/x86_64[OK]

ac/SRPMS[OK]
ac/i386[OK]
ac/i586[OK]
ac/i686[OK]
ac/alpha[OK]
ac/amd64[OK]
ac/athlon[OK]
ac/ppc[OK]
ac/sparc[OK]
ac/sparc64[OK]

Advanced Search
main()
Powered by PLD Linux
(c) 2002-2019 PLD Team
$Revision: 1.37 $
Powered by Lunatic Corp.
Your IP: 18.212.239.56

kernel 70db34df-a574-4dcf-bd5a-003109049893

Status:Failed
Source URL:ftp://buildlogs.pld-linux.org/th/i686/FAIL/kernel,70db34df-a574-4dcf-bd5a-003109049893.bz2
text/plain URL:View!
full text:View!
rpm -qa of builder:View!
Date:2019/02/09 18:05:56
Runtime:0:00:24.032682

Toc:

  • error 1
  • /tmp/B.0Q3t7i/BUILD/kernel-4.14-4.14.98/linux-4.14/security/selinux/include/classmap.h:245:2: error: #error New address family defined, please update secclass_map.
  • error 2
  • make[5]: *** [scripts/Makefile.host:102: scripts/selinux/genheaders/genheaders] Error 1
  • error 3
  • make[4]: *** [/tmp/B.0Q3t7i/BUILD/kernel-4.14-4.14.98/linux-4.14/scripts/Makefile.build:585: scripts/selinux/genheaders] Error 2
  • error 4
  • /tmp/B.0Q3t7i/BUILD/kernel-4.14-4.14.98/linux-4.14/security/selinux/include/classmap.h:245:2: error: #error New address family defined, please update secclass_map.
  • error 5
  • make[5]: *** [scripts/Makefile.host:102: scripts/selinux/mdp/mdp] Error 1
  • error 6
  • make[4]: *** [/tmp/B.0Q3t7i/BUILD/kernel-4.14-4.14.98/linux-4.14/scripts/Makefile.build:585: scripts/selinux/mdp] Error 2
  • error 7
  • make[3]: *** [/tmp/B.0Q3t7i/BUILD/kernel-4.14-4.14.98/linux-4.14/scripts/Makefile.build:585: scripts/selinux] Error 2
  • error 8
  • make[2]: *** [/tmp/B.0Q3t7i/BUILD/kernel-4.14-4.14.98/linux-4.14/Makefile:572: scripts] Error 2
  • error 9
  • make[1]: *** [Makefile:146: sub-make] Error 2
  • error 10
  • error: Bad exit status from /tmp/B.0Q3t7i/BUILD/tmp/rpm-tmp.38980 (%build)
  • error 11
  • RPM build errors:
  • error 12
  • error: No files produced.

Content:

/tmp/B.0Q3t7i/BUILD/kernel-4.14-4.14.98
+ /usr/bin/make -Otarget -j9 'TARGETOBJ=i386-gcc-8.2.0' oldconfig
/usr/bin/make -C /tmp/B.0Q3t7i/BUILD/kernel-4.14-4.14.98/linux-4.14 O=/tmp/B.0Q3t7i/BUILD/kernel-4.14-4.14.98/i386-gcc-8.2.0 ARCH=i386 CC="i686-pld-linux-gcc" HOSTCC="i686-pld-linux-gcc -D_FILE_OFFSET_BITS=64" oldconfig
make[2]: Entering directory '/tmp/B.0Q3t7i/BUILD/kernel-4.14-4.14.98/i386-gcc-8.2.0'
  GEN     ./Makefile
make[2]: Leaving directory '/tmp/B.0Q3t7i/BUILD/kernel-4.14-4.14.98/i386-gcc-8.2.0'
  HOSTCC  scripts/basic/fixdep
  SHIPPED scripts/kconfig/zconf.tab.c
  SHIPPED scripts/kconfig/zconf.lex.c
  HOSTCC  scripts/kconfig/conf.o
  HOSTCC  scripts/kconfig/zconf.tab.o
  HOSTLD  scripts/kconfig/conf
scripts/kconfig/conf  --oldconfig Kconfig
*
* Restart config...
*
*
* EFI (Extensible Firmware Interface) Support
*
EFI Variable Support via sysfs (EFI_VARS) [M/y/?] m
Register efivars backend for pstore (EFI_VARS_PSTORE) [M/n/?] m
  Disable using efivars as a pstore backend by default (EFI_VARS_PSTORE_DEFAULT_DISABLE) [N/y/?] n
Export efi runtime maps to sysfs (EFI_RUNTIME_MAP) [Y/n/?] y
Enable EFI fake memory map (EFI_FAKE_MEMMAP) [N/y/?] n
EFI Bootloader Control (EFI_BOOTLOADER_CONTROL) [M/n/?] m
EFI capsule loader (EFI_CAPSULE_LOADER) [Y/?] y
Add support for Quark capsules with non-standard headers (EFI_CAPSULE_QUIRK_QUARK_CSH) [Y/n/?] (NEW) 
Error in reading or end of file.

EFI Runtime Service Tests Support (EFI_TEST) [M/n/y/?] m
Apple Device Properties (APPLE_PROPERTIES) [Y/?] (NEW) y
Reset memory attack mitigation (RESET_ATTACK_MITIGATION) [Y/n/?] y
#
# configuration written to .config
#
+ mawk -v 'infile=/tmp/B.0Q3t7i/BUILD/kernel-4.14-4.14.98/i386-gcc-8.2.0/arch/x86/defconfig' -f /tmp/B.0Q3t7i/kernel-track-config-change.awk /tmp/B.0Q3t7i/BUILD/kernel-4.14-4.14.98/i386-gcc-8.2.0/.config
ERROR (kernel-multiarch.config): CONFIG_KALLSYMS_ABSOLUTE_PERCPU redefined from `y' to `n'
ERROR (kernel-multiarch.config): CONFIG_MODVERSIONS redefined from `n' to `y'
ERROR (kernel-x86.config): CONFIG_VM86 redefined from `y' to `n'
ERROR (kernel-multiarch.config): CONFIG_EFI_CAPSULE_LOADER redefined from `m' to `y'
ERROR (kernel-multiarch.config): CONFIG_PAGE_EXTENSION redefined from `n' to `y'
ERROR (kernel-multiarch.config): CONFIG_UNWINDER_FRAME_POINTER redefined from `n' to `y'
ERROR (kernel-multiarch.config): CONFIG_CRYPTO_AEAD redefined from `m' to `y'
ERROR (kernel-multiarch.config): CONFIG_CRYPTO_GF128MUL redefined from `m' to `y'
ERROR (kernel-multiarch.config): CONFIG_CRYPTO_NULL redefined from `m' to `y'
ERROR (kernel-multiarch.config): CONFIG_CRYPTO_GCM redefined from `m' to `y'
ERROR (kernel-multiarch.config): CONFIG_CRYPTO_SEQIV redefined from `m' to `y'
ERROR (kernel-multiarch.config): CONFIG_CRYPTO_CTR redefined from `m' to `y'
ERROR (kernel-multiarch.config): CONFIG_CRYPTO_GHASH redefined from `m' to `y'
ERROR (kernel-multiarch.config): CONFIG_CRYPTO_DRBG_MENU redefined from `m' to `y'
ERROR (kernel-multiarch.config): CONFIG_CRYPTO_JITTERENTROPY redefined from `m' to `y'
There were 15 errors
+ /usr/bin/make -Otarget -j9 'TARGETOBJ=i386-gcc-8.2.0' all
/usr/bin/make -C /tmp/B.0Q3t7i/BUILD/kernel-4.14-4.14.98/linux-4.14 O=/tmp/B.0Q3t7i/BUILD/kernel-4.14-4.14.98/i386-gcc-8.2.0 ARCH=i386 CC="i686-pld-linux-gcc" HOSTCC="i686-pld-linux-gcc -D_FILE_OFFSET_BITS=64" 
  GEN     ./Makefile
scripts/kconfig/conf  --silentoldconfig Kconfig
make[2]: Entering directory '/tmp/B.0Q3t7i/BUILD/kernel-4.14-4.14.98/i386-gcc-8.2.0'
  GEN     ./Makefile
make[2]: Leaving directory '/tmp/B.0Q3t7i/BUILD/kernel-4.14-4.14.98/i386-gcc-8.2.0'
make[2]: Entering directory '/tmp/B.0Q3t7i/BUILD/kernel-4.14-4.14.98/i386-gcc-8.2.0'
  CHK     include/generated/uapi/linux/version.h
  UPD     include/generated/uapi/linux/version.h
make[2]: Leaving directory '/tmp/B.0Q3t7i/BUILD/kernel-4.14-4.14.98/i386-gcc-8.2.0'
  SYSHDR  arch/x86/include/generated/uapi/asm/unistd_x32.h
  SYSHDR  arch/x86/include/generated/uapi/asm/unistd_64.h
  SYSHDR  arch/x86/include/generated/uapi/asm/unistd_32.h
make[2]: Entering directory '/tmp/B.0Q3t7i/BUILD/kernel-4.14-4.14.98/i386-gcc-8.2.0'
  CHK     include/config/kernel.release
  UPD     include/config/kernel.release
make[2]: Leaving directory '/tmp/B.0Q3t7i/BUILD/kernel-4.14-4.14.98/i386-gcc-8.2.0'
  HOSTCC  scripts/basic/bin2c
  HYPERCALLS arch/x86/include/generated/asm/xen-hypercalls.h
make[2]: Entering directory '/tmp/B.0Q3t7i/BUILD/kernel-4.14-4.14.98/i386-gcc-8.2.0'
  Using /tmp/B.0Q3t7i/BUILD/kernel-4.14-4.14.98/linux-4.14 as source for kernel
make[2]: Leaving directory '/tmp/B.0Q3t7i/BUILD/kernel-4.14-4.14.98/i386-gcc-8.2.0'
  WRAP    arch/x86/include/generated/asm/clkdev.h
  WRAP    arch/x86/include/generated/asm/dma-contiguous.h
  WRAP    arch/x86/include/generated/asm/early_ioremap.h
  WRAP    arch/x86/include/generated/asm/mcs_spinlock.h
  WRAP    arch/x86/include/generated/asm/mm-arch-hooks.h
make[2]: Entering directory '/tmp/B.0Q3t7i/BUILD/kernel-4.14-4.14.98/i386-gcc-8.2.0'
  CHK     include/generated/utsrelease.h
  UPD     include/generated/utsrelease.h
make[2]: Leaving directory '/tmp/B.0Q3t7i/BUILD/kernel-4.14-4.14.98/i386-gcc-8.2.0'
  HOSTCC  arch/x86/tools/relocs_common.o
  GENSEED scripts/gcc-plugins/randomize_layout_seed.h
  HOSTCC  arch/x86/tools/relocs_32.o
  SYSTBL  arch/x86/include/generated/asm/syscalls_32.h
  HOSTCC  arch/x86/tools/relocs_64.o
  HOSTLD  arch/x86/tools/relocs
  HOSTCXX -fPIC scripts/gcc-plugins/structleak_plugin.o
  HOSTLLD -shared scripts/gcc-plugins/structleak_plugin.so
  HOSTCXX -fPIC scripts/gcc-plugins/randomize_layout_plugin.o
  HOSTLLD -shared scripts/gcc-plugins/randomize_layout_plugin.so
  CHK     include/generated/timeconst.h
  UPD     include/generated/timeconst.h
  CC      scripts/mod/empty.o
  HOSTCC  scripts/selinux/genheaders/genheaders
In file included from /tmp/B.0Q3t7i/BUILD/kernel-4.14-4.14.98/linux-4.14/scripts/selinux/genheaders/genheaders.c:19:
/tmp/B.0Q3t7i/BUILD/kernel-4.14-4.14.98/linux-4.14/security/selinux/include/classmap.h:245:2: error: #error New address family defined, please update secclass_map.
 #error New address family defined, please update secclass_map.
  ^~~~~
make[5]: *** [scripts/Makefile.host:102: scripts/selinux/genheaders/genheaders] Error 1
make[4]: *** [/tmp/B.0Q3t7i/BUILD/kernel-4.14-4.14.98/linux-4.14/scripts/Makefile.build:585: scripts/selinux/genheaders] Error 2
make[4]: *** Waiting for unfinished jobs....
  CC      kernel/bounds.s
  CHK     include/generated/bounds.h
  UPD     include/generated/bounds.h
  HOSTCC  scripts/selinux/mdp/mdp
In file included from /tmp/B.0Q3t7i/BUILD/kernel-4.14-4.14.98/linux-4.14/scripts/selinux/mdp/mdp.c:49:
/tmp/B.0Q3t7i/BUILD/kernel-4.14-4.14.98/linux-4.14/security/selinux/include/classmap.h:245:2: error: #error New address family defined, please update secclass_map.
 #error New address family defined, please update secclass_map.
  ^~~~~
make[5]: *** [scripts/Makefile.host:102: scripts/selinux/mdp/mdp] Error 1
make[4]: *** [/tmp/B.0Q3t7i/BUILD/kernel-4.14-4.14.98/linux-4.14/scripts/Makefile.build:585: scripts/selinux/mdp] Error 2
make[3]: *** [/tmp/B.0Q3t7i/BUILD/kernel-4.14-4.14.98/linux-4.14/scripts/Makefile.build:585: scripts/selinux] Error 2
make[3]: *** Waiting for unfinished jobs....
  CC      scripts/mod/devicetable-offsets.s
  HOSTCC  scripts/conmakehash
  CHK     scripts/mod/devicetable-offsets.h
  UPD     scripts/mod/devicetable-offsets.h
  SHIPPED scripts/genksyms/parse.tab.c
  SHIPPED scripts/genksyms/lex.lex.c
  HOSTCC  scripts/mod/mk_elfconfig
  SHIPPED scripts/genksyms/parse.tab.h
  MKELF   scripts/mod/elfconfig.h
  GEN     scripts/gdb/linux/constants.py
  HOSTCC  scripts/genksyms/genksyms.o
  HOSTCC  scripts/sortextable
  HOSTCC  scripts/kallsyms
  HOSTCC  scripts/genksyms/parse.tab.o
  HOSTCC  scripts/recordmcount
  CC      arch/x86/kernel/asm-offsets.s
  HOSTCC  scripts/mod/sumversion.o
  CHK     include/generated/asm-offsets.h
  UPD     include/generated/asm-offsets.h
  CALL    /tmp/B.0Q3t7i/BUILD/kernel-4.14-4.14.98/linux-4.14/scripts/checksyscalls.sh
  HOSTCC  scripts/genksyms/lex.lex.o
  HOSTLD  scripts/genksyms/genksyms
  HOSTCC  scripts/mod/file2alias.o
  HOSTCC  scripts/mod/modpost.o
  HOSTLD  scripts/mod/modpost
make[2]: *** [/tmp/B.0Q3t7i/BUILD/kernel-4.14-4.14.98/linux-4.14/Makefile:572: scripts] Error 2
make[1]: *** [Makefile:146: sub-make] Error 2
make: *** [Makefile:9: all] Error 2
error: Bad exit status from /tmp/B.0Q3t7i/BUILD/tmp/rpm-tmp.38980 (%build)


RPM build errors:
    Bad exit status from /tmp/B.0Q3t7i/BUILD/tmp/rpm-tmp.38980 (%build)
ended at: Sat Feb  9 18:05:52 2019, done in 0:00:24.032682
error: No files produced.
+ chmod -R u+rwX /tmp/B.0Q3t7i/BUILD
+ rm -rf /tmp/B.0Q3t7i/tmp /tmp/B.0Q3t7i/BUILD
+ rm -rf /tmp/B.0Q3t7i
Begin-PLD-Builder-Info
Build-Time: user:31.56s sys:10.92s real:59.63s (faults io:0 non-io:1109039)

End-PLD-Builder-Info
[Back to list of logs] [View rpm -qa of builder]