FailedOk

th/SRPMS[OK]
th/x32[OK]
th/i686[OK]
th/x86_64[OK]

ac/SRPMS[OK]
ac/i386[OK]
ac/i586[OK]
ac/i686[OK]
ac/alpha[OK]
ac/amd64[OK]
ac/athlon[OK]
ac/ppc[OK]
ac/sparc[OK]
ac/sparc64[OK]

Advanced Search
main()
Powered by PLD Linux
(c) 2002-2019 PLD Team
$Revision: 1.37 $
Powered by The Golden Path.
Your IP: 3.81.28.94

kernel 9fe74f18-f63f-435f-9b71-b810f2c44f50

Status:Failed
Source URL:ftp://buildlogs.pld-linux.org/th/i686/FAIL/kernel,9fe74f18-f63f-435f-9b71-b810f2c44f50.bz2
text/plain URL:View!
full text:View!
rpm -qa of builder:View!
Date:2018/12/29 13:11:10
Runtime:0:03:28.547283

Toc:

  • error 1
  • error: No files produced.
  • error 2
  • Error: can't open /tmp/B.j97Hah/BUILD/tmp/ccUzesAu.s for reading: No such file or directory
  • error 3
  • make[3]: *** [/tmp/B.j97Hah/BUILD/kernel-nopae-4.20.0/linux-4.20/scripts/Makefile.build:291: kernel/taskstats.o] Error 1
  • error 4
  • Error: can't open /tmp/B.j97Hah/BUILD/tmp/ccePG4sT.s for reading: No such file or directory
  • error 5
  • make[3]: *** [/tmp/B.j97Hah/BUILD/kernel-nopae-4.20.0/linux-4.20/scripts/Makefile.build:291: kernel/tsacct.o] Error 1
  • error 6
  • /tmp/B.j97Hah/BUILD/kernel-nopae-4.20.0/linux-4.20/include/linux/thread_info.h:21:10: fatal error: asm/current.h: No such file or directory
  • error 7
  • compilation terminated.
  • error 8
  • make[4]: *** [/tmp/B.j97Hah/BUILD/kernel-nopae-4.20.0/linux-4.20/scripts/Makefile.build:291: drivers/acpi/spcr.o] Error 1
  • error 9
  • make[3]: *** [/tmp/B.j97Hah/BUILD/kernel-nopae-4.20.0/linux-4.20/scripts/Makefile.build:516: drivers/acpi] Error 2
  • error 10
  • make[2]: *** [/tmp/B.j97Hah/BUILD/kernel-nopae-4.20.0/linux-4.20/Makefile:1055: kernel] Error 2
  • error 11
  • /tmp/B.j97Hah/BUILD/kernel-nopae-4.20.0/linux-4.20/include/linux/highmem.h:12:10: fatal error: asm/cacheflush.h: No such file or directory
  • error 12
  • compilation terminated.
  • error 13
  • make[4]: *** [/tmp/B.j97Hah/BUILD/kernel-nopae-4.20.0/linux-4.20/scripts/Makefile.build:298: drivers/atm/adummy.o] Error 1
  • error 14
  • /tmp/B.j97Hah/BUILD/kernel-nopae-4.20.0/linux-4.20/include/uapi/linux/types.h:5:10: fatal error: asm/types.h: No such file or directory
  • error 15
  • compilation terminated.
  • error 16
  • make[4]: *** [/tmp/B.j97Hah/BUILD/kernel-nopae-4.20.0/linux-4.20/scripts/Makefile.build:297: drivers/ata/ahci.o] Error 1
  • error 17
  • make[3]: *** [/tmp/B.j97Hah/BUILD/kernel-nopae-4.20.0/linux-4.20/scripts/Makefile.build:516: drivers/ata] Error 2
  • error 18
  • /tmp/B.j97Hah/BUILD/kernel-nopae-4.20.0/linux-4.20/include/uapi/linux/types.h:5:10: fatal error: asm/types.h: No such file or directory
  • error 19
  • compilation terminated.
  • error 20
  • make[4]: *** [/tmp/B.j97Hah/BUILD/kernel-nopae-4.20.0/linux-4.20/scripts/Makefile.build:298: drivers/atm/atmdd.o] Error 1
  • error 21
  • /tmp/B.j97Hah/BUILD/kernel-nopae-4.20.0/linux-4.20/include/uapi/linux/types.h:5:10: fatal error: asm/types.h: No such file or directory
  • error 22
  • compilation terminated.
  • error 23
  • make[4]: *** [/tmp/B.j97Hah/BUILD/kernel-nopae-4.20.0/linux-4.20/scripts/Makefile.build:291: drivers/base/component.o] Error 1
  • error 24
  • make[3]: *** [/tmp/B.j97Hah/BUILD/kernel-nopae-4.20.0/linux-4.20/scripts/Makefile.build:516: drivers/atm] Error 2
  • error 25
  • Error: can't open /tmp/B.j97Hah/BUILD/tmp/cchX2WJu.s for reading: No such file or directory
  • error 26
  • make[4]: *** [/tmp/B.j97Hah/BUILD/kernel-nopae-4.20.0/linux-4.20/scripts/Makefile.build:292: fs/btrfs/tests/extent-io-tests.o] Error 1
  • error 27
  • make[5]: *** [/tmp/B.j97Hah/BUILD/kernel-nopae-4.20.0/linux-4.20/scripts/Makefile.build:291: sound/isa/gus/gusclassic.o] Error 2
  • error 28
  • /tmp/B.j97Hah/BUILD/kernel-nopae-4.20.0/linux-4.20/include/uapi/linux/types.h:5:10: fatal error: asm/types.h: No such file or directory
  • error 29
  • compilation terminated.
  • error 30
  • make[5]: *** [/tmp/B.j97Hah/BUILD/kernel-nopae-4.20.0/linux-4.20/scripts/Makefile.build:291: sound/isa/gus/gus_main.o] Error 1
  • error 31
  • make[4]: *** [/tmp/B.j97Hah/BUILD/kernel-nopae-4.20.0/linux-4.20/scripts/Makefile.build:516: sound/isa/gus] Error 2
  • error 32
  • /tmp/B.j97Hah/BUILD/kernel-nopae-4.20.0/linux-4.20/include/uapi/linux/types.h:5:10: fatal error: asm/types.h: No such file or directory
  • error 33
  • compilation terminated.
  • error 34
  • make[4]: *** [/tmp/B.j97Hah/BUILD/kernel-nopae-4.20.0/linux-4.20/scripts/Makefile.build:292: fs/btrfs/tests/inode-tests.o] Error 1
  • error 35
  • make[3]: *** [/tmp/B.j97Hah/BUILD/kernel-nopae-4.20.0/linux-4.20/scripts/Makefile.build:516: fs/btrfs] Error 2
  • error 36
  • make[2]: *** [/tmp/B.j97Hah/BUILD/kernel-nopae-4.20.0/linux-4.20/Makefile:1055: fs] Error 2
  • error 37
  • /tmp/B.j97Hah/BUILD/kernel-nopae-4.20.0/linux-4.20/include/uapi/linux/types.h:5:10: fatal error: asm/types.h: No such file or directory
  • error 38
  • compilation terminated.
  • error 39
  • make[4]: *** [/tmp/B.j97Hah/BUILD/kernel-nopae-4.20.0/linux-4.20/scripts/Makefile.build:291: drivers/base/core.o] Error 1
  • error 40
  • /tmp/B.j97Hah/BUILD/kernel-nopae-4.20.0/linux-4.20/include/uapi/linux/types.h:5:10: fatal error: asm/types.h: No such file or directory
  • error 41
  • compilation terminated.
  • error 42
  • make[5]: *** [/tmp/B.j97Hah/BUILD/kernel-nopae-4.20.0/linux-4.20/scripts/Makefile.build:292: sound/isa/galaxy/azt2316.o] Error 1
  • error 43
  • /tmp/B.j97Hah/BUILD/kernel-nopae-4.20.0/linux-4.20/include/uapi/linux/types.h:5:10: fatal error: asm/types.h: No such file or directory
  • error 44
  • compilation terminated.
  • error 45
  • make[5]: *** [/tmp/B.j97Hah/BUILD/kernel-nopae-4.20.0/linux-4.20/scripts/Makefile.build:291: drivers/base/regmap/regcache.o] Error 1
  • error 46
  • /tmp/B.j97Hah/BUILD/kernel-nopae-4.20.0/linux-4.20/include/uapi/linux/types.h:5:10: fatal error: asm/types.h: No such file or directory
  • error 47
  • compilation terminated.
  • error 48
  • make[5]: *** [/tmp/B.j97Hah/BUILD/kernel-nopae-4.20.0/linux-4.20/scripts/Makefile.build:291: drivers/base/regmap/regcache-rbtree.o] Error 1
  • error 49
  • /tmp/B.j97Hah/BUILD/kernel-nopae-4.20.0/linux-4.20/include/uapi/linux/types.h:5:10: fatal error: asm/types.h: No such file or directory
  • error 50
  • compilation terminated.
  • error 51
  • make[5]: *** [/tmp/B.j97Hah/BUILD/kernel-nopae-4.20.0/linux-4.20/scripts/Makefile.build:291: sound/pci/ac97/ac97_pcm.o] Error 1
  • error 52
  • /tmp/B.j97Hah/BUILD/kernel-nopae-4.20.0/linux-4.20/include/uapi/linux/types.h:5:10: fatal error: asm/types.h: No such file or directory
  • error 53
  • compilation terminated.
  • error 54
  • make[5]: *** [/tmp/B.j97Hah/BUILD/kernel-nopae-4.20.0/linux-4.20/scripts/Makefile.build:291: sound/pci/ac97/ac97_codec.o] Error 1
  • error 55
  • make[4]: *** [/tmp/B.j97Hah/BUILD/kernel-nopae-4.20.0/linux-4.20/scripts/Makefile.build:516: sound/pci/ac97] Error 2
  • error 56
  • /tmp/B.j97Hah/BUILD/kernel-nopae-4.20.0/linux-4.20/include/uapi/linux/types.h:5:10: fatal error: asm/types.h: No such file or directory
  • error 57
  • compilation terminated.
  • error 58
  • make[5]: *** [/tmp/B.j97Hah/BUILD/kernel-nopae-4.20.0/linux-4.20/scripts/Makefile.build:292: sound/pci/ali5451/ali5451.o] Error 1
  • error 59
  • make[4]: *** [/tmp/B.j97Hah/BUILD/kernel-nopae-4.20.0/linux-4.20/scripts/Makefile.build:516: sound/pci/ali5451] Error 2
  • error 60
  • /tmp/B.j97Hah/BUILD/kernel-nopae-4.20.0/linux-4.20/include/uapi/linux/types.h:5:10: fatal error: asm/types.h: No such file or directory
  • error 61
  • compilation terminated.
  • error 62
  • make[5]: *** [/tmp/B.j97Hah/BUILD/kernel-nopae-4.20.0/linux-4.20/scripts/Makefile.build:291: sound/pci/asihpi/asihpi.o] Error 1
  • error 63
  • make[4]: *** [/tmp/B.j97Hah/BUILD/kernel-nopae-4.20.0/linux-4.20/scripts/Makefile.build:516: sound/pci/asihpi] Error 2
  • error 64
  • /tmp/B.j97Hah/BUILD/kernel-nopae-4.20.0/linux-4.20/include/uapi/linux/types.h:5:10: fatal error: asm/types.h: No such file or directory
  • error 65
  • compilation terminated.
  • error 66
  • make[5]: *** [/tmp/B.j97Hah/BUILD/kernel-nopae-4.20.0/linux-4.20/scripts/Makefile.build:292: sound/pcmcia/pdaudiocf/pdaudiocf.o] Error 1
  • error 67
  • /tmp/B.j97Hah/BUILD/kernel-nopae-4.20.0/linux-4.20/include/uapi/linux/types.h:5:10: fatal error: asm/types.h: No such file or directory
  • error 68
  • compilation terminated.
  • error 69
  • make[5]: *** [/tmp/B.j97Hah/BUILD/kernel-nopae-4.20.0/linux-4.20/scripts/Makefile.build:291: sound/pci/au88x0/au8810.o] Error 1
  • error 70
  • make[5]: *** [/tmp/B.j97Hah/BUILD/kernel-nopae-4.20.0/linux-4.20/scripts/Makefile.build:292: sound/isa/galaxy/azt1605.o] Error 2
  • error 71
  • make[4]: *** [/tmp/B.j97Hah/BUILD/kernel-nopae-4.20.0/linux-4.20/scripts/Makefile.build:516: sound/isa/galaxy] Error 2
  • error 72
  • make[3]: *** [/tmp/B.j97Hah/BUILD/kernel-nopae-4.20.0/linux-4.20/scripts/Makefile.build:516: sound/isa] Error 2
  • error 73
  • /tmp/B.j97Hah/BUILD/kernel-nopae-4.20.0/linux-4.20/include/uapi/linux/types.h:5:10: fatal error: asm/types.h: No such file or directory
  • error 74
  • compilation terminated.
  • error 75
  • make[5]: *** [/tmp/B.j97Hah/BUILD/kernel-nopae-4.20.0/linux-4.20/scripts/Makefile.build:292: sound/pcmcia/pdaudiocf/pdaudiocf_core.o] Error 1
  • error 76
  • make[4]: *** [/tmp/B.j97Hah/BUILD/kernel-nopae-4.20.0/linux-4.20/scripts/Makefile.build:516: sound/pcmcia/pdaudiocf] Error 2
  • error 77
  • /tmp/B.j97Hah/BUILD/kernel-nopae-4.20.0/linux-4.20/include/uapi/linux/types.h:5:10: fatal error: asm/types.h: No such file or directory
  • error 78
  • compilation terminated.
  • error 79
  • make[5]: *** [/tmp/B.j97Hah/BUILD/kernel-nopae-4.20.0/linux-4.20/scripts/Makefile.build:291: sound/pci/au88x0/au8820.o] Error 1
  • error 80
  • make[4]: *** [/tmp/B.j97Hah/BUILD/kernel-nopae-4.20.0/linux-4.20/scripts/Makefile.build:516: sound/pci/au88x0] Error 2
  • error 81
  • /tmp/B.j97Hah/BUILD/kernel-nopae-4.20.0/linux-4.20/include/uapi/linux/types.h:5:10: fatal error: asm/types.h: No such file or directory
  • error 82
  • compilation terminated.
  • error 83
  • make[5]: *** [/tmp/B.j97Hah/BUILD/kernel-nopae-4.20.0/linux-4.20/scripts/Makefile.build:292: sound/pci/aw2/aw2-alsa.o] Error 1
  • error 84
  • /tmp/B.j97Hah/BUILD/kernel-nopae-4.20.0/linux-4.20/include/uapi/linux/types.h:5:10: fatal error: asm/types.h: No such file or directory
  • error 85
  • compilation terminated.
  • error 86
  • make[5]: *** [/tmp/B.j97Hah/BUILD/kernel-nopae-4.20.0/linux-4.20/scripts/Makefile.build:291: sound/pcmcia/vx/vxpocket.o] Error 1
  • error 87
  • /tmp/B.j97Hah/BUILD/kernel-nopae-4.20.0/linux-4.20/include/uapi/linux/types.h:5:10: fatal error: asm/types.h: No such file or directory
  • error 88
  • compilation terminated.
  • error 89
  • make[5]: *** [/tmp/B.j97Hah/BUILD/kernel-nopae-4.20.0/linux-4.20/scripts/Makefile.build:291: sound/pcmcia/vx/vxp_ops.o] Error 1
  • error 90
  • make[4]: *** [/tmp/B.j97Hah/BUILD/kernel-nopae-4.20.0/linux-4.20/scripts/Makefile.build:516: sound/pcmcia/vx] Error 2
  • error 91
  • make[3]: *** [/tmp/B.j97Hah/BUILD/kernel-nopae-4.20.0/linux-4.20/scripts/Makefile.build:516: sound/pcmcia] Error 2
  • error 92
  • /tmp/B.j97Hah/BUILD/kernel-nopae-4.20.0/linux-4.20/include/uapi/linux/types.h:5:10: fatal error: asm/types.h: No such file or directory
  • error 93
  • compilation terminated.
  • error 94
  • make[5]: *** [/tmp/B.j97Hah/BUILD/kernel-nopae-4.20.0/linux-4.20/scripts/Makefile.build:292: sound/soc/amd/acp-pcm-dma.o] Error 1
  • error 95
  • /tmp/B.j97Hah/BUILD/kernel-nopae-4.20.0/linux-4.20/include/uapi/linux/types.h:5:10: fatal error: asm/types.h: No such file or directory
  • error 96
  • compilation terminated.
  • error 97
  • make[5]: *** [/tmp/B.j97Hah/BUILD/kernel-nopae-4.20.0/linux-4.20/scripts/Makefile.build:292: sound/pci/aw2/aw2-saa7146.o] Error 1
  • error 98
  • make[4]: *** [/tmp/B.j97Hah/BUILD/kernel-nopae-4.20.0/linux-4.20/scripts/Makefile.build:516: sound/pci/aw2] Error 2
  • error 99
  • make[3]: *** [/tmp/B.j97Hah/BUILD/kernel-nopae-4.20.0/linux-4.20/scripts/Makefile.build:516: sound/pci] Error 2
  • error 100
  • /tmp/B.j97Hah/BUILD/kernel-nopae-4.20.0/linux-4.20/include/uapi/linux/types.h:5:10: fatal error: asm/types.h: No such file or directory
  • error 101
  • compilation terminated.
  • error 102
  • make[5]: *** [/tmp/B.j97Hah/BUILD/kernel-nopae-4.20.0/linux-4.20/scripts/Makefile.build:292: sound/soc/amd/acp-da7219-max98357a.o] Error 1
  • error 103
  • /tmp/B.j97Hah/BUILD/kernel-nopae-4.20.0/linux-4.20/include/uapi/linux/types.h:5:10: fatal error: asm/types.h: No such file or directory
  • error 104
  • compilation terminated.
  • error 105
  • make[5]: *** [/tmp/B.j97Hah/BUILD/kernel-nopae-4.20.0/linux-4.20/scripts/Makefile.build:292: sound/soc/amd/acp-rt5645.o] Error 1
  • error 106
  • make[4]: *** [/tmp/B.j97Hah/BUILD/kernel-nopae-4.20.0/linux-4.20/scripts/Makefile.build:516: sound/soc/amd] Error 2
  • error 107
  • /tmp/B.j97Hah/BUILD/kernel-nopae-4.20.0/linux-4.20/include/uapi/linux/types.h:5:10: fatal error: asm/types.h: No such file or directory
  • error 108
  • compilation terminated.
  • error 109
  • make[5]: *** [/tmp/B.j97Hah/BUILD/kernel-nopae-4.20.0/linux-4.20/scripts/Makefile.build:292: sound/soc/dwc/dwc-i2s.o] Error 1
  • error 110
  • /tmp/B.j97Hah/BUILD/kernel-nopae-4.20.0/linux-4.20/include/uapi/linux/types.h:5:10: fatal error: asm/types.h: No such file or directory
  • error 111
  • compilation terminated.
  • error 112
  • make[5]: *** [/tmp/B.j97Hah/BUILD/kernel-nopae-4.20.0/linux-4.20/scripts/Makefile.build:292: sound/soc/dwc/dwc-pcm.o] Error 1
  • error 113
  • make[4]: *** [/tmp/B.j97Hah/BUILD/kernel-nopae-4.20.0/linux-4.20/scripts/Makefile.build:516: sound/soc/dwc] Error 2
  • error 114
  • /tmp/B.j97Hah/BUILD/kernel-nopae-4.20.0/linux-4.20/include/uapi/linux/types.h:5:10: fatal error: asm/types.h: No such file or directory
  • error 115
  • compilation terminated.
  • error 116
  • make[5]: *** [/tmp/B.j97Hah/BUILD/kernel-nopae-4.20.0/linux-4.20/scripts/Makefile.build:291: sound/soc/fsl/fsl_asrc.o] Error 1
  • error 117
  • /tmp/B.j97Hah/BUILD/kernel-nopae-4.20.0/linux-4.20/include/uapi/linux/types.h:5:10: fatal error: asm/types.h: No such file or directory
  • error 118
  • compilation terminated.
  • error 119
  • make[5]: *** [/tmp/B.j97Hah/BUILD/kernel-nopae-4.20.0/linux-4.20/scripts/Makefile.build:292: sound/soc/generic/simple-card-utils.o] Error 1
  • error 120
  • /tmp/B.j97Hah/BUILD/kernel-nopae-4.20.0/linux-4.20/include/uapi/linux/types.h:5:10: fatal error: asm/types.h: No such file or directory
  • error 121
  • compilation terminated.
  • error 122
  • make[5]: *** [/tmp/B.j97Hah/BUILD/kernel-nopae-4.20.0/linux-4.20/scripts/Makefile.build:292: sound/soc/codecs/ac97.o] Error 1
  • error 123
  • /tmp/B.j97Hah/BUILD/kernel-nopae-4.20.0/linux-4.20/include/uapi/linux/types.h:5:10: fatal error: asm/types.h: No such file or directory
  • error 124
  • compilation terminated.
  • error 125
  • make[5]: *** [/tmp/B.j97Hah/BUILD/kernel-nopae-4.20.0/linux-4.20/scripts/Makefile.build:292: sound/soc/generic/simple-card.o] Error 1
  • error 126
  • make[4]: *** [/tmp/B.j97Hah/BUILD/kernel-nopae-4.20.0/linux-4.20/scripts/Makefile.build:516: sound/soc/generic] Error 2
  • error 127
  • /tmp/B.j97Hah/BUILD/kernel-nopae-4.20.0/linux-4.20/include/uapi/linux/types.h:5:10: fatal error: asm/types.h: No such file or directory
  • error 128
  • compilation terminated.
  • error 129
  • make[5]: *** [/tmp/B.j97Hah/BUILD/kernel-nopae-4.20.0/linux-4.20/scripts/Makefile.build:291: sound/soc/fsl/fsl_asrc_dma.o] Error 1
  • error 130
  • make[4]: *** [/tmp/B.j97Hah/BUILD/kernel-nopae-4.20.0/linux-4.20/scripts/Makefile.build:516: sound/soc/fsl] Error 2
  • error 131
  • /tmp/B.j97Hah/BUILD/kernel-nopae-4.20.0/linux-4.20/include/uapi/linux/types.h:5:10: fatal error: asm/types.h: No such file or directory
  • error 132
  • compilation terminated.
  • error 133
  • make[5]: *** [/tmp/B.j97Hah/BUILD/kernel-nopae-4.20.0/linux-4.20/scripts/Makefile.build:292: sound/soc/codecs/adau-utils.o] Error 1
  • error 134
  • /tmp/B.j97Hah/BUILD/kernel-nopae-4.20.0/linux-4.20/include/uapi/linux/types.h:5:10: fatal error: asm/types.h: No such file or directory
  • error 135
  • compilation terminated.
  • error 136
  • make[5]: *** [/tmp/B.j97Hah/BUILD/kernel-nopae-4.20.0/linux-4.20/scripts/Makefile.build:298: sound/soc/hisilicon/hi6210-i2s.o] Error 1
  • error 137
  • make[4]: *** [/tmp/B.j97Hah/BUILD/kernel-nopae-4.20.0/linux-4.20/scripts/Makefile.build:516: sound/soc/hisilicon] Error 2
  • error 138
  • /tmp/B.j97Hah/BUILD/kernel-nopae-4.20.0/linux-4.20/include/uapi/linux/types.h:5:10: fatal error: asm/types.h: No such file or directory
  • error 139
  • compilation terminated.
  • error 140
  • make[5]: *** [/tmp/B.j97Hah/BUILD/kernel-nopae-4.20.0/linux-4.20/scripts/Makefile.build:292: sound/soc/codecs/adau1701.o] Error 1
  • error 141
  • make[4]: *** [/tmp/B.j97Hah/BUILD/kernel-nopae-4.20.0/linux-4.20/scripts/Makefile.build:516: sound/soc/codecs] Error 2
  • error 142
  • make[3]: *** [/tmp/B.j97Hah/BUILD/kernel-nopae-4.20.0/linux-4.20/scripts/Makefile.build:516: sound/soc] Error 2
  • error 143
  • make[2]: *** [/tmp/B.j97Hah/BUILD/kernel-nopae-4.20.0/linux-4.20/Makefile:1055: sound] Error 2
  • error 144
  • Error: can't open /tmp/B.j97Hah/BUILD/tmp/cc91ZkeQ.s for reading: No such file or directory
  • error 145
  • make[5]: *** [/tmp/B.j97Hah/BUILD/kernel-nopae-4.20.0/linux-4.20/scripts/Makefile.build:291: drivers/base/regmap/regmap.o] Error 1
  • error 146
  • make[4]: *** [/tmp/B.j97Hah/BUILD/kernel-nopae-4.20.0/linux-4.20/scripts/Makefile.build:516: drivers/base/regmap] Error 2
  • error 147
  • make[3]: *** [/tmp/B.j97Hah/BUILD/kernel-nopae-4.20.0/linux-4.20/scripts/Makefile.build:516: drivers/base] Error 2
  • error 148
  • make[2]: *** [/tmp/B.j97Hah/BUILD/kernel-nopae-4.20.0/linux-4.20/Makefile:1055: drivers] Error 2
  • error 149
  • make[1]: *** [Makefile:152: sub-make] Error 2

Content:

  CC      drivers/acpi/power.o
  CC      kernel/user_namespace.o
  CC [M]  fs/btrfs/qgroup.o
  CC      drivers/base/firmware_loader/fallback_table.o
  CC      arch/x86/pci/sta2x11-fixup.o
  CC      drivers/acpi/event.o
  CC      drivers/base/firmware_loader/main.o
  CC      kernel/pid_namespace.o
  CC      drivers/acpi/sysfs.o
  CC      arch/x86/pci/common.o
  CC      drivers/base/firmware_loader/fallback.o
  AR      drivers/base/firmware_loader/built-in.a
  CC [M]  fs/btrfs/dev-replace.o
  CC      arch/x86/pci/early.o
  CC      kernel/stop_machine.o
  CC      drivers/acpi/acpi_cmos_rtc.o
  CC      arch/x86/pci/bus_numa.o
  CC      drivers/acpi/property.o
  CC      drivers/acpi/x86/apple.o
  CC      arch/x86/pci/amd_bus.o
  AR      arch/x86/pci/built-in.a
  CC      drivers/acpi/x86/utils.o
  CC      drivers/acpi/debugfs.o
  CC      kernel/auditfilter.o
  AR      arch/x86/oprofile/built-in.a
  CC [M]  fs/btrfs/send.o
  CC      drivers/acpi/cm_sbs.o
  CC [M]  drivers/ata/libata-scsi.o
  CC [M]  drivers/atm/ambassador.o
  CC      kernel/audit.o
  CC [M]  arch/x86/oprofile/../../../drivers/oprofile/oprof.o
  CC      drivers/acpi/acpi_lpat.o
  CC [M]  arch/x86/oprofile/../../../drivers/oprofile/cpu_buffer.o
  CC      drivers/acpi/acpi_watchdog.o
  CC [M]  arch/x86/oprofile/../../../drivers/oprofile/buffer_sync.o
  CC [M]  drivers/atm/horizon.o
  CC [M]  fs/btrfs/raid56.o
  CC      kernel/auditsc.o
  CC [M]  arch/x86/oprofile/../../../drivers/oprofile/event_buffer.o
  CC      drivers/acpi/pci_slot.o
  CC [M]  drivers/atm/iphase.o
  CC      kernel/audit_watch.o
  CC [M]  arch/x86/oprofile/../../../drivers/oprofile/oprofile_files.o
  CC      drivers/acpi/processor_driver.o
  CC [M]  drivers/ata/libata-eh.o
  CC [M]  fs/btrfs/uuid-tree.o
  CC      drivers/base/power/sysfs.o
  CC      drivers/acpi/processor_idle.o
  CC [M]  arch/x86/oprofile/../../../drivers/oprofile/oprofilefs.o
  CC      kernel/audit_fsnotify.o
  CC [M]  arch/x86/oprofile/../../../drivers/oprofile/oprofile_stats.o
  CC      drivers/base/power/generic_ops.o
  CC      kernel/audit_tree.o
  CC      drivers/acpi/processor_throttling.o
  CC [M]  arch/x86/oprofile/../../../drivers/oprofile/timer_int.o
  CC      drivers/base/power/common.o
  CC [M]  drivers/atm/suni.o
  CC [M]  fs/btrfs/props.o
  CC [M]  arch/x86/oprofile/../../../drivers/oprofile/nmi_timer_int.o
  CC [M]  arch/x86/oprofile/init.o
  CC      drivers/acpi/processor_thermal.o
  CC      drivers/acpi/processor_perflib.o
  CC [M]  arch/x86/oprofile/backtrace.o
  CC      drivers/acpi/container.o
  CC      kernel/kprobes.o
  CC      kernel/hung_task.o
  CC [M]  arch/x86/oprofile/nmi_int.o
  CC      drivers/acpi/acpi_memhotplug.o
  CC      drivers/base/power/qos.o
  CC [M]  drivers/ata/libata-transport.o
  CC [M]  fs/btrfs/free-space-tree.o
  CC [M]  arch/x86/oprofile/op_model_amd.o
  CC      drivers/base/power/wakeirq.o
  CC      drivers/acpi/ioapic.o
  CC [M]  drivers/atm/fore200e.o
  CC      kernel/watchdog.o
  CC [M]  drivers/ata/libata-trace.o
  CC      drivers/base/power/runtime.o
  CC [M]  fs/btrfs/tree-checker.o
  CC      kernel/watchdog_hld.o
  CC [M]  fs/btrfs/acl.o
  CC [M]  drivers/ata/libata-sff.o
  CC [M]  drivers/atm/eni.o
  CC      drivers/base/power/main.o
  CC      drivers/base/power/wakeup.o
  CC      kernel/seccomp.o
  CC [M]  fs/btrfs/tests/free-space-tests.o
  CC [M]  drivers/ata/libata-pmp.o
  CC      kernel/relay.o
  CC [M]  drivers/atm/solos-pci.o
  CC      drivers/base/power/domain.o
  CC [M]  fs/btrfs/tests/extent-buffer-tests.o
  CC      kernel/utsname_sysctl.o
  CC      drivers/base/power/domain_governor.o
  CC [M]  drivers/atm/idt77252.o
  CC [M]  drivers/ata/libata-zpodd.o
  CC      kernel/delayacct.o
Terminated
ended at: Sat Dec 29 13:11:07 2018, done in 0:03:28.547283
error: No files produced.
+ chmod -R u+rwX /tmp/B.j97Hah/BUILD
  CC      drivers/base/power/clock_ops.o
  AR      drivers/base/power/built-in.a
  CC [M]  fs/btrfs/tests/btrfs-tests.o
+ rm -rf /tmp/B.j97Hah/tmp /tmp/B.j97Hah/BUILD
  CC      kernel/taskstats.o
Assembler messages:
Error: can't open /tmp/B.j97Hah/BUILD/tmp/ccUzesAu.s for reading: No such file or directory
make[3]: *** [/tmp/B.j97Hah/BUILD/kernel-nopae-4.20.0/linux-4.20/scripts/Makefile.build:291: kernel/taskstats.o] Error 1
make[3]: *** Waiting for unfinished jobs....
  CC [M]  arch/x86/oprofile/op_model_ppro.o
  AR      drivers/base/test/built-in.a
  CC      kernel/tsacct.o
Assembler messages:
Error: can't open /tmp/B.j97Hah/BUILD/tmp/ccePG4sT.s for reading: No such file or directory
make[3]: *** [/tmp/B.j97Hah/BUILD/kernel-nopae-4.20.0/linux-4.20/scripts/Makefile.build:291: kernel/tsacct.o] Error 1
  CC [M]  drivers/atm/idt77105.o
  CC [M]  drivers/base/test/test_async_driver_probe.o
  CC      drivers/acpi/hed.o
  CC [M]  arch/x86/oprofile/op_model_p4.o
  LD [M]  arch/x86/oprofile/oprofile.o
  CC      drivers/acpi/bgrt.o
  CC      drivers/acpi/spcr.o
In file included from /tmp/B.j97Hah/BUILD/kernel-nopae-4.20.0/linux-4.20/arch/x86/include/asm/preempt.h:7,
                 from /tmp/B.j97Hah/BUILD/kernel-nopae-4.20.0/linux-4.20/include/linux/preempt.h:81,
                 from /tmp/B.j97Hah/BUILD/kernel-nopae-4.20.0/linux-4.20/include/linux/spinlock.h:51,
                 from /tmp/B.j97Hah/BUILD/kernel-nopae-4.20.0/linux-4.20/include/linux/mmzone.h:8,
                 from /tmp/B.j97Hah/BUILD/kernel-nopae-4.20.0/linux-4.20/include/linux/gfp.h:6,
                 from /tmp/B.j97Hah/BUILD/kernel-nopae-4.20.0/linux-4.20/include/linux/slab.h:15,
                 from /tmp/B.j97Hah/BUILD/kernel-nopae-4.20.0/linux-4.20/include/linux/resource_ext.h:19,
                 from /tmp/B.j97Hah/BUILD/kernel-nopae-4.20.0/linux-4.20/include/linux/acpi.h:26,
                 from /tmp/B.j97Hah/BUILD/kernel-nopae-4.20.0/linux-4.20/drivers/acpi/spcr.c:14:
/tmp/B.j97Hah/BUILD/kernel-nopae-4.20.0/linux-4.20/include/linux/thread_info.h:21:10: fatal error: asm/current.h: No such file or directory
 #include <asm/current.h>
          ^~~~~~~~~~~~~~~
compilation terminated.
make[4]: *** [/tmp/B.j97Hah/BUILD/kernel-nopae-4.20.0/linux-4.20/scripts/Makefile.build:291: drivers/acpi/spcr.o] Error 1
make[3]: *** [/tmp/B.j97Hah/BUILD/kernel-nopae-4.20.0/linux-4.20/scripts/Makefile.build:516: drivers/acpi] Error 2
make[3]: *** Waiting for unfinished jobs....
make[2]: *** [/tmp/B.j97Hah/BUILD/kernel-nopae-4.20.0/linux-4.20/Makefile:1055: kernel] Error 2
make[2]: *** Waiting for unfinished jobs....
  CC [M]  drivers/ata/libata-acpi.o
  CC [M]  drivers/atm/adummy.o
In file included from /tmp/B.j97Hah/BUILD/kernel-nopae-4.20.0/linux-4.20/include/linux/bio.h:21,
                 from /tmp/B.j97Hah/BUILD/kernel-nopae-4.20.0/linux-4.20/include/linux/writeback.h:184,
                 from /tmp/B.j97Hah/BUILD/kernel-nopae-4.20.0/linux-4.20/include/linux/memcontrol.h:31,
                 from /tmp/B.j97Hah/BUILD/kernel-nopae-4.20.0/linux-4.20/include/net/sock.h:58,
                 from /tmp/B.j97Hah/BUILD/kernel-nopae-4.20.0/linux-4.20/include/linux/atmdev.h:13,
                 from /tmp/B.j97Hah/BUILD/kernel-nopae-4.20.0/linux-4.20/drivers/atm/adummy.c:21:
/tmp/B.j97Hah/BUILD/kernel-nopae-4.20.0/linux-4.20/include/linux/highmem.h:12:10: fatal error: asm/cacheflush.h: No such file or directory
 #include <asm/cacheflush.h>
          ^~~~~~~~~~~~~~~~~~
compilation terminated.
make[4]: *** [/tmp/B.j97Hah/BUILD/kernel-nopae-4.20.0/linux-4.20/scripts/Makefile.build:298: drivers/atm/adummy.o] Error 1
make[4]: *** Waiting for unfinished jobs....
  CC [M]  drivers/ata/ahci.o
In file included from /tmp/B.j97Hah/BUILD/kernel-nopae-4.20.0/linux-4.20/include/linux/compiler.h:172,
                 from /tmp/B.j97Hah/BUILD/kernel-nopae-4.20.0/linux-4.20/include/linux/export.h:45,
                 from /tmp/B.j97Hah/BUILD/kernel-nopae-4.20.0/linux-4.20/include/linux/linkage.h:7,
                 from /tmp/B.j97Hah/BUILD/kernel-nopae-4.20.0/linux-4.20/include/linux/kernel.h:7,
                 from /tmp/B.j97Hah/BUILD/kernel-nopae-4.20.0/linux-4.20/drivers/ata/ahci.c:35:
/tmp/B.j97Hah/BUILD/kernel-nopae-4.20.0/linux-4.20/include/uapi/linux/types.h:5:10: fatal error: asm/types.h: No such file or directory
 #include <asm/types.h>
          ^~~~~~~~~~~~~
compilation terminated.
make[4]: *** [/tmp/B.j97Hah/BUILD/kernel-nopae-4.20.0/linux-4.20/scripts/Makefile.build:297: drivers/ata/ahci.o] Error 1
make[3]: *** [/tmp/B.j97Hah/BUILD/kernel-nopae-4.20.0/linux-4.20/scripts/Makefile.build:516: drivers/ata] Error 2
  CC [M]  drivers/atm/atmdd.o
In file included from /tmp/B.j97Hah/BUILD/kernel-nopae-4.20.0/linux-4.20/include/linux/types.h:6,
                 from /tmp/B.j97Hah/BUILD/kernel-nopae-4.20.0/linux-4.20/include/linux/list.h:5,
                 from /tmp/B.j97Hah/BUILD/kernel-nopae-4.20.0/linux-4.20/include/linux/module.h:9,
                 from /tmp/B.j97Hah/BUILD/kernel-nopae-4.20.0/linux-4.20/drivers/atm/atmdd.c:33:
/tmp/B.j97Hah/BUILD/kernel-nopae-4.20.0/linux-4.20/include/uapi/linux/types.h:5:10: fatal error: asm/types.h: No such file or directory
 #include <asm/types.h>
          ^~~~~~~~~~~~~
compilation terminated.
make[4]: *** [/tmp/B.j97Hah/BUILD/kernel-nopae-4.20.0/linux-4.20/scripts/Makefile.build:298: drivers/atm/atmdd.o] Error 1
  CC      drivers/base/component.o
In file included from /tmp/B.j97Hah/BUILD/kernel-nopae-4.20.0/linux-4.20/include/linux/compiler.h:172,
                 from /tmp/B.j97Hah/BUILD/kernel-nopae-4.20.0/linux-4.20/include/linux/ioport.h:13,
                 from /tmp/B.j97Hah/BUILD/kernel-nopae-4.20.0/linux-4.20/include/linux/device.h:15,
                 from /tmp/B.j97Hah/BUILD/kernel-nopae-4.20.0/linux-4.20/drivers/base/component.c:11:
/tmp/B.j97Hah/BUILD/kernel-nopae-4.20.0/linux-4.20/include/uapi/linux/types.h:5:10: fatal error: asm/types.h: No such file or directory
 #include <asm/types.h>
          ^~~~~~~~~~~~~
compilation terminated.
make[4]: *** [/tmp/B.j97Hah/BUILD/kernel-nopae-4.20.0/linux-4.20/scripts/Makefile.build:291: drivers/base/component.o] Error 1
make[3]: *** [/tmp/B.j97Hah/BUILD/kernel-nopae-4.20.0/linux-4.20/scripts/Makefile.build:516: drivers/atm] Error 2
make[4]: *** Waiting for unfinished jobs....
  CC [M]  fs/btrfs/tests/extent-io-tests.o
Assembler messages:
Error: can't open /tmp/B.j97Hah/BUILD/tmp/cchX2WJu.s for reading: No such file or directory
make[4]: *** [/tmp/B.j97Hah/BUILD/kernel-nopae-4.20.0/linux-4.20/scripts/Makefile.build:292: fs/btrfs/tests/extent-io-tests.o] Error 1
make[4]: *** Waiting for unfinished jobs....
  CC [M]  sound/isa/gus/gusclassic.o
fixdep: error opening file: /tmp/B.j97Hah/BUILD/kernel-nopae-4.20.0/linux-4.20/arch/x86/include/uapi/asm/types.h: No such file or directory
make[5]: *** [/tmp/B.j97Hah/BUILD/kernel-nopae-4.20.0/linux-4.20/scripts/Makefile.build:291: sound/isa/gus/gusclassic.o] Error 2
make[5]: *** Waiting for unfinished jobs....
  CC [M]  sound/isa/gus/gus_main.o
In file included from /tmp/B.j97Hah/BUILD/kernel-nopae-4.20.0/linux-4.20/include/linux/compiler.h:172,
                 from /tmp/B.j97Hah/BUILD/kernel-nopae-4.20.0/linux-4.20/include/linux/init.h:5,
                 from /tmp/B.j97Hah/BUILD/kernel-nopae-4.20.0/linux-4.20/sound/isa/gus/gus_main.c:22:
/tmp/B.j97Hah/BUILD/kernel-nopae-4.20.0/linux-4.20/include/uapi/linux/types.h:5:10: fatal error: asm/types.h: No such file or directory
 #include <asm/types.h>
          ^~~~~~~~~~~~~
compilation terminated.
make[5]: *** [/tmp/B.j97Hah/BUILD/kernel-nopae-4.20.0/linux-4.20/scripts/Makefile.build:291: sound/isa/gus/gus_main.o] Error 1
make[4]: *** [/tmp/B.j97Hah/BUILD/kernel-nopae-4.20.0/linux-4.20/scripts/Makefile.build:516: sound/isa/gus] Error 2
make[4]: *** Waiting for unfinished jobs....
  CC [M]  fs/btrfs/tests/inode-tests.o
In file included from /tmp/B.j97Hah/BUILD/kernel-nopae-4.20.0/linux-4.20/include/linux/types.h:6,
                 from /tmp/B.j97Hah/BUILD/kernel-nopae-4.20.0/linux-4.20/fs/btrfs/tests/inode-tests.c:6:
/tmp/B.j97Hah/BUILD/kernel-nopae-4.20.0/linux-4.20/include/uapi/linux/types.h:5:10: fatal error: asm/types.h: No such file or directory
 #include <asm/types.h>
          ^~~~~~~~~~~~~
compilation terminated.
make[4]: *** [/tmp/B.j97Hah/BUILD/kernel-nopae-4.20.0/linux-4.20/scripts/Makefile.build:292: fs/btrfs/tests/inode-tests.o] Error 1
make[3]: *** [/tmp/B.j97Hah/BUILD/kernel-nopae-4.20.0/linux-4.20/scripts/Makefile.build:516: fs/btrfs] Error 2
make[2]: *** [/tmp/B.j97Hah/BUILD/kernel-nopae-4.20.0/linux-4.20/Makefile:1055: fs] Error 2
  CC      drivers/base/core.o
In file included from /tmp/B.j97Hah/BUILD/kernel-nopae-4.20.0/linux-4.20/include/linux/compiler.h:172,
                 from /tmp/B.j97Hah/BUILD/kernel-nopae-4.20.0/linux-4.20/include/linux/ioport.h:13,
                 from /tmp/B.j97Hah/BUILD/kernel-nopae-4.20.0/linux-4.20/include/linux/device.h:15,
                 from /tmp/B.j97Hah/BUILD/kernel-nopae-4.20.0/linux-4.20/drivers/base/core.c:11:
/tmp/B.j97Hah/BUILD/kernel-nopae-4.20.0/linux-4.20/include/uapi/linux/types.h:5:10: fatal error: asm/types.h: No such file or directory
 #include <asm/types.h>
          ^~~~~~~~~~~~~
compilation terminated.
make[4]: *** [/tmp/B.j97Hah/BUILD/kernel-nopae-4.20.0/linux-4.20/scripts/Makefile.build:291: drivers/base/core.o] Error 1
  CC [M]  sound/isa/galaxy/azt2316.o
In file included from /tmp/B.j97Hah/BUILD/kernel-nopae-4.20.0/linux-4.20/include/linux/compiler.h:172,
                 from /tmp/B.j97Hah/BUILD/kernel-nopae-4.20.0/linux-4.20/include/linux/export.h:45,
                 from /tmp/B.j97Hah/BUILD/kernel-nopae-4.20.0/linux-4.20/include/linux/linkage.h:7,
                 from /tmp/B.j97Hah/BUILD/kernel-nopae-4.20.0/linux-4.20/include/linux/kernel.h:7,
                 from /tmp/B.j97Hah/BUILD/kernel-nopae-4.20.0/linux-4.20/sound/isa/galaxy/galaxy.c:20,
                 from /tmp/B.j97Hah/BUILD/kernel-nopae-4.20.0/linux-4.20/sound/isa/galaxy/azt2316.c:111:
/tmp/B.j97Hah/BUILD/kernel-nopae-4.20.0/linux-4.20/include/uapi/linux/types.h:5:10: fatal error: asm/types.h: No such file or directory
 #include <asm/types.h>
          ^~~~~~~~~~~~~
compilation terminated.
make[5]: *** [/tmp/B.j97Hah/BUILD/kernel-nopae-4.20.0/linux-4.20/scripts/Makefile.build:292: sound/isa/galaxy/azt2316.o] Error 1
make[5]: *** Waiting for unfinished jobs....
  CC      drivers/base/regmap/regcache.o
In file included from /tmp/B.j97Hah/BUILD/kernel-nopae-4.20.0/linux-4.20/include/linux/types.h:6,
                 from /tmp/B.j97Hah/BUILD/kernel-nopae-4.20.0/linux-4.20/include/linux/bsearch.h:5,
                 from /tmp/B.j97Hah/BUILD/kernel-nopae-4.20.0/linux-4.20/drivers/base/regmap/regcache.c:13:
/tmp/B.j97Hah/BUILD/kernel-nopae-4.20.0/linux-4.20/include/uapi/linux/types.h:5:10: fatal error: asm/types.h: No such file or directory
 #include <asm/types.h>
          ^~~~~~~~~~~~~
compilation terminated.
make[5]: *** [/tmp/B.j97Hah/BUILD/kernel-nopae-4.20.0/linux-4.20/scripts/Makefile.build:291: drivers/base/regmap/regcache.o] Error 1
make[5]: *** Waiting for unfinished jobs....
  CC      drivers/base/regmap/regcache-rbtree.o
In file included from /tmp/B.j97Hah/BUILD/kernel-nopae-4.20.0/linux-4.20/include/linux/compiler.h:172,
                 from /tmp/B.j97Hah/BUILD/kernel-nopae-4.20.0/linux-4.20/include/linux/export.h:45,
                 from /tmp/B.j97Hah/BUILD/kernel-nopae-4.20.0/linux-4.20/include/linux/linkage.h:7,
                 from /tmp/B.j97Hah/BUILD/kernel-nopae-4.20.0/linux-4.20/include/linux/fs.h:5,
                 from /tmp/B.j97Hah/BUILD/kernel-nopae-4.20.0/linux-4.20/include/linux/debugfs.h:15,
                 from /tmp/B.j97Hah/BUILD/kernel-nopae-4.20.0/linux-4.20/drivers/base/regmap/regcache-rbtree.c:13:
/tmp/B.j97Hah/BUILD/kernel-nopae-4.20.0/linux-4.20/include/uapi/linux/types.h:5:10: fatal error: asm/types.h: No such file or directory
 #include <asm/types.h>
          ^~~~~~~~~~~~~
compilation terminated.
make[5]: *** [/tmp/B.j97Hah/BUILD/kernel-nopae-4.20.0/linux-4.20/scripts/Makefile.build:291: drivers/base/regmap/regcache-rbtree.o] Error 1
  CC [M]  sound/pci/ac97/ac97_pcm.o
In file included from /tmp/B.j97Hah/BUILD/kernel-nopae-4.20.0/linux-4.20/include/linux/compiler.h:172,
                 from /tmp/B.j97Hah/BUILD/kernel-nopae-4.20.0/linux-4.20/include/linux/export.h:45,
                 from /tmp/B.j97Hah/BUILD/kernel-nopae-4.20.0/linux-4.20/include/linux/linkage.h:7,
                 from /tmp/B.j97Hah/BUILD/kernel-nopae-4.20.0/linux-4.20/include/linux/kernel.h:7,
                 from /tmp/B.j97Hah/BUILD/kernel-nopae-4.20.0/linux-4.20/include/linux/delay.h:22,
                 from /tmp/B.j97Hah/BUILD/kernel-nopae-4.20.0/linux-4.20/sound/pci/ac97/ac97_pcm.c:26:
/tmp/B.j97Hah/BUILD/kernel-nopae-4.20.0/linux-4.20/include/uapi/linux/types.h:5:10: fatal error: asm/types.h: No such file or directory
 #include <asm/types.h>
          ^~~~~~~~~~~~~
compilation terminated.
make[5]: *** [/tmp/B.j97Hah/BUILD/kernel-nopae-4.20.0/linux-4.20/scripts/Makefile.build:291: sound/pci/ac97/ac97_pcm.o] Error 1
make[5]: *** Waiting for unfinished jobs....
  CC [M]  sound/pci/ac97/ac97_codec.o
In file included from /tmp/B.j97Hah/BUILD/kernel-nopae-4.20.0/linux-4.20/include/linux/compiler.h:172,
                 from /tmp/B.j97Hah/BUILD/kernel-nopae-4.20.0/linux-4.20/include/linux/export.h:45,
                 from /tmp/B.j97Hah/BUILD/kernel-nopae-4.20.0/linux-4.20/include/linux/linkage.h:7,
                 from /tmp/B.j97Hah/BUILD/kernel-nopae-4.20.0/linux-4.20/include/linux/kernel.h:7,
                 from /tmp/B.j97Hah/BUILD/kernel-nopae-4.20.0/linux-4.20/include/linux/delay.h:22,
                 from /tmp/B.j97Hah/BUILD/kernel-nopae-4.20.0/linux-4.20/sound/pci/ac97/ac97_codec.c:25:
/tmp/B.j97Hah/BUILD/kernel-nopae-4.20.0/linux-4.20/include/uapi/linux/types.h:5:10: fatal error: asm/types.h: No such file or directory
 #include <asm/types.h>
          ^~~~~~~~~~~~~
compilation terminated.
make[5]: *** [/tmp/B.j97Hah/BUILD/kernel-nopae-4.20.0/linux-4.20/scripts/Makefile.build:291: sound/pci/ac97/ac97_codec.o] Error 1
make[4]: *** [/tmp/B.j97Hah/BUILD/kernel-nopae-4.20.0/linux-4.20/scripts/Makefile.build:516: sound/pci/ac97] Error 2
make[4]: *** Waiting for unfinished jobs....
  CC [M]  sound/pci/ali5451/ali5451.o
In file included from /tmp/B.j97Hah/BUILD/kernel-nopae-4.20.0/linux-4.20/include/linux/types.h:6,
                 from /tmp/B.j97Hah/BUILD/kernel-nopae-4.20.0/linux-4.20/include/linux/io.h:21,
                 from /tmp/B.j97Hah/BUILD/kernel-nopae-4.20.0/linux-4.20/sound/pci/ali5451/ali5451.c:28:
/tmp/B.j97Hah/BUILD/kernel-nopae-4.20.0/linux-4.20/include/uapi/linux/types.h:5:10: fatal error: asm/types.h: No such file or directory
 #include <asm/types.h>
          ^~~~~~~~~~~~~
compilation terminated.
make[5]: *** [/tmp/B.j97Hah/BUILD/kernel-nopae-4.20.0/linux-4.20/scripts/Makefile.build:292: sound/pci/ali5451/ali5451.o] Error 1
make[4]: *** [/tmp/B.j97Hah/BUILD/kernel-nopae-4.20.0/linux-4.20/scripts/Makefile.build:516: sound/pci/ali5451] Error 2
  CC [M]  sound/pci/asihpi/asihpi.o
In file included from /tmp/B.j97Hah/BUILD/kernel-nopae-4.20.0/linux-4.20/include/linux/types.h:6,
                 from /tmp/B.j97Hah/BUILD/kernel-nopae-4.20.0/linux-4.20/sound/pci/asihpi/hpi.h:34,
                 from /tmp/B.j97Hah/BUILD/kernel-nopae-4.20.0/linux-4.20/sound/pci/asihpi/hpi_internal.h:27,
                 from /tmp/B.j97Hah/BUILD/kernel-nopae-4.20.0/linux-4.20/sound/pci/asihpi/asihpi.c:25:
/tmp/B.j97Hah/BUILD/kernel-nopae-4.20.0/linux-4.20/include/uapi/linux/types.h:5:10: fatal error: asm/types.h: No such file or directory
 #include <asm/types.h>
          ^~~~~~~~~~~~~
compilation terminated.
make[5]: *** [/tmp/B.j97Hah/BUILD/kernel-nopae-4.20.0/linux-4.20/scripts/Makefile.build:291: sound/pci/asihpi/asihpi.o] Error 1
make[4]: *** [/tmp/B.j97Hah/BUILD/kernel-nopae-4.20.0/linux-4.20/scripts/Makefile.build:516: sound/pci/asihpi] Error 2
  CC [M]  sound/pcmcia/pdaudiocf/pdaudiocf.o
In file included from /tmp/B.j97Hah/BUILD/kernel-nopae-4.20.0/linux-4.20/include/linux/compiler.h:172,
                 from /tmp/B.j97Hah/BUILD/kernel-nopae-4.20.0/linux-4.20/include/linux/ioport.h:13,
                 from /tmp/B.j97Hah/BUILD/kernel-nopae-4.20.0/linux-4.20/include/linux/device.h:15,
                 from /tmp/B.j97Hah/BUILD/kernel-nopae-4.20.0/linux-4.20/include/sound/core.h:25,
                 from /tmp/B.j97Hah/BUILD/kernel-nopae-4.20.0/linux-4.20/sound/pcmcia/pdaudiocf/pdaudiocf.c:21:
/tmp/B.j97Hah/BUILD/kernel-nopae-4.20.0/linux-4.20/include/uapi/linux/types.h:5:10: fatal error: asm/types.h: No such file or directory
 #include <asm/types.h>
          ^~~~~~~~~~~~~
compilation terminated.
make[5]: *** [/tmp/B.j97Hah/BUILD/kernel-nopae-4.20.0/linux-4.20/scripts/Makefile.build:292: sound/pcmcia/pdaudiocf/pdaudiocf.o] Error 1
make[5]: *** Waiting for unfinished jobs....
  CC [M]  sound/pci/au88x0/au8810.o
In file included from /tmp/B.j97Hah/BUILD/kernel-nopae-4.20.0/linux-4.20/include/linux/types.h:6,
                 from /tmp/B.j97Hah/BUILD/kernel-nopae-4.20.0/linux-4.20/include/linux/mod_devicetable.h:12,
                 from /tmp/B.j97Hah/BUILD/kernel-nopae-4.20.0/linux-4.20/include/linux/pci.h:21,
                 from /tmp/B.j97Hah/BUILD/kernel-nopae-4.20.0/linux-4.20/sound/pci/au88x0/au88x0.h:20,
                 from /tmp/B.j97Hah/BUILD/kernel-nopae-4.20.0/linux-4.20/sound/pci/au88x0/au8810.c:3:
/tmp/B.j97Hah/BUILD/kernel-nopae-4.20.0/linux-4.20/include/uapi/linux/types.h:5:10: fatal error: asm/types.h: No such file or directory
 #include <asm/types.h>
          ^~~~~~~~~~~~~
compilation terminated.
make[5]: *** [/tmp/B.j97Hah/BUILD/kernel-nopae-4.20.0/linux-4.20/scripts/Makefile.build:291: sound/pci/au88x0/au8810.o] Error 1
make[5]: *** Waiting for unfinished jobs....
  CC [M]  sound/isa/galaxy/azt1605.o
fixdep: error opening file: /tmp/B.j97Hah/BUILD/kernel-nopae-4.20.0/linux-4.20/arch/x86/include/uapi/asm/types.h: No such file or directory
make[5]: *** [/tmp/B.j97Hah/BUILD/kernel-nopae-4.20.0/linux-4.20/scripts/Makefile.build:292: sound/isa/galaxy/azt1605.o] Error 2
make[4]: *** [/tmp/B.j97Hah/BUILD/kernel-nopae-4.20.0/linux-4.20/scripts/Makefile.build:516: sound/isa/galaxy] Error 2
make[3]: *** [/tmp/B.j97Hah/BUILD/kernel-nopae-4.20.0/linux-4.20/scripts/Makefile.build:516: sound/isa] Error 2
make[3]: *** Waiting for unfinished jobs....
  CC [M]  sound/pcmcia/pdaudiocf/pdaudiocf_core.o
In file included from /tmp/B.j97Hah/BUILD/kernel-nopae-4.20.0/linux-4.20/include/linux/compiler.h:172,
                 from /tmp/B.j97Hah/BUILD/kernel-nopae-4.20.0/linux-4.20/include/linux/export.h:45,
                 from /tmp/B.j97Hah/BUILD/kernel-nopae-4.20.0/linux-4.20/include/linux/linkage.h:7,
                 from /tmp/B.j97Hah/BUILD/kernel-nopae-4.20.0/linux-4.20/include/linux/kernel.h:7,
                 from /tmp/B.j97Hah/BUILD/kernel-nopae-4.20.0/linux-4.20/include/linux/delay.h:22,
                 from /tmp/B.j97Hah/BUILD/kernel-nopae-4.20.0/linux-4.20/sound/pcmcia/pdaudiocf/pdaudiocf_core.c:21:
/tmp/B.j97Hah/BUILD/kernel-nopae-4.20.0/linux-4.20/include/uapi/linux/types.h:5:10: fatal error: asm/types.h: No such file or directory
 #include <asm/types.h>
          ^~~~~~~~~~~~~
compilation terminated.
make[5]: *** [/tmp/B.j97Hah/BUILD/kernel-nopae-4.20.0/linux-4.20/scripts/Makefile.build:292: sound/pcmcia/pdaudiocf/pdaudiocf_core.o] Error 1
make[4]: *** [/tmp/B.j97Hah/BUILD/kernel-nopae-4.20.0/linux-4.20/scripts/Makefile.build:516: sound/pcmcia/pdaudiocf] Error 2
make[4]: *** Waiting for unfinished jobs....
  CC [M]  sound/pci/au88x0/au8820.o
In file included from /tmp/B.j97Hah/BUILD/kernel-nopae-4.20.0/linux-4.20/include/linux/types.h:6,
                 from /tmp/B.j97Hah/BUILD/kernel-nopae-4.20.0/linux-4.20/include/linux/mod_devicetable.h:12,
                 from /tmp/B.j97Hah/BUILD/kernel-nopae-4.20.0/linux-4.20/include/linux/pci.h:21,
                 from /tmp/B.j97Hah/BUILD/kernel-nopae-4.20.0/linux-4.20/sound/pci/au88x0/au88x0.h:20,
                 from /tmp/B.j97Hah/BUILD/kernel-nopae-4.20.0/linux-4.20/sound/pci/au88x0/au8820.c:3:
/tmp/B.j97Hah/BUILD/kernel-nopae-4.20.0/linux-4.20/include/uapi/linux/types.h:5:10: fatal error: asm/types.h: No such file or directory
 #include <asm/types.h>
          ^~~~~~~~~~~~~
compilation terminated.
make[5]: *** [/tmp/B.j97Hah/BUILD/kernel-nopae-4.20.0/linux-4.20/scripts/Makefile.build:291: sound/pci/au88x0/au8820.o] Error 1
make[4]: *** [/tmp/B.j97Hah/BUILD/kernel-nopae-4.20.0/linux-4.20/scripts/Makefile.build:516: sound/pci/au88x0] Error 2
  CC [M]  sound/pci/aw2/aw2-alsa.o
In file included from /tmp/B.j97Hah/BUILD/kernel-nopae-4.20.0/linux-4.20/include/linux/compiler.h:172,
                 from /tmp/B.j97Hah/BUILD/kernel-nopae-4.20.0/linux-4.20/include/linux/init.h:5,
                 from /tmp/B.j97Hah/BUILD/kernel-nopae-4.20.0/linux-4.20/sound/pci/aw2/aw2-alsa.c:23:
/tmp/B.j97Hah/BUILD/kernel-nopae-4.20.0/linux-4.20/include/uapi/linux/types.h:5:10: fatal error: asm/types.h: No such file or directory
 #include <asm/types.h>
          ^~~~~~~~~~~~~
compilation terminated.
make[5]: *** [/tmp/B.j97Hah/BUILD/kernel-nopae-4.20.0/linux-4.20/scripts/Makefile.build:292: sound/pci/aw2/aw2-alsa.o] Error 1
make[5]: *** Waiting for unfinished jobs....
  CC [M]  sound/pcmcia/vx/vxpocket.o
In file included from /tmp/B.j97Hah/BUILD/kernel-nopae-4.20.0/linux-4.20/include/linux/compiler.h:172,
                 from /tmp/B.j97Hah/BUILD/kernel-nopae-4.20.0/linux-4.20/include/linux/init.h:5,
                 from /tmp/B.j97Hah/BUILD/kernel-nopae-4.20.0/linux-4.20/sound/pcmcia/vx/vxpocket.c:22:
/tmp/B.j97Hah/BUILD/kernel-nopae-4.20.0/linux-4.20/include/uapi/linux/types.h:5:10: fatal error: asm/types.h: No such file or directory
 #include <asm/types.h>
          ^~~~~~~~~~~~~
compilation terminated.
make[5]: *** [/tmp/B.j97Hah/BUILD/kernel-nopae-4.20.0/linux-4.20/scripts/Makefile.build:291: sound/pcmcia/vx/vxpocket.o] Error 1
make[5]: *** Waiting for unfinished jobs....
  CC [M]  sound/pcmcia/vx/vxp_ops.o
In file included from /tmp/B.j97Hah/BUILD/kernel-nopae-4.20.0/linux-4.20/include/linux/compiler.h:172,
                 from /tmp/B.j97Hah/BUILD/kernel-nopae-4.20.0/linux-4.20/include/linux/export.h:45,
                 from /tmp/B.j97Hah/BUILD/kernel-nopae-4.20.0/linux-4.20/include/linux/linkage.h:7,
                 from /tmp/B.j97Hah/BUILD/kernel-nopae-4.20.0/linux-4.20/include/linux/kernel.h:7,
                 from /tmp/B.j97Hah/BUILD/kernel-nopae-4.20.0/linux-4.20/include/linux/delay.h:22,
                 from /tmp/B.j97Hah/BUILD/kernel-nopae-4.20.0/linux-4.20/sound/pcmcia/vx/vxp_ops.c:23:
/tmp/B.j97Hah/BUILD/kernel-nopae-4.20.0/linux-4.20/include/uapi/linux/types.h:5:10: fatal error: asm/types.h: No such file or directory
 #include <asm/types.h>
          ^~~~~~~~~~~~~
compilation terminated.
make[5]: *** [/tmp/B.j97Hah/BUILD/kernel-nopae-4.20.0/linux-4.20/scripts/Makefile.build:291: sound/pcmcia/vx/vxp_ops.o] Error 1
make[4]: *** [/tmp/B.j97Hah/BUILD/kernel-nopae-4.20.0/linux-4.20/scripts/Makefile.build:516: sound/pcmcia/vx] Error 2
make[3]: *** [/tmp/B.j97Hah/BUILD/kernel-nopae-4.20.0/linux-4.20/scripts/Makefile.build:516: sound/pcmcia] Error 2
  CC [M]  sound/soc/amd/acp-pcm-dma.o
In file included from /tmp/B.j97Hah/BUILD/kernel-nopae-4.20.0/linux-4.20/include/linux/types.h:6,
                 from /tmp/B.j97Hah/BUILD/kernel-nopae-4.20.0/linux-4.20/include/linux/list.h:5,
                 from /tmp/B.j97Hah/BUILD/kernel-nopae-4.20.0/linux-4.20/include/linux/module.h:9,
                 from /tmp/B.j97Hah/BUILD/kernel-nopae-4.20.0/linux-4.20/sound/soc/amd/acp-pcm-dma.c:16:
/tmp/B.j97Hah/BUILD/kernel-nopae-4.20.0/linux-4.20/include/uapi/linux/types.h:5:10: fatal error: asm/types.h: No such file or directory
 #include <asm/types.h>
          ^~~~~~~~~~~~~
compilation terminated.
make[5]: *** [/tmp/B.j97Hah/BUILD/kernel-nopae-4.20.0/linux-4.20/scripts/Makefile.build:292: sound/soc/amd/acp-pcm-dma.o] Error 1
make[5]: *** Waiting for unfinished jobs....
  CC [M]  sound/pci/aw2/aw2-saa7146.o
In file included from /tmp/B.j97Hah/BUILD/kernel-nopae-4.20.0/linux-4.20/include/linux/compiler.h:172,
                 from /tmp/B.j97Hah/BUILD/kernel-nopae-4.20.0/linux-4.20/include/linux/init.h:5,
                 from /tmp/B.j97Hah/BUILD/kernel-nopae-4.20.0/linux-4.20/sound/pci/aw2/aw2-saa7146.c:26:
/tmp/B.j97Hah/BUILD/kernel-nopae-4.20.0/linux-4.20/include/uapi/linux/types.h:5:10: fatal error: asm/types.h: No such file or directory
 #include <asm/types.h>
          ^~~~~~~~~~~~~
compilation terminated.
make[5]: *** [/tmp/B.j97Hah/BUILD/kernel-nopae-4.20.0/linux-4.20/scripts/Makefile.build:292: sound/pci/aw2/aw2-saa7146.o] Error 1
make[4]: *** [/tmp/B.j97Hah/BUILD/kernel-nopae-4.20.0/linux-4.20/scripts/Makefile.build:516: sound/pci/aw2] Error 2
make[3]: *** [/tmp/B.j97Hah/BUILD/kernel-nopae-4.20.0/linux-4.20/scripts/Makefile.build:516: sound/pci] Error 2
  CC [M]  sound/soc/amd/acp-da7219-max98357a.o
In file included from /tmp/B.j97Hah/BUILD/kernel-nopae-4.20.0/linux-4.20/include/linux/compiler.h:172,
                 from /tmp/B.j97Hah/BUILD/kernel-nopae-4.20.0/linux-4.20/include/linux/ioport.h:13,
                 from /tmp/B.j97Hah/BUILD/kernel-nopae-4.20.0/linux-4.20/include/linux/device.h:15,
                 from /tmp/B.j97Hah/BUILD/kernel-nopae-4.20.0/linux-4.20/include/sound/core.h:25,
                 from /tmp/B.j97Hah/BUILD/kernel-nopae-4.20.0/linux-4.20/sound/soc/amd/acp-da7219-max98357a.c:26:
/tmp/B.j97Hah/BUILD/kernel-nopae-4.20.0/linux-4.20/include/uapi/linux/types.h:5:10: fatal error: asm/types.h: No such file or directory
 #include <asm/types.h>
          ^~~~~~~~~~~~~
compilation terminated.
make[5]: *** [/tmp/B.j97Hah/BUILD/kernel-nopae-4.20.0/linux-4.20/scripts/Makefile.build:292: sound/soc/amd/acp-da7219-max98357a.o] Error 1
  CC [M]  sound/soc/amd/acp-rt5645.o
In file included from /tmp/B.j97Hah/BUILD/kernel-nopae-4.20.0/linux-4.20/include/linux/compiler.h:172,
                 from /tmp/B.j97Hah/BUILD/kernel-nopae-4.20.0/linux-4.20/include/linux/ioport.h:13,
                 from /tmp/B.j97Hah/BUILD/kernel-nopae-4.20.0/linux-4.20/include/linux/device.h:15,
                 from /tmp/B.j97Hah/BUILD/kernel-nopae-4.20.0/linux-4.20/include/sound/core.h:25,
                 from /tmp/B.j97Hah/BUILD/kernel-nopae-4.20.0/linux-4.20/sound/soc/amd/acp-rt5645.c:29:
/tmp/B.j97Hah/BUILD/kernel-nopae-4.20.0/linux-4.20/include/uapi/linux/types.h:5:10: fatal error: asm/types.h: No such file or directory
 #include <asm/types.h>
          ^~~~~~~~~~~~~
compilation terminated.
make[5]: *** [/tmp/B.j97Hah/BUILD/kernel-nopae-4.20.0/linux-4.20/scripts/Makefile.build:292: sound/soc/amd/acp-rt5645.o] Error 1
make[4]: *** [/tmp/B.j97Hah/BUILD/kernel-nopae-4.20.0/linux-4.20/scripts/Makefile.build:516: sound/soc/amd] Error 2
make[4]: *** Waiting for unfinished jobs....
  CC [M]  sound/soc/dwc/dwc-i2s.o
In file included from /tmp/B.j97Hah/BUILD/kernel-nopae-4.20.0/linux-4.20/include/linux/compiler.h:172,
                 from /tmp/B.j97Hah/BUILD/kernel-nopae-4.20.0/linux-4.20/include/linux/err.h:5,
                 from /tmp/B.j97Hah/BUILD/kernel-nopae-4.20.0/linux-4.20/include/linux/clk.h:15,
                 from /tmp/B.j97Hah/BUILD/kernel-nopae-4.20.0/linux-4.20/sound/soc/dwc/dwc-i2s.c:14:
/tmp/B.j97Hah/BUILD/kernel-nopae-4.20.0/linux-4.20/include/uapi/linux/types.h:5:10: fatal error: asm/types.h: No such file or directory
 #include <asm/types.h>
          ^~~~~~~~~~~~~
compilation terminated.
make[5]: *** [/tmp/B.j97Hah/BUILD/kernel-nopae-4.20.0/linux-4.20/scripts/Makefile.build:292: sound/soc/dwc/dwc-i2s.o] Error 1
make[5]: *** Waiting for unfinished jobs....
  CC [M]  sound/soc/dwc/dwc-pcm.o
In file included from /tmp/B.j97Hah/BUILD/kernel-nopae-4.20.0/linux-4.20/include/linux/types.h:6,
                 from /tmp/B.j97Hah/BUILD/kernel-nopae-4.20.0/linux-4.20/include/linux/io.h:21,
                 from /tmp/B.j97Hah/BUILD/kernel-nopae-4.20.0/linux-4.20/sound/soc/dwc/dwc-pcm.c:14:
/tmp/B.j97Hah/BUILD/kernel-nopae-4.20.0/linux-4.20/include/uapi/linux/types.h:5:10: fatal error: asm/types.h: No such file or directory
 #include <asm/types.h>
          ^~~~~~~~~~~~~
compilation terminated.
make[5]: *** [/tmp/B.j97Hah/BUILD/kernel-nopae-4.20.0/linux-4.20/scripts/Makefile.build:292: sound/soc/dwc/dwc-pcm.o] Error 1
make[4]: *** [/tmp/B.j97Hah/BUILD/kernel-nopae-4.20.0/linux-4.20/scripts/Makefile.build:516: sound/soc/dwc] Error 2
  CC [M]  sound/soc/fsl/fsl_asrc.o
In file included from /tmp/B.j97Hah/BUILD/kernel-nopae-4.20.0/linux-4.20/include/linux/compiler.h:172,
                 from /tmp/B.j97Hah/BUILD/kernel-nopae-4.20.0/linux-4.20/include/linux/err.h:5,
                 from /tmp/B.j97Hah/BUILD/kernel-nopae-4.20.0/linux-4.20/include/linux/clk.h:15,
                 from /tmp/B.j97Hah/BUILD/kernel-nopae-4.20.0/linux-4.20/sound/soc/fsl/fsl_asrc.c:9:
/tmp/B.j97Hah/BUILD/kernel-nopae-4.20.0/linux-4.20/include/uapi/linux/types.h:5:10: fatal error: asm/types.h: No such file or directory
 #include <asm/types.h>
          ^~~~~~~~~~~~~
compilation terminated.
make[5]: *** [/tmp/B.j97Hah/BUILD/kernel-nopae-4.20.0/linux-4.20/scripts/Makefile.build:291: sound/soc/fsl/fsl_asrc.o] Error 1
make[5]: *** Waiting for unfinished jobs....
  CC [M]  sound/soc/generic/simple-card-utils.o
In file included from /tmp/B.j97Hah/BUILD/kernel-nopae-4.20.0/linux-4.20/include/linux/compiler.h:172,
                 from /tmp/B.j97Hah/BUILD/kernel-nopae-4.20.0/linux-4.20/include/linux/err.h:5,
                 from /tmp/B.j97Hah/BUILD/kernel-nopae-4.20.0/linux-4.20/include/linux/clk.h:15,
                 from /tmp/B.j97Hah/BUILD/kernel-nopae-4.20.0/linux-4.20/sound/soc/generic/simple-card-utils.c:7:
/tmp/B.j97Hah/BUILD/kernel-nopae-4.20.0/linux-4.20/include/uapi/linux/types.h:5:10: fatal error: asm/types.h: No such file or directory
 #include <asm/types.h>
          ^~~~~~~~~~~~~
compilation terminated.
make[5]: *** [/tmp/B.j97Hah/BUILD/kernel-nopae-4.20.0/linux-4.20/scripts/Makefile.build:292: sound/soc/generic/simple-card-utils.o] Error 1
make[5]: *** Waiting for unfinished jobs....
  CC [M]  sound/soc/codecs/ac97.o
In file included from /tmp/B.j97Hah/BUILD/kernel-nopae-4.20.0/linux-4.20/include/linux/compiler.h:172,
                 from /tmp/B.j97Hah/BUILD/kernel-nopae-4.20.0/linux-4.20/include/linux/init.h:5,
                 from /tmp/B.j97Hah/BUILD/kernel-nopae-4.20.0/linux-4.20/sound/soc/codecs/ac97.c:15:
/tmp/B.j97Hah/BUILD/kernel-nopae-4.20.0/linux-4.20/include/uapi/linux/types.h:5:10: fatal error: asm/types.h: No such file or directory
 #include <asm/types.h>
          ^~~~~~~~~~~~~
compilation terminated.
make[5]: *** [/tmp/B.j97Hah/BUILD/kernel-nopae-4.20.0/linux-4.20/scripts/Makefile.build:292: sound/soc/codecs/ac97.o] Error 1
make[5]: *** Waiting for unfinished jobs....
  CC [M]  sound/soc/generic/simple-card.o
In file included from /tmp/B.j97Hah/BUILD/kernel-nopae-4.20.0/linux-4.20/include/linux/compiler.h:172,
                 from /tmp/B.j97Hah/BUILD/kernel-nopae-4.20.0/linux-4.20/include/linux/err.h:5,
                 from /tmp/B.j97Hah/BUILD/kernel-nopae-4.20.0/linux-4.20/include/linux/clk.h:15,
                 from /tmp/B.j97Hah/BUILD/kernel-nopae-4.20.0/linux-4.20/sound/soc/generic/simple-card.c:8:
/tmp/B.j97Hah/BUILD/kernel-nopae-4.20.0/linux-4.20/include/uapi/linux/types.h:5:10: fatal error: asm/types.h: No such file or directory
 #include <asm/types.h>
          ^~~~~~~~~~~~~
compilation terminated.
make[5]: *** [/tmp/B.j97Hah/BUILD/kernel-nopae-4.20.0/linux-4.20/scripts/Makefile.build:292: sound/soc/generic/simple-card.o] Error 1
make[4]: *** [/tmp/B.j97Hah/BUILD/kernel-nopae-4.20.0/linux-4.20/scripts/Makefile.build:516: sound/soc/generic] Error 2
  CC [M]  sound/soc/fsl/fsl_asrc_dma.o
In file included from /tmp/B.j97Hah/BUILD/kernel-nopae-4.20.0/linux-4.20/include/linux/compiler.h:172,
                 from /tmp/B.j97Hah/BUILD/kernel-nopae-4.20.0/linux-4.20/include/linux/string.h:6,
                 from /tmp/B.j97Hah/BUILD/kernel-nopae-4.20.0/linux-4.20/include/linux/dma-mapping.h:6,
                 from /tmp/B.j97Hah/BUILD/kernel-nopae-4.20.0/linux-4.20/sound/soc/fsl/fsl_asrc_dma.c:9:
/tmp/B.j97Hah/BUILD/kernel-nopae-4.20.0/linux-4.20/include/uapi/linux/types.h:5:10: fatal error: asm/types.h: No such file or directory
 #include <asm/types.h>
          ^~~~~~~~~~~~~
compilation terminated.
make[5]: *** [/tmp/B.j97Hah/BUILD/kernel-nopae-4.20.0/linux-4.20/scripts/Makefile.build:291: sound/soc/fsl/fsl_asrc_dma.o] Error 1
make[4]: *** [/tmp/B.j97Hah/BUILD/kernel-nopae-4.20.0/linux-4.20/scripts/Makefile.build:516: sound/soc/fsl] Error 2
  CC [M]  sound/soc/codecs/adau-utils.o
In file included from /tmp/B.j97Hah/BUILD/kernel-nopae-4.20.0/linux-4.20/include/linux/compiler.h:172,
                 from /tmp/B.j97Hah/BUILD/kernel-nopae-4.20.0/linux-4.20/include/linux/gcd.h:5,
                 from /tmp/B.j97Hah/BUILD/kernel-nopae-4.20.0/linux-4.20/sound/soc/codecs/adau-utils.c:10:
/tmp/B.j97Hah/BUILD/kernel-nopae-4.20.0/linux-4.20/include/uapi/linux/types.h:5:10: fatal error: asm/types.h: No such file or directory
 #include <asm/types.h>
          ^~~~~~~~~~~~~
compilation terminated.
make[5]: *** [/tmp/B.j97Hah/BUILD/kernel-nopae-4.20.0/linux-4.20/scripts/Makefile.build:292: sound/soc/codecs/adau-utils.o] Error 1
  CC [M]  sound/soc/hisilicon/hi6210-i2s.o
In file included from /tmp/B.j97Hah/BUILD/kernel-nopae-4.20.0/linux-4.20/include/linux/compiler.h:172,
                 from /tmp/B.j97Hah/BUILD/kernel-nopae-4.20.0/linux-4.20/include/linux/init.h:5,
                 from /tmp/B.j97Hah/BUILD/kernel-nopae-4.20.0/linux-4.20/sound/soc/hisilicon/hi6210-i2s.c:19:
/tmp/B.j97Hah/BUILD/kernel-nopae-4.20.0/linux-4.20/include/uapi/linux/types.h:5:10: fatal error: asm/types.h: No such file or directory
 #include <asm/types.h>
          ^~~~~~~~~~~~~
compilation terminated.
make[5]: *** [/tmp/B.j97Hah/BUILD/kernel-nopae-4.20.0/linux-4.20/scripts/Makefile.build:298: sound/soc/hisilicon/hi6210-i2s.o] Error 1
make[4]: *** [/tmp/B.j97Hah/BUILD/kernel-nopae-4.20.0/linux-4.20/scripts/Makefile.build:516: sound/soc/hisilicon] Error 2
  CC [M]  sound/soc/codecs/adau1701.o
In file included from /tmp/B.j97Hah/BUILD/kernel-nopae-4.20.0/linux-4.20/include/linux/types.h:6,
                 from /tmp/B.j97Hah/BUILD/kernel-nopae-4.20.0/linux-4.20/include/linux/list.h:5,
                 from /tmp/B.j97Hah/BUILD/kernel-nopae-4.20.0/linux-4.20/include/linux/module.h:9,
                 from /tmp/B.j97Hah/BUILD/kernel-nopae-4.20.0/linux-4.20/sound/soc/codecs/adau1701.c:11:
/tmp/B.j97Hah/BUILD/kernel-nopae-4.20.0/linux-4.20/include/uapi/linux/types.h:5:10: fatal error: asm/types.h: No such file or directory
 #include <asm/types.h>
          ^~~~~~~~~~~~~
compilation terminated.
make[5]: *** [/tmp/B.j97Hah/BUILD/kernel-nopae-4.20.0/linux-4.20/scripts/Makefile.build:292: sound/soc/codecs/adau1701.o] Error 1
make[4]: *** [/tmp/B.j97Hah/BUILD/kernel-nopae-4.20.0/linux-4.20/scripts/Makefile.build:516: sound/soc/codecs] Error 2
make[3]: *** [/tmp/B.j97Hah/BUILD/kernel-nopae-4.20.0/linux-4.20/scripts/Makefile.build:516: sound/soc] Error 2
make[2]: *** [/tmp/B.j97Hah/BUILD/kernel-nopae-4.20.0/linux-4.20/Makefile:1055: sound] Error 2
  CC      drivers/base/regmap/regmap.o
Assembler messages:
Error: can't open /tmp/B.j97Hah/BUILD/tmp/cc91ZkeQ.s for reading: No such file or directory
make[5]: *** [/tmp/B.j97Hah/BUILD/kernel-nopae-4.20.0/linux-4.20/scripts/Makefile.build:291: drivers/base/regmap/regmap.o] Error 1
make[4]: *** [/tmp/B.j97Hah/BUILD/kernel-nopae-4.20.0/linux-4.20/scripts/Makefile.build:516: drivers/base/regmap] Error 2
make[3]: *** [/tmp/B.j97Hah/BUILD/kernel-nopae-4.20.0/linux-4.20/scripts/Makefile.build:516: drivers/base] Error 2
make[2]: *** [/tmp/B.j97Hah/BUILD/kernel-nopae-4.20.0/linux-4.20/Makefile:1055: drivers] Error 2
make[1]: *** [Makefile:152: sub-make] Error 2
make: *** [Makefile:9: all] Error 2
+ rm -rf /tmp/B.j97Hah
Begin-PLD-Builder-Info
Build-Time: user:12.70s sys:8.71s real:224.37s (faults io:0 non-io:73226)

End-PLD-Builder-Info
[Back to list of logs] [View rpm -qa of builder]