FailedOk

th/SRPMS[OK]
th/x32[OK]
th/i686[OK]
th/x86_64[OK]

ac/SRPMS[OK]
ac/i386[OK]
ac/i586[OK]
ac/i686[OK]
ac/alpha[OK]
ac/amd64[OK]
ac/athlon[OK]
ac/ppc[OK]
ac/sparc[OK]
ac/sparc64[OK]

Advanced Search
main()
Powered by PLD Linux
(c) 2002-2018 PLD Team
$Revision: 1.37 $
Powered by VAX.
Your IP: 54.225.55.174

kf5-kcoreaddons 06eb3066-166b-4b2e-9c32-8d6f246ae075

Status:Failed
Source URL:ftp://buildlogs.pld-linux.org/th/i686/FAIL/kf5-kcoreaddons,06eb3066-166b-4b2e-9c32-8d6f246ae075.bz2
text/plain URL:View!
full text:View!
rpm -qa of builder:View!
Date:2018/02/13 22:15:29
Runtime:0:08:48.279563

Toc:

  • error 1
  • error: Bad exit status from /tmp/B.t7bOVq/BUILD/tmp/rpm-tmp.19128 (%build)
  • error 2
  • RPM build errors:
  • error 3
  • error: No files produced.

Content:

cd /tmp/B.t7bOVq/BUILD/kcoreaddons-5.43.0/build/autotests && /usr/bin/i686-pld-linux-g++  -DKDELIBS4CONFIGMIGRATOR_DATA_DIR=\"/tmp/B.t7bOVq/BUILD/kcoreaddons-5.43.0/autotests/data\" -DKDIRWATCH_TEST_METHOD=\"QFSWatch\" -DQT_CORE_LIB -DQT_NO_CAST_FROM_ASCII -DQT_NO_CAST_FROM_BYTEARRAY -DQT_NO_CAST_TO_ASCII -DQT_NO_DEBUG -DQT_NO_SIGNALS_SLOTS_KEYWORDS -DQT_NO_URL_CAST_FROM_STRING -DQT_TESTCASE_BUILDDIR=\"/tmp/B.t7bOVq/BUILD/kcoreaddons-5.43.0/build\" -DQT_TESTLIB_LIB -DQT_USE_FAST_OPERATOR_PLUS -DQT_USE_QSTRINGBUILDER -D_FILE_OFFSET_BITS=64 -D_GNU_SOURCE -D_LARGEFILE64_SOURCE -I/tmp/B.t7bOVq/BUILD/kcoreaddons-5.43.0/build/autotests -I/tmp/B.t7bOVq/BUILD/kcoreaddons-5.43.0/autotests -I/tmp/B.t7bOVq/BUILD/kcoreaddons-5.43.0/build/autotests/kdirwatch_qfswatch_unittest_autogen/include -I/tmp/B.t7bOVq/BUILD/kcoreaddons-5.43.0/build/src/lib/../.. -I/tmp/B.t7bOVq/BUILD/kcoreaddons-5.43.0/src/lib/caching -I/tmp/B.t7bOVq/BUILD/kcoreaddons-5.43.0/build/src/lib/io -I/tmp/B.t7bOVq/BUILD/kcoreaddons-5.43.0/src/lib/io -I/tmp/B.t7bOVq/BUILD/kcoreaddons-5.43.0/src/lib/jobs -I/tmp/B.t7bOVq/BUILD/kcoreaddons-5.43.0/src/lib/plugin -I/tmp/B.t7bOVq/BUILD/kcoreaddons-5.43.0/src/lib/randomness -I/tmp/B.t7bOVq/BUILD/kcoreaddons-5.43.0/src/lib/text -I/tmp/B.t7bOVq/BUILD/kcoreaddons-5.43.0/src/lib/util -I/tmp/B.t7bOVq/BUILD/kcoreaddons-5.43.0/build/src/lib -I/tmp/B.t7bOVq/BUILD/kcoreaddons-5.43.0/src/lib -isystem /usr/include/qt5 -isystem /usr/include/qt5/QtTest -isystem /usr/include/qt5/QtCore -isystem /usr/lib/qt5/./mkspecs/linux-g++  -std=c++0x -fno-operator-names -Wall -Wextra -Wcast-align -Wchar-subscripts -Wformat-security -Wno-long-long -Wpointer-arith -Wundef -Wnon-virtual-dtor -Woverloaded-virtual -Werror=return-type -Wvla -Wdate-time -pedantic -Wsuggest-override -fexceptions -O2 -fwrapv -pipe -Wformat -Werror=format-security -gdwarf-4 -fno-debug-types-section -fvar-tracking-assignments -g2 -Wp,-D_FORTIFY_SOURCE=2 -fstack-protector-strong --param=ssp-buffer-size=4 -fomit-frame-pointer -march=i686 -fasynchronous-unwind-tables -mtune=pentium4 -gdwarf-4 -fno-debug-types-section -fvar-tracking-assignments -g2  -DNDEBUG -DQT_NO_DEBUG -fvisibility=hidden -fvisibility-inlines-hidden   -fPIC -std=gnu++11 -o CMakeFiles/kdirwatch_qfswatch_unittest.dir/kdirwatch_unittest.cpp.o -c /tmp/B.t7bOVq/BUILD/kcoreaddons-5.43.0/autotests/kdirwatch_unittest.cpp
make[2]: Leaving directory '/tmp/B.t7bOVq/BUILD/kcoreaddons-5.43.0/build'
make[2]: Entering directory '/tmp/B.t7bOVq/BUILD/kcoreaddons-5.43.0/build'
[ 93%] Building CXX object autotests/CMakeFiles/kpluginloadertest.dir/kpluginloadertest.cpp.o
cd /tmp/B.t7bOVq/BUILD/kcoreaddons-5.43.0/build/autotests && /usr/bin/i686-pld-linux-g++  -DALWAYSUNLOADPLUGIN_FILE=\"/tmp/B.t7bOVq/BUILD/kcoreaddons-5.43.0/build/bin/alwaysunloadplugin.so\" -DJSONPLUGIN_FILE=\"/tmp/B.t7bOVq/BUILD/kcoreaddons-5.43.0/build/bin/jsonplugin.so\" -DKDELIBS4CONFIGMIGRATOR_DATA_DIR=\"/tmp/B.t7bOVq/BUILD/kcoreaddons-5.43.0/autotests/data\" -DMULTIPLUGIN_FILE=\"/tmp/B.t7bOVq/BUILD/kcoreaddons-5.43.0/build/bin/multiplugin.so\" -DQT_CORE_LIB -DQT_NO_CAST_FROM_ASCII -DQT_NO_CAST_FROM_BYTEARRAY -DQT_NO_CAST_TO_ASCII -DQT_NO_DEBUG -DQT_NO_SIGNALS_SLOTS_KEYWORDS -DQT_NO_URL_CAST_FROM_STRING -DQT_TESTCASE_BUILDDIR=\"/tmp/B.t7bOVq/BUILD/kcoreaddons-5.43.0/build\" -DQT_TESTLIB_LIB -DQT_USE_FAST_OPERATOR_PLUS -DQT_USE_QSTRINGBUILDER -DUNVERSIONEDPLUGIN_FILE=\"/tmp/B.t7bOVq/BUILD/kcoreaddons-5.43.0/build/bin/unversionedplugin.so\" -DVERSIONEDPLUGIN_FILE=\"/tmp/B.t7bOVq/BUILD/kcoreaddons-5.43.0/build/bin/versionedplugin.so\" -D_FILE_OFFSET_BITS=64 -D_GNU_SOURCE -D_LARGEFILE64_SOURCE -I/tmp/B.t7bOVq/BUILD/kcoreaddons-5.43.0/build/autotests -I/tmp/B.t7bOVq/BUILD/kcoreaddons-5.43.0/autotests -I/tmp/B.t7bOVq/BUILD/kcoreaddons-5.43.0/build/autotests/kpluginloadertest_autogen/include -I/tmp/B.t7bOVq/BUILD/kcoreaddons-5.43.0/build/src/lib/../.. -I/tmp/B.t7bOVq/BUILD/kcoreaddons-5.43.0/src/lib/caching -I/tmp/B.t7bOVq/BUILD/kcoreaddons-5.43.0/build/src/lib/io -I/tmp/B.t7bOVq/BUILD/kcoreaddons-5.43.0/src/lib/io -I/tmp/B.t7bOVq/BUILD/kcoreaddons-5.43.0/src/lib/jobs -I/tmp/B.t7bOVq/BUILD/kcoreaddons-5.43.0/src/lib/plugin -I/tmp/B.t7bOVq/BUILD/kcoreaddons-5.43.0/src/lib/randomness -I/tmp/B.t7bOVq/BUILD/kcoreaddons-5.43.0/src/lib/text -I/tmp/B.t7bOVq/BUILD/kcoreaddons-5.43.0/src/lib/util -I/tmp/B.t7bOVq/BUILD/kcoreaddons-5.43.0/build/src/lib -I/tmp/B.t7bOVq/BUILD/kcoreaddons-5.43.0/src/lib -isystem /usr/include/qt5 -isystem /usr/include/qt5/QtTest -isystem /usr/include/qt5/QtCore -isystem /usr/lib/qt5/./mkspecs/linux-g++  -std=c++0x -fno-operator-names -Wall -Wextra -Wcast-align -Wchar-subscripts -Wformat-security -Wno-long-long -Wpointer-arith -Wundef -Wnon-virtual-dtor -Woverloaded-virtual -Werror=return-type -Wvla -Wdate-time -pedantic -Wsuggest-override -fexceptions -O2 -fwrapv -pipe -Wformat -Werror=format-security -gdwarf-4 -fno-debug-types-section -fvar-tracking-assignments -g2 -Wp,-D_FORTIFY_SOURCE=2 -fstack-protector-strong --param=ssp-buffer-size=4 -fomit-frame-pointer -march=i686 -fasynchronous-unwind-tables -mtune=pentium4 -gdwarf-4 -fno-debug-types-section -fvar-tracking-assignments -g2  -DNDEBUG -DQT_NO_DEBUG -fvisibility=hidden -fvisibility-inlines-hidden   -fPIC -std=gnu++11 -o CMakeFiles/kpluginloadertest.dir/kpluginloadertest.cpp.o -c /tmp/B.t7bOVq/BUILD/kcoreaddons-5.43.0/autotests/kpluginloadertest.cpp
make[2]: Leaving directory '/tmp/B.t7bOVq/BUILD/kcoreaddons-5.43.0/build'
make[2]: Entering directory '/tmp/B.t7bOVq/BUILD/kcoreaddons-5.43.0/build'
[100%] Linking CXX executable ../bin/kdirwatch_stat_unittest
cd /tmp/B.t7bOVq/BUILD/kcoreaddons-5.43.0/build/autotests && /usr/bin/cmake -E cmake_link_script CMakeFiles/kdirwatch_stat_unittest.dir/link.txt --verbose=1
/usr/bin/i686-pld-linux-g++  -std=c++0x -fno-operator-names -Wall -Wextra -Wcast-align -Wchar-subscripts -Wformat-security -Wno-long-long -Wpointer-arith -Wundef -Wnon-virtual-dtor -Woverloaded-virtual -Werror=return-type -Wvla -Wdate-time -pedantic -Wsuggest-override -fexceptions -O2 -fwrapv -pipe -Wformat -Werror=format-security -gdwarf-4 -fno-debug-types-section -fvar-tracking-assignments -g2 -Wp,-D_FORTIFY_SOURCE=2 -fstack-protector-strong --param=ssp-buffer-size=4 -fomit-frame-pointer -march=i686 -fasynchronous-unwind-tables -mtune=pentium4 -gdwarf-4 -fno-debug-types-section -fvar-tracking-assignments -g2  -DNDEBUG -DQT_NO_DEBUG  -Wl,--enable-new-dtags  -Wl,--as-needed -Wl,--no-copy-dt-needed-entries -Wl,-z,relro -Wl,-z,combreloc -rdynamic CMakeFiles/kdirwatch_stat_unittest.dir/kdirwatch_unittest.cpp.o CMakeFiles/kdirwatch_stat_unittest.dir/kdirwatch_stat_unittest_autogen/mocs_compilation.cpp.o  -o ../bin/kdirwatch_stat_unittest -Wl,-rpath,/tmp/B.t7bOVq/BUILD/kcoreaddons-5.43.0/build/bin /usr/lib/libQt5Test.so.5.8.0 ../bin/libKF5CoreAddons.so.5.43.0 /usr/lib/libQt5Core.so.5.8.0 
make[2]: Leaving directory '/tmp/B.t7bOVq/BUILD/kcoreaddons-5.43.0/build'
make[1]: Entering directory '/tmp/B.t7bOVq/BUILD/kcoreaddons-5.43.0/build'
[100%] Built target kdirwatch_stat_unittest
make[1]: Leaving directory '/tmp/B.t7bOVq/BUILD/kcoreaddons-5.43.0/build'
make[2]: Entering directory '/tmp/B.t7bOVq/BUILD/kcoreaddons-5.43.0/build'
[100%] Linking CXX executable ../bin/kdirwatch_qfswatch_unittest
cd /tmp/B.t7bOVq/BUILD/kcoreaddons-5.43.0/build/autotests && /usr/bin/cmake -E cmake_link_script CMakeFiles/kdirwatch_qfswatch_unittest.dir/link.txt --verbose=1
/usr/bin/i686-pld-linux-g++  -std=c++0x -fno-operator-names -Wall -Wextra -Wcast-align -Wchar-subscripts -Wformat-security -Wno-long-long -Wpointer-arith -Wundef -Wnon-virtual-dtor -Woverloaded-virtual -Werror=return-type -Wvla -Wdate-time -pedantic -Wsuggest-override -fexceptions -O2 -fwrapv -pipe -Wformat -Werror=format-security -gdwarf-4 -fno-debug-types-section -fvar-tracking-assignments -g2 -Wp,-D_FORTIFY_SOURCE=2 -fstack-protector-strong --param=ssp-buffer-size=4 -fomit-frame-pointer -march=i686 -fasynchronous-unwind-tables -mtune=pentium4 -gdwarf-4 -fno-debug-types-section -fvar-tracking-assignments -g2  -DNDEBUG -DQT_NO_DEBUG  -Wl,--enable-new-dtags  -Wl,--as-needed -Wl,--no-copy-dt-needed-entries -Wl,-z,relro -Wl,-z,combreloc -rdynamic CMakeFiles/kdirwatch_qfswatch_unittest.dir/kdirwatch_unittest.cpp.o CMakeFiles/kdirwatch_qfswatch_unittest.dir/kdirwatch_qfswatch_unittest_autogen/mocs_compilation.cpp.o  -o ../bin/kdirwatch_qfswatch_unittest -Wl,-rpath,/tmp/B.t7bOVq/BUILD/kcoreaddons-5.43.0/build/bin /usr/lib/libQt5Test.so.5.8.0 ../bin/libKF5CoreAddons.so.5.43.0 /usr/lib/libQt5Core.so.5.8.0 
make[2]: Leaving directory '/tmp/B.t7bOVq/BUILD/kcoreaddons-5.43.0/build'
make[2]: Entering directory '/tmp/B.t7bOVq/BUILD/kcoreaddons-5.43.0/build'
[100%] Linking CXX executable ../bin/kpluginloadertest
cd /tmp/B.t7bOVq/BUILD/kcoreaddons-5.43.0/build/autotests && /usr/bin/cmake -E cmake_link_script CMakeFiles/kpluginloadertest.dir/link.txt --verbose=1
/usr/bin/i686-pld-linux-g++  -std=c++0x -fno-operator-names -Wall -Wextra -Wcast-align -Wchar-subscripts -Wformat-security -Wno-long-long -Wpointer-arith -Wundef -Wnon-virtual-dtor -Woverloaded-virtual -Werror=return-type -Wvla -Wdate-time -pedantic -Wsuggest-override -fexceptions -O2 -fwrapv -pipe -Wformat -Werror=format-security -gdwarf-4 -fno-debug-types-section -fvar-tracking-assignments -g2 -Wp,-D_FORTIFY_SOURCE=2 -fstack-protector-strong --param=ssp-buffer-size=4 -fomit-frame-pointer -march=i686 -fasynchronous-unwind-tables -mtune=pentium4 -gdwarf-4 -fno-debug-types-section -fvar-tracking-assignments -g2  -DNDEBUG -DQT_NO_DEBUG  -Wl,--enable-new-dtags  -Wl,--as-needed -Wl,--no-copy-dt-needed-entries -Wl,-z,relro -Wl,-z,combreloc -rdynamic CMakeFiles/kpluginloadertest.dir/kpluginloadertest.cpp.o CMakeFiles/kpluginloadertest.dir/kpluginloadertest_autogen/mocs_compilation.cpp.o  -o ../bin/kpluginloadertest -Wl,-rpath,/tmp/B.t7bOVq/BUILD/kcoreaddons-5.43.0/build/bin /usr/lib/libQt5Test.so.5.8.0 ../bin/libKF5CoreAddons.so.5.43.0 /usr/lib/libQt5Core.so.5.8.0 
make[2]: Leaving directory '/tmp/B.t7bOVq/BUILD/kcoreaddons-5.43.0/build'
make[1]: Entering directory '/tmp/B.t7bOVq/BUILD/kcoreaddons-5.43.0/build'
[100%] Built target kdirwatch_qfswatch_unittest
make[1]: Leaving directory '/tmp/B.t7bOVq/BUILD/kcoreaddons-5.43.0/build'
make[1]: Entering directory '/tmp/B.t7bOVq/BUILD/kcoreaddons-5.43.0/build'
[100%] Built target kpluginloadertest
make[1]: Leaving directory '/tmp/B.t7bOVq/BUILD/kcoreaddons-5.43.0/build'
/usr/bin/cmake -E cmake_progress_start /tmp/B.t7bOVq/BUILD/kcoreaddons-5.43.0/build/CMakeFiles 0
+ /usr/bin/make -Otarget -j9 test
Running tests...
/usr/bin/ctest --force-new-ctest-process 
Test project /tmp/B.t7bOVq/BUILD/kcoreaddons-5.43.0/build
      Start  1: appstreamtest
 1/25 Test  #1: appstreamtest ....................   Passed    0.01 sec
      Start  2: kaboutdatatest
 2/25 Test  #2: kaboutdatatest ...................***Failed    0.01 sec
      Start  3: kaboutdataapplicationdatatest
 3/25 Test  #3: kaboutdataapplicationdatatest ....   Passed    0.01 sec
      Start  4: kautosavefiletest
 4/25 Test  #4: kautosavefiletest ................***Failed    1.61 sec
      Start  5: kcompositejobtest
 5/25 Test  #5: kcompositejobtest ................   Passed    0.01 sec
      Start  6: kformattest
 6/25 Test  #6: kformattest ......................   Passed    0.01 sec
      Start  7: kjobtest
 7/25 Test  #7: kjobtest .........................   Passed    0.31 sec
      Start  8: kpluginfactorytest
 8/25 Test  #8: kpluginfactorytest ...............   Passed    0.01 sec
      Start  9: kpluginloadertest
 9/25 Test  #9: kpluginloadertest ................   Passed    0.02 sec
      Start 10: kpluginmetadatatest
10/25 Test #10: kpluginmetadatatest ..............   Passed    0.01 sec
      Start 11: kprocesstest
11/25 Test #11: kprocesstest .....................   Passed    0.04 sec
      Start 12: krandomtest
12/25 Test #12: krandomtest ......................   Passed    0.02 sec
      Start 13: kshareddatacachetest
13/25 Test #13: kshareddatacachetest .............   Passed    0.03 sec
      Start 14: kshelltest
14/25 Test #14: kshelltest .......................   Passed    0.01 sec
      Start 15: kurlmimedatatest
15/25 Test #15: kurlmimedatatest .................   Passed    0.01 sec
      Start 16: kstringhandlertest
16/25 Test #16: kstringhandlertest ...............***Failed    0.01 sec
      Start 17: kusertest
17/25 Test #17: kusertest ........................   Passed    0.01 sec
      Start 18: kdelibs4migrationtest
18/25 Test #18: kdelibs4migrationtest ............   Passed    0.01 sec
      Start 19: kdelibs4configmigratortest
19/25 Test #19: kdelibs4configmigratortest .......   Passed    0.01 sec
      Start 20: desktoptojsontest
20/25 Test #20: desktoptojsontest ................   Passed    0.05 sec
      Start 21: ktexttohtmltest
21/25 Test #21: ktexttohtmltest ..................   Passed    1.50 sec
      Start 22: kdirwatch_stat_unittest
22/25 Test #22: kdirwatch_stat_unittest ..........***Failed   54.24 sec
      Start 23: kdirwatch_inotify_unittest
23/25 Test #23: kdirwatch_inotify_unittest .......   Passed   33.24 sec
      Start 24: kdirwatch_fam_unittest
24/25 Test #24: kdirwatch_fam_unittest ...........***Exception: Child aborted341.56 sec
      Start 25: kdirwatch_qfswatch_unittest
25/25 Test #25: kdirwatch_qfswatch_unittest ......***Failed   51.21 sec

76% tests passed, 6 tests failed out of 25

Total Test time (real) = 483.93 sec

The following tests FAILED:
	  2 - kaboutdatatest (Failed)
	  4 - kautosavefiletest (Failed)
	 16 - kstringhandlertest (Failed)
	 22 - kdirwatch_stat_unittest (Failed)
	 24 - kdirwatch_fam_unittest (Child aborted)
	 25 - kdirwatch_qfswatch_unittest (Failed)
Errors while running CTest
make: *** [Makefile:123: test] Error 8
error: Bad exit status from /tmp/B.t7bOVq/BUILD/tmp/rpm-tmp.19128 (%build)


RPM build errors:
    Bad exit status from /tmp/B.t7bOVq/BUILD/tmp/rpm-tmp.19128 (%build)
ended at: Tue Feb 13 22:15:28 2018, done in 0:08:48.279563
error: No files produced.
+ chmod -R u+rwX /tmp/B.t7bOVq/BUILD
+ rm -rf /tmp/B.t7bOVq/tmp /tmp/B.t7bOVq/BUILD
+ rm -rf /tmp/B.t7bOVq
Begin-PLD-Builder-Info
Build-Time: user:188.48s sys:28.34s real:532.52s (faults io:3 non-io:3516651)

End-PLD-Builder-Info
[Back to list of logs] [View rpm -qa of builder]