FailedOk

th/SRPMS[OK]
th/x32[OK]
th/i686[OK]
th/x86_64[OK]

ac/SRPMS[OK]
ac/i386[OK]
ac/i586[OK]
ac/i686[OK]
ac/alpha[OK]
ac/amd64[OK]
ac/athlon[OK]
ac/ppc[OK]
ac/sparc[OK]
ac/sparc64[OK]

Advanced Search
main()
Powered by PLD Linux
(c) 2002-2017 PLD Team
$Revision: 1.37 $
Powered by Dark Side of the Force.
Your IP: 54.156.50.71

lftp 9f9b4c1a-dfbd-410d-baae-fe024438414f

Status:Failed
Source URL:ftp://buildlogs.pld-linux.org/th/i686/FAIL/lftp,9f9b4c1a-dfbd-410d-baae-fe024438414f.bz2
text/plain URL:View!
full text:View!
rpm -qa of builder:View!
Date:2017/07/22 15:24:06
Runtime:1:24:23.178483

Toc:

Content:

Making all in po
test ! -f ./lftp.pot || \
  test -z "de.gmo es.gmo fr.gmo it.gmo ja.gmo ko.gmo pl.gmo pt_BR.gmo ru.gmo uk.gmo zh_CN.gmo zh_TW.gmo zh_HK.gmo cs.gmo" || /usr/bin/make de.gmo es.gmo fr.gmo it.gmo ja.gmo ko.gmo pl.gmo pt_BR.gmo ru.gmo uk.gmo zh_CN.gmo zh_TW.gmo zh_HK.gmo cs.gmo
make[3]: 'de.gmo' is up to date.
make[3]: 'es.gmo' is up to date.
make[3]: 'fr.gmo' is up to date.
make[3]: 'it.gmo' is up to date.
make[3]: 'ja.gmo' is up to date.
make[3]: 'ko.gmo' is up to date.
make[3]: 'pl.gmo' is up to date.
make[3]: 'pt_BR.gmo' is up to date.
make[3]: 'ru.gmo' is up to date.
make[3]: 'uk.gmo' is up to date.
make[3]: 'zh_CN.gmo' is up to date.
make[3]: 'zh_TW.gmo' is up to date.
make[3]: 'zh_HK.gmo' is up to date.
make[3]: 'cs.gmo' is up to date.
make[2]: Entering directory '/tmp/B.U6EVIx/BUILD/lftp-4.8.0/po'
touch stamp-po
make[2]: Leaving directory '/tmp/B.U6EVIx/BUILD/lftp-4.8.0/po'
Making all in contrib
make[2]: Nothing to be done for 'all'.
Making all in tests
make[2]: Nothing to be done for 'all'.
make[2]: Nothing to be done for 'all-am'.
+ /usr/bin/make -Otarget -j9 check
/usr/bin/make  check-recursive
Making check in m4
make[2]: Nothing to be done for 'check'.
Making check in doc
make[2]: Nothing to be done for 'check'.
Making check in lib
/usr/bin/make  check-recursive
Making check in src
make[2]: Nothing to be done for 'check'.
Making check in po
make[2]: Nothing to be done for 'check'.
Making check in contrib
make[2]: Nothing to be done for 'check'.
Making check in tests
/usr/bin/make  module1.la ftp-mlsd ftp-list http-get ftp-cls-l \
  module1 lftp-https-get lftp-queue-kill
make[3]: 'module1' is up to date.
make[3]: Nothing to be done for 'lftp-https-get'.
make[3]: Nothing to be done for 'lftp-queue-kill'.
make[3]: Entering directory '/tmp/B.U6EVIx/BUILD/lftp-4.8.0/tests'
i686-pld-linux-g++ -DHAVE_CONFIG_H -I. -I../lib  -I../lib -I../trio -I../src   -O2 -fwrapv -pipe -Wformat -Werror=format-security -gdwarf-4 -fno-debug-types-section -fvar-tracking-assignments -g2 -Wp,-D_FORTIFY_SOURCE=2 -fstack-protector-strong --param=ssp-buffer-size=4 -fomit-frame-pointer -march=i686 -fasynchronous-unwind-tables -mtune=pentium4 -gdwarf-4 -fno-debug-types-section -fvar-tracking-assignments -g2  -fno-rtti -fno-exceptions -Wall -Wwrite-strings -Woverloaded-virtual -fno-exceptions -fno-rtti -fno-implement-inlines -MT ftp-list.o -MD -MP -MF .deps/ftp-list.Tpo -c -o ftp-list.o ftp-list.cc
ftp-list.cc: In function 'int main(int, char**)':
ftp-list.cc:44:29: warning: ignoring return value of 'ssize_t write(int, const void*, size_t)', declared with attribute warn_unused_result [-Wunused-result]
       write(1,buf.Get(),res);
                             ^
mv -f .deps/ftp-list.Tpo .deps/ftp-list.Po
make[3]: Leaving directory '/tmp/B.U6EVIx/BUILD/lftp-4.8.0/tests'
make[3]: Entering directory '/tmp/B.U6EVIx/BUILD/lftp-4.8.0/tests'
i686-pld-linux-g++ -DHAVE_CONFIG_H -I. -I../lib  -I../lib -I../trio -I../src   -O2 -fwrapv -pipe -Wformat -Werror=format-security -gdwarf-4 -fno-debug-types-section -fvar-tracking-assignments -g2 -Wp,-D_FORTIFY_SOURCE=2 -fstack-protector-strong --param=ssp-buffer-size=4 -fomit-frame-pointer -march=i686 -fasynchronous-unwind-tables -mtune=pentium4 -gdwarf-4 -fno-debug-types-section -fvar-tracking-assignments -g2  -fno-rtti -fno-exceptions -Wall -Wwrite-strings -Woverloaded-virtual -fno-exceptions -fno-rtti -fno-implement-inlines -MT ftp-cls-l.o -MD -MP -MF .deps/ftp-cls-l.Tpo -c -o ftp-cls-l.o ftp-cls-l.cc
mv -f .deps/ftp-cls-l.Tpo .deps/ftp-cls-l.Po
make[3]: Leaving directory '/tmp/B.U6EVIx/BUILD/lftp-4.8.0/tests'
make[3]: Entering directory '/tmp/B.U6EVIx/BUILD/lftp-4.8.0/tests'
i686-pld-linux-g++ -DHAVE_CONFIG_H -I. -I../lib  -I../lib -I../trio -I../src   -O2 -fwrapv -pipe -Wformat -Werror=format-security -gdwarf-4 -fno-debug-types-section -fvar-tracking-assignments -g2 -Wp,-D_FORTIFY_SOURCE=2 -fstack-protector-strong --param=ssp-buffer-size=4 -fomit-frame-pointer -march=i686 -fasynchronous-unwind-tables -mtune=pentium4 -gdwarf-4 -fno-debug-types-section -fvar-tracking-assignments -g2  -fno-rtti -fno-exceptions -Wall -Wwrite-strings -Woverloaded-virtual -fno-exceptions -fno-rtti -fno-implement-inlines -MT http-get.o -MD -MP -MF .deps/http-get.Tpo -c -o http-get.o http-get.cc
http-get.cc: In function 'int main(int, char**)':
http-get.cc:45:29: warning: ignoring return value of 'ssize_t write(int, const void*, size_t)', declared with attribute warn_unused_result [-Wunused-result]
       write(1,buf.Get(),res);
                             ^
mv -f .deps/http-get.Tpo .deps/http-get.Po
make[3]: Leaving directory '/tmp/B.U6EVIx/BUILD/lftp-4.8.0/tests'
make[3]: Entering directory '/tmp/B.U6EVIx/BUILD/lftp-4.8.0/tests'
/bin/sh ../libtool --silent  --tag=CXX   --mode=compile i686-pld-linux-g++ -DHAVE_CONFIG_H -I. -I../lib  -I../lib -I../trio -I../src   -O2 -fwrapv -pipe -Wformat -Werror=format-security -gdwarf-4 -fno-debug-types-section -fvar-tracking-assignments -g2 -Wp,-D_FORTIFY_SOURCE=2 -fstack-protector-strong --param=ssp-buffer-size=4 -fomit-frame-pointer -march=i686 -fasynchronous-unwind-tables -mtune=pentium4 -gdwarf-4 -fno-debug-types-section -fvar-tracking-assignments -g2  -fno-rtti -fno-exceptions -Wall -Wwrite-strings -Woverloaded-virtual -fno-exceptions -fno-rtti -fno-implement-inlines -MT module1.lo -MD -MP -MF .deps/module1.Tpo -c -o module1.lo module1.cc
mv -f .deps/module1.Tpo .deps/module1.Plo
make[3]: Leaving directory '/tmp/B.U6EVIx/BUILD/lftp-4.8.0/tests'
make[3]: Entering directory '/tmp/B.U6EVIx/BUILD/lftp-4.8.0/tests'
i686-pld-linux-g++ -DHAVE_CONFIG_H -I. -I../lib  -I../lib -I../trio -I../src   -O2 -fwrapv -pipe -Wformat -Werror=format-security -gdwarf-4 -fno-debug-types-section -fvar-tracking-assignments -g2 -Wp,-D_FORTIFY_SOURCE=2 -fstack-protector-strong --param=ssp-buffer-size=4 -fomit-frame-pointer -march=i686 -fasynchronous-unwind-tables -mtune=pentium4 -gdwarf-4 -fno-debug-types-section -fvar-tracking-assignments -g2  -fno-rtti -fno-exceptions -Wall -Wwrite-strings -Woverloaded-virtual -fno-exceptions -fno-rtti -fno-implement-inlines -MT ftp-mlsd.o -MD -MP -MF .deps/ftp-mlsd.Tpo -c -o ftp-mlsd.o ftp-mlsd.cc
mv -f .deps/ftp-mlsd.Tpo .deps/ftp-mlsd.Po
make[3]: Leaving directory '/tmp/B.U6EVIx/BUILD/lftp-4.8.0/tests'
make[3]: Entering directory '/tmp/B.U6EVIx/BUILD/lftp-4.8.0/tests'
/bin/sh ../libtool --silent  --tag=CXX   --mode=link i686-pld-linux-g++  -O2 -fwrapv -pipe -Wformat -Werror=format-security -gdwarf-4 -fno-debug-types-section -fvar-tracking-assignments -g2 -Wp,-D_FORTIFY_SOURCE=2 -fstack-protector-strong --param=ssp-buffer-size=4 -fomit-frame-pointer -march=i686 -fasynchronous-unwind-tables -mtune=pentium4 -gdwarf-4 -fno-debug-types-section -fvar-tracking-assignments -g2  -fno-rtti -fno-exceptions -Wall -Wwrite-strings -Woverloaded-virtual -fno-exceptions -fno-rtti -fno-implement-inlines -module -avoid-version -rpath /tmp/B.U6EVIx/BUILD/lftp-4.8.0/tests/.libs -Wl,--as-needed -Wl,--no-copy-dt-needed-entries -Wl,-z,relro -Wl,-z,combreloc  -o module1.la  module1.lo  -lutil -ltinfo -lresolv -ldl  -lidn
make[3]: Leaving directory '/tmp/B.U6EVIx/BUILD/lftp-4.8.0/tests'
make[3]: Entering directory '/tmp/B.U6EVIx/BUILD/lftp-4.8.0/tests'
/bin/sh ../libtool --silent  --tag=CXX   --mode=link i686-pld-linux-g++  -O2 -fwrapv -pipe -Wformat -Werror=format-security -gdwarf-4 -fno-debug-types-section -fvar-tracking-assignments -g2 -Wp,-D_FORTIFY_SOURCE=2 -fstack-protector-strong --param=ssp-buffer-size=4 -fomit-frame-pointer -march=i686 -fasynchronous-unwind-tables -mtune=pentium4 -gdwarf-4 -fno-debug-types-section -fvar-tracking-assignments -g2  -fno-rtti -fno-exceptions -Wall -Wwrite-strings -Woverloaded-virtual -fno-exceptions -fno-rtti -fno-implement-inlines  -Wl,--as-needed -Wl,--no-copy-dt-needed-entries -Wl,-z,relro -Wl,-z,combreloc  -o ftp-list ftp-list.o  ../src/liblftp-tasks.la -lutil -ltinfo -lresolv -ldl  -lidn
make[3]: Leaving directory '/tmp/B.U6EVIx/BUILD/lftp-4.8.0/tests'
make[3]: Entering directory '/tmp/B.U6EVIx/BUILD/lftp-4.8.0/tests'
/bin/sh ../libtool --silent  --tag=CXX   --mode=link i686-pld-linux-g++  -O2 -fwrapv -pipe -Wformat -Werror=format-security -gdwarf-4 -fno-debug-types-section -fvar-tracking-assignments -g2 -Wp,-D_FORTIFY_SOURCE=2 -fstack-protector-strong --param=ssp-buffer-size=4 -fomit-frame-pointer -march=i686 -fasynchronous-unwind-tables -mtune=pentium4 -gdwarf-4 -fno-debug-types-section -fvar-tracking-assignments -g2  -fno-rtti -fno-exceptions -Wall -Wwrite-strings -Woverloaded-virtual -fno-exceptions -fno-rtti -fno-implement-inlines  -Wl,--as-needed -Wl,--no-copy-dt-needed-entries -Wl,-z,relro -Wl,-z,combreloc  -o ftp-cls-l ftp-cls-l.o  ../src/liblftp-jobs.la ../src/liblftp-tasks.la -lutil -ltinfo -lresolv -ldl  -lidn
make[3]: Leaving directory '/tmp/B.U6EVIx/BUILD/lftp-4.8.0/tests'
make[3]: Entering directory '/tmp/B.U6EVIx/BUILD/lftp-4.8.0/tests'
/bin/sh ../libtool --silent  --tag=CXX   --mode=link i686-pld-linux-g++  -O2 -fwrapv -pipe -Wformat -Werror=format-security -gdwarf-4 -fno-debug-types-section -fvar-tracking-assignments -g2 -Wp,-D_FORTIFY_SOURCE=2 -fstack-protector-strong --param=ssp-buffer-size=4 -fomit-frame-pointer -march=i686 -fasynchronous-unwind-tables -mtune=pentium4 -gdwarf-4 -fno-debug-types-section -fvar-tracking-assignments -g2  -fno-rtti -fno-exceptions -Wall -Wwrite-strings -Woverloaded-virtual -fno-exceptions -fno-rtti -fno-implement-inlines  -Wl,--as-needed -Wl,--no-copy-dt-needed-entries -Wl,-z,relro -Wl,-z,combreloc  -o http-get http-get.o  ../src/liblftp-tasks.la -lutil -ltinfo -lresolv -ldl  -lidn
make[3]: Leaving directory '/tmp/B.U6EVIx/BUILD/lftp-4.8.0/tests'
make[3]: Entering directory '/tmp/B.U6EVIx/BUILD/lftp-4.8.0/tests'
/bin/sh ../libtool --silent  --tag=CXX   --mode=link i686-pld-linux-g++  -O2 -fwrapv -pipe -Wformat -Werror=format-security -gdwarf-4 -fno-debug-types-section -fvar-tracking-assignments -g2 -Wp,-D_FORTIFY_SOURCE=2 -fstack-protector-strong --param=ssp-buffer-size=4 -fomit-frame-pointer -march=i686 -fasynchronous-unwind-tables -mtune=pentium4 -gdwarf-4 -fno-debug-types-section -fvar-tracking-assignments -g2  -fno-rtti -fno-exceptions -Wall -Wwrite-strings -Woverloaded-virtual -fno-exceptions -fno-rtti -fno-implement-inlines  -Wl,--as-needed -Wl,--no-copy-dt-needed-entries -Wl,-z,relro -Wl,-z,combreloc  -o ftp-mlsd ftp-mlsd.o  ../src/liblftp-tasks.la -lutil -ltinfo -lresolv -ldl  -lidn
make[3]: Leaving directory '/tmp/B.U6EVIx/BUILD/lftp-4.8.0/tests'
/usr/bin/make  check-TESTS
make[4]: Entering directory '/tmp/B.U6EVIx/BUILD/lftp-4.8.0/tests'
PASS: ftp-mlsd
make[4]: Leaving directory '/tmp/B.U6EVIx/BUILD/lftp-4.8.0/tests'
make[4]: Entering directory '/tmp/B.U6EVIx/BUILD/lftp-4.8.0/tests'
PASS: lftp-queue-kill
make[4]: Leaving directory '/tmp/B.U6EVIx/BUILD/lftp-4.8.0/tests'
make[4]: Entering directory '/tmp/B.U6EVIx/BUILD/lftp-4.8.0/tests'
PASS: module1
make[4]: Leaving directory '/tmp/B.U6EVIx/BUILD/lftp-4.8.0/tests'
make[4]: Entering directory '/tmp/B.U6EVIx/BUILD/lftp-4.8.0/tests'
FAIL: ftp-list
make[4]: Leaving directory '/tmp/B.U6EVIx/BUILD/lftp-4.8.0/tests'
make[4]: Entering directory '/tmp/B.U6EVIx/BUILD/lftp-4.8.0/tests'
FAIL: http-get
make[4]: Leaving directory '/tmp/B.U6EVIx/BUILD/lftp-4.8.0/tests'
make[4]: Entering directory '/tmp/B.U6EVIx/BUILD/lftp-4.8.0/tests'
FAIL: lftp-https-get
make[4]: Leaving directory '/tmp/B.U6EVIx/BUILD/lftp-4.8.0/tests'
make[4]: Entering directory '/tmp/B.U6EVIx/BUILD/lftp-4.8.0/tests'
FAIL: ftp-cls-l
make[4]: Leaving directory '/tmp/B.U6EVIx/BUILD/lftp-4.8.0/tests'
make[4]: Entering directory '/tmp/B.U6EVIx/BUILD/lftp-4.8.0/tests'
============================================================================
Testsuite summary for lftp 4.8.0
============================================================================
# TOTAL: 7
# PASS:  3
# SKIP:  0
# XFAIL: 0
# FAIL:  4
# XPASS: 0
# ERROR: 0
============================================================================
See tests/test-suite.log
Please report to lftp-bugs@lftp.yar.ru
============================================================================
make[4]: *** [Makefile:1983: test-suite.log] Error 1
make[4]: Leaving directory '/tmp/B.U6EVIx/BUILD/lftp-4.8.0/tests'
make[3]: *** [Makefile:2091: check-TESTS] Error 2
make[2]: *** [Makefile:2204: check-am] Error 2
make[1]: *** [Makefile:1670: check-recursive] Error 1
make: *** [Makefile:1962: check] Error 2
error: Bad exit status from /tmp/B.U6EVIx/BUILD/tmp/rpm-tmp.51030 (%build)


RPM build errors:
    Bad exit status from /tmp/B.U6EVIx/BUILD/tmp/rpm-tmp.51030 (%build)
ended at: Sat Jul 22 15:24:05 2017, done in 1:24:23.178483
error: No files produced.
+ chmod -R u+rwX /tmp/B.U6EVIx/BUILD
+ rm -rf /tmp/B.U6EVIx/tmp /tmp/B.U6EVIx/BUILD
+ rm -rf /tmp/B.U6EVIx
Begin-PLD-Builder-Info
Build-Time: user:104.01s sys:10.30s real:5079.54s (faults io:0 non-io:4970502)

End-PLD-Builder-Info
[Back to list of logs] [View rpm -qa of builder]