FailedOk

th/SRPMS[OK]
th/x32[OK]
th/i686[OK]
th/x86_64[OK]

ac/SRPMS[OK]
ac/i386[OK]
ac/i586[OK]
ac/i686[OK]
ac/alpha[OK]
ac/amd64[OK]
ac/athlon[OK]
ac/ppc[OK]
ac/sparc[OK]
ac/sparc64[OK]

Advanced Search
main()
Powered by PLD Linux
(c) 2002-2020 PLD Team
$Revision: 1.37 $
Powered by VAX.
Your IP: 35.172.233.215

libafdt 9cdb14b8-066b-415e-ad3c-8786b14d97df

Status:Failed
Source URL:https://buildlogs.pld-linux.org/pld/th/i686/FAIL/libafdt,9cdb14b8-066b-415e-ad3c-8786b14d97df.bz2
text/plain URL:View!
full text:View!
rpm -qa of builder:View!
Date:2020/02/08 18:18:57
Runtime:0:00:13.331673

Toc:

  • error 1
  • FAIL: test/runtests.py
  • error 2
  • # XFAIL: 0
  • error 3
  • # FAIL: 1
  • error 4
  • # ERROR: 0
  • error 5
  • make[2]: *** [Makefile:932: test-suite.log] Error 1
  • error 6
  • make[1]: *** [Makefile:1040: check-TESTS] Error 2
  • error 7
  • error: Bad exit status from /tmp/B.683z3i/BUILD/tmp/rpm-tmp.41822 (%build)
  • error 8
  • RPM build errors:
  • error 9
  • error: No files produced.

Content:

checking for uint32_t... yes
checking for uint8_t... yes
checking for stdlib.h... (cached) yes
checking for GNU libc compatible malloc... yes
checking for memset... yes
checking for socket... yes
checking for strerror... yes
checking whether AF_LOCAL is declared... yes
checking whether PF_LOCAL is declared... yes
checking for libevent >= 2.0.9... yes
checking for a Python interpreter with version >= 2.6... python
checking for python... /usr/bin/python
checking for python version... 2.7
checking for python platform... linux2
checking for python script directory... ${prefix}/share/python2.7/site-packages
checking for python extension module directory... ${exec_prefix}/lib/python2.7/site-packages
checking that generated files are newer than configure... done
configure: creating ./config.status
config.status: creating Makefile
config.status: creating config.h
config.status: executing depfiles commands
config.status: executing libtool commands
+ /usr/bin/make -Otarget -j9
(CDPATH="${ZSH_VERSION+.}:" && cd . && /bin/sh /tmp/B.683z3i/BUILD/libafdt-0.1.0/missing autoheader)
rm -f stamp-h1
touch config.h.in
cd . && /bin/sh ./config.status config.h
config.status: creating config.h
/usr/bin/make  all-am
make[1]: Entering directory '/tmp/B.683z3i/BUILD/libafdt-0.1.0'
i686-pld-linux-gcc -DHAVE_CONFIG_H -I.   -I ./src   -O2 -fwrapv -pipe -Wformat -Werror=format-security -gdwarf-4 -fno-debug-types-section -fvar-tracking-assignments -g2 -Wp,-D_FORTIFY_SOURCE=2 -fstack-protector-strong --param=ssp-buffer-size=4 -Werror=trampolines -fomit-frame-pointer -march=i686 -fasynchronous-unwind-tables -mtune=pentium4 -gdwarf-4 -fno-debug-types-section -fvar-tracking-assignments -g2  -MT sync_catter-sync_catter.o -MD -MP -MF .deps/sync_catter-sync_catter.Tpo -c -o sync_catter-sync_catter.o `test -f 'test/sync_catter.c' || echo './'`test/sync_catter.c
mv -f .deps/sync_catter-sync_catter.Tpo .deps/sync_catter-sync_catter.Po
make[1]: Leaving directory '/tmp/B.683z3i/BUILD/libafdt-0.1.0'
make[1]: Entering directory '/tmp/B.683z3i/BUILD/libafdt-0.1.0'
i686-pld-linux-gcc -DHAVE_CONFIG_H -I.   -I ./src   -O2 -fwrapv -pipe -Wformat -Werror=format-security -gdwarf-4 -fno-debug-types-section -fvar-tracking-assignments -g2 -Wp,-D_FORTIFY_SOURCE=2 -fstack-protector-strong --param=ssp-buffer-size=4 -Werror=trampolines -fomit-frame-pointer -march=i686 -fasynchronous-unwind-tables -mtune=pentium4 -gdwarf-4 -fno-debug-types-section -fvar-tracking-assignments -g2  -MT catter-catter.o -MD -MP -MF .deps/catter-catter.Tpo -c -o catter-catter.o `test -f 'test/catter.c' || echo './'`test/catter.c
In file included from /usr/include/bits/libc-header-start.h:33,
                 from /usr/include/stdlib.h:25,
                 from test/catter.c:16:
/usr/include/features.h:185:3: warning: #warning "_BSD_SOURCE and _SVID_SOURCE are deprecated, use _DEFAULT_SOURCE" [-Wcpp]
  185 | # warning "_BSD_SOURCE and _SVID_SOURCE are deprecated, use _DEFAULT_SOURCE"
      |   ^~~~~~~
mv -f .deps/catter-catter.Tpo .deps/catter-catter.Po
make[1]: Leaving directory '/tmp/B.683z3i/BUILD/libafdt-0.1.0'
make[1]: Entering directory '/tmp/B.683z3i/BUILD/libafdt-0.1.0'
/bin/sh ./libtool  --tag=CC   --mode=compile i686-pld-linux-gcc -DHAVE_CONFIG_H -I.     -O2 -fwrapv -pipe -Wformat -Werror=format-security -gdwarf-4 -fno-debug-types-section -fvar-tracking-assignments -g2 -Wp,-D_FORTIFY_SOURCE=2 -fstack-protector-strong --param=ssp-buffer-size=4 -Werror=trampolines -fomit-frame-pointer -march=i686 -fasynchronous-unwind-tables -mtune=pentium4 -gdwarf-4 -fno-debug-types-section -fvar-tracking-assignments -g2  -MT util.lo -MD -MP -MF .deps/util.Tpo -c -o util.lo `test -f 'src/util.c' || echo './'`src/util.c
libtool: compile:  i686-pld-linux-gcc -DHAVE_CONFIG_H -I. -O2 -fwrapv -pipe -Wformat -Werror=format-security -gdwarf-4 -fno-debug-types-section -fvar-tracking-assignments -g2 -Wp,-D_FORTIFY_SOURCE=2 -fstack-protector-strong --param=ssp-buffer-size=4 -Werror=trampolines -fomit-frame-pointer -march=i686 -fasynchronous-unwind-tables -mtune=pentium4 -gdwarf-4 -fno-debug-types-section -fvar-tracking-assignments -g2 -MT util.lo -MD -MP -MF .deps/util.Tpo -c src/util.c  -fPIC -DPIC -o .libs/util.o
libtool: compile:  i686-pld-linux-gcc -DHAVE_CONFIG_H -I. -O2 -fwrapv -pipe -Wformat -Werror=format-security -gdwarf-4 -fno-debug-types-section -fvar-tracking-assignments -g2 -Wp,-D_FORTIFY_SOURCE=2 -fstack-protector-strong --param=ssp-buffer-size=4 -Werror=trampolines -fomit-frame-pointer -march=i686 -fasynchronous-unwind-tables -mtune=pentium4 -gdwarf-4 -fno-debug-types-section -fvar-tracking-assignments -g2 -MT util.lo -MD -MP -MF .deps/util.Tpo -c src/util.c -o util.o >/dev/null 2>&1
mv -f .deps/util.Tpo .deps/util.Plo
make[1]: Leaving directory '/tmp/B.683z3i/BUILD/libafdt-0.1.0'
make[1]: Entering directory '/tmp/B.683z3i/BUILD/libafdt-0.1.0'
/bin/sh ./libtool  --tag=CC   --mode=compile i686-pld-linux-gcc -DHAVE_CONFIG_H -I.     -O2 -fwrapv -pipe -Wformat -Werror=format-security -gdwarf-4 -fno-debug-types-section -fvar-tracking-assignments -g2 -Wp,-D_FORTIFY_SOURCE=2 -fstack-protector-strong --param=ssp-buffer-size=4 -Werror=trampolines -fomit-frame-pointer -march=i686 -fasynchronous-unwind-tables -mtune=pentium4 -gdwarf-4 -fno-debug-types-section -fvar-tracking-assignments -g2  -MT strlcpy.lo -MD -MP -MF .deps/strlcpy.Tpo -c -o strlcpy.lo `test -f 'src/strlcpy.c' || echo './'`src/strlcpy.c
libtool: compile:  i686-pld-linux-gcc -DHAVE_CONFIG_H -I. -O2 -fwrapv -pipe -Wformat -Werror=format-security -gdwarf-4 -fno-debug-types-section -fvar-tracking-assignments -g2 -Wp,-D_FORTIFY_SOURCE=2 -fstack-protector-strong --param=ssp-buffer-size=4 -Werror=trampolines -fomit-frame-pointer -march=i686 -fasynchronous-unwind-tables -mtune=pentium4 -gdwarf-4 -fno-debug-types-section -fvar-tracking-assignments -g2 -MT strlcpy.lo -MD -MP -MF .deps/strlcpy.Tpo -c src/strlcpy.c  -fPIC -DPIC -o .libs/strlcpy.o
libtool: compile:  i686-pld-linux-gcc -DHAVE_CONFIG_H -I. -O2 -fwrapv -pipe -Wformat -Werror=format-security -gdwarf-4 -fno-debug-types-section -fvar-tracking-assignments -g2 -Wp,-D_FORTIFY_SOURCE=2 -fstack-protector-strong --param=ssp-buffer-size=4 -Werror=trampolines -fomit-frame-pointer -march=i686 -fasynchronous-unwind-tables -mtune=pentium4 -gdwarf-4 -fno-debug-types-section -fvar-tracking-assignments -g2 -MT strlcpy.lo -MD -MP -MF .deps/strlcpy.Tpo -c src/strlcpy.c -o strlcpy.o >/dev/null 2>&1
mv -f .deps/strlcpy.Tpo .deps/strlcpy.Plo
make[1]: Leaving directory '/tmp/B.683z3i/BUILD/libafdt-0.1.0'
make[1]: Entering directory '/tmp/B.683z3i/BUILD/libafdt-0.1.0'
/bin/sh ./libtool  --tag=CC   --mode=compile i686-pld-linux-gcc -DHAVE_CONFIG_H -I.     -O2 -fwrapv -pipe -Wformat -Werror=format-security -gdwarf-4 -fno-debug-types-section -fvar-tracking-assignments -g2 -Wp,-D_FORTIFY_SOURCE=2 -fstack-protector-strong --param=ssp-buffer-size=4 -Werror=trampolines -fomit-frame-pointer -march=i686 -fasynchronous-unwind-tables -mtune=pentium4 -gdwarf-4 -fno-debug-types-section -fvar-tracking-assignments -g2  -MT sync.lo -MD -MP -MF .deps/sync.Tpo -c -o sync.lo `test -f 'src/sync.c' || echo './'`src/sync.c
libtool: compile:  i686-pld-linux-gcc -DHAVE_CONFIG_H -I. -O2 -fwrapv -pipe -Wformat -Werror=format-security -gdwarf-4 -fno-debug-types-section -fvar-tracking-assignments -g2 -Wp,-D_FORTIFY_SOURCE=2 -fstack-protector-strong --param=ssp-buffer-size=4 -Werror=trampolines -fomit-frame-pointer -march=i686 -fasynchronous-unwind-tables -mtune=pentium4 -gdwarf-4 -fno-debug-types-section -fvar-tracking-assignments -g2 -MT sync.lo -MD -MP -MF .deps/sync.Tpo -c src/sync.c  -fPIC -DPIC -o .libs/sync.o
libtool: compile:  i686-pld-linux-gcc -DHAVE_CONFIG_H -I. -O2 -fwrapv -pipe -Wformat -Werror=format-security -gdwarf-4 -fno-debug-types-section -fvar-tracking-assignments -g2 -Wp,-D_FORTIFY_SOURCE=2 -fstack-protector-strong --param=ssp-buffer-size=4 -Werror=trampolines -fomit-frame-pointer -march=i686 -fasynchronous-unwind-tables -mtune=pentium4 -gdwarf-4 -fno-debug-types-section -fvar-tracking-assignments -g2 -MT sync.lo -MD -MP -MF .deps/sync.Tpo -c src/sync.c -o sync.o >/dev/null 2>&1
mv -f .deps/sync.Tpo .deps/sync.Plo
make[1]: Leaving directory '/tmp/B.683z3i/BUILD/libafdt-0.1.0'
make[1]: Entering directory '/tmp/B.683z3i/BUILD/libafdt-0.1.0'
/bin/sh ./libtool  --tag=CC   --mode=compile i686-pld-linux-gcc -DHAVE_CONFIG_H -I.     -O2 -fwrapv -pipe -Wformat -Werror=format-security -gdwarf-4 -fno-debug-types-section -fvar-tracking-assignments -g2 -Wp,-D_FORTIFY_SOURCE=2 -fstack-protector-strong --param=ssp-buffer-size=4 -Werror=trampolines -fomit-frame-pointer -march=i686 -fasynchronous-unwind-tables -mtune=pentium4 -gdwarf-4 -fno-debug-types-section -fvar-tracking-assignments -g2  -MT lowlevel.lo -MD -MP -MF .deps/lowlevel.Tpo -c -o lowlevel.lo `test -f 'src/lowlevel.c' || echo './'`src/lowlevel.c
libtool: compile:  i686-pld-linux-gcc -DHAVE_CONFIG_H -I. -O2 -fwrapv -pipe -Wformat -Werror=format-security -gdwarf-4 -fno-debug-types-section -fvar-tracking-assignments -g2 -Wp,-D_FORTIFY_SOURCE=2 -fstack-protector-strong --param=ssp-buffer-size=4 -Werror=trampolines -fomit-frame-pointer -march=i686 -fasynchronous-unwind-tables -mtune=pentium4 -gdwarf-4 -fno-debug-types-section -fvar-tracking-assignments -g2 -MT lowlevel.lo -MD -MP -MF .deps/lowlevel.Tpo -c src/lowlevel.c  -fPIC -DPIC -o .libs/lowlevel.o
libtool: compile:  i686-pld-linux-gcc -DHAVE_CONFIG_H -I. -O2 -fwrapv -pipe -Wformat -Werror=format-security -gdwarf-4 -fno-debug-types-section -fvar-tracking-assignments -g2 -Wp,-D_FORTIFY_SOURCE=2 -fstack-protector-strong --param=ssp-buffer-size=4 -Werror=trampolines -fomit-frame-pointer -march=i686 -fasynchronous-unwind-tables -mtune=pentium4 -gdwarf-4 -fno-debug-types-section -fvar-tracking-assignments -g2 -MT lowlevel.lo -MD -MP -MF .deps/lowlevel.Tpo -c src/lowlevel.c -o lowlevel.o >/dev/null 2>&1
mv -f .deps/lowlevel.Tpo .deps/lowlevel.Plo
make[1]: Leaving directory '/tmp/B.683z3i/BUILD/libafdt-0.1.0'
make[1]: Entering directory '/tmp/B.683z3i/BUILD/libafdt-0.1.0'
/bin/sh ./libtool  --tag=CC   --mode=compile i686-pld-linux-gcc -DHAVE_CONFIG_H -I.     -O2 -fwrapv -pipe -Wformat -Werror=format-security -gdwarf-4 -fno-debug-types-section -fvar-tracking-assignments -g2 -Wp,-D_FORTIFY_SOURCE=2 -fstack-protector-strong --param=ssp-buffer-size=4 -Werror=trampolines -fomit-frame-pointer -march=i686 -fasynchronous-unwind-tables -mtune=pentium4 -gdwarf-4 -fno-debug-types-section -fvar-tracking-assignments -g2  -MT async.lo -MD -MP -MF .deps/async.Tpo -c -o async.lo `test -f 'src/async.c' || echo './'`src/async.c
libtool: compile:  i686-pld-linux-gcc -DHAVE_CONFIG_H -I. -O2 -fwrapv -pipe -Wformat -Werror=format-security -gdwarf-4 -fno-debug-types-section -fvar-tracking-assignments -g2 -Wp,-D_FORTIFY_SOURCE=2 -fstack-protector-strong --param=ssp-buffer-size=4 -Werror=trampolines -fomit-frame-pointer -march=i686 -fasynchronous-unwind-tables -mtune=pentium4 -gdwarf-4 -fno-debug-types-section -fvar-tracking-assignments -g2 -MT async.lo -MD -MP -MF .deps/async.Tpo -c src/async.c  -fPIC -DPIC -o .libs/async.o
In file included from /usr/include/bits/libc-header-start.h:33,
                 from /usr/include/stdlib.h:25,
                 from src/async.c:4:
/usr/include/features.h:185:3: warning: #warning "_BSD_SOURCE and _SVID_SOURCE are deprecated, use _DEFAULT_SOURCE" [-Wcpp]
  185 | # warning "_BSD_SOURCE and _SVID_SOURCE are deprecated, use _DEFAULT_SOURCE"
      |   ^~~~~~~
libtool: compile:  i686-pld-linux-gcc -DHAVE_CONFIG_H -I. -O2 -fwrapv -pipe -Wformat -Werror=format-security -gdwarf-4 -fno-debug-types-section -fvar-tracking-assignments -g2 -Wp,-D_FORTIFY_SOURCE=2 -fstack-protector-strong --param=ssp-buffer-size=4 -Werror=trampolines -fomit-frame-pointer -march=i686 -fasynchronous-unwind-tables -mtune=pentium4 -gdwarf-4 -fno-debug-types-section -fvar-tracking-assignments -g2 -MT async.lo -MD -MP -MF .deps/async.Tpo -c src/async.c -o async.o >/dev/null 2>&1
mv -f .deps/async.Tpo .deps/async.Plo
make[1]: Leaving directory '/tmp/B.683z3i/BUILD/libafdt-0.1.0'
make[1]: Entering directory '/tmp/B.683z3i/BUILD/libafdt-0.1.0'
/bin/sh ./libtool  --tag=CC   --mode=link i686-pld-linux-gcc  -O2 -fwrapv -pipe -Wformat -Werror=format-security -gdwarf-4 -fno-debug-types-section -fvar-tracking-assignments -g2 -Wp,-D_FORTIFY_SOURCE=2 -fstack-protector-strong --param=ssp-buffer-size=4 -Werror=trampolines -fomit-frame-pointer -march=i686 -fasynchronous-unwind-tables -mtune=pentium4 -gdwarf-4 -fno-debug-types-section -fvar-tracking-assignments -g2   -Wl,--as-needed -Wl,--no-copy-dt-needed-entries -Wl,-z,relro -Wl,-z,combreloc  -o libafdt.la -rpath /usr/lib util.lo lowlevel.lo sync.lo strlcpy.lo async.lo -levent 
libtool: link: i686-pld-linux-gcc -shared  -fPIC -DPIC  -O2 -gdwarf-4 -g2 -fstack-protector-strong -march=i686 -mtune=pentium4 -gdwarf-4 -g2 -Wl,--as-needed -Wl,--no-copy-dt-needed-entries -Wl,-z -Wl,relro -Wl,-z -Wl,combreloc    .libs/util.o .libs/lowlevel.o .libs/sync.o .libs/strlcpy.o .libs/async.o   -levent -Wl,-soname -Wl,libafdt.so.0 -o .libs/libafdt.so.0.0.0
libtool: link: (cd ".libs" && rm -f "libafdt.so.0" && ln -s "libafdt.so.0.0.0" "libafdt.so.0")
libtool: link: (cd ".libs" && rm -f "libafdt.so" && ln -s "libafdt.so.0.0.0" "libafdt.so")
libtool: link: ar cru .libs/libafdt.a  util.o lowlevel.o sync.o strlcpy.o async.o
libtool: link: ranlib .libs/libafdt.a
libtool: link: ( cd ".libs" && rm -f "libafdt.la" && ln -s "../libafdt.la" "libafdt.la" )
make[1]: Leaving directory '/tmp/B.683z3i/BUILD/libafdt-0.1.0'
make[1]: Entering directory '/tmp/B.683z3i/BUILD/libafdt-0.1.0'
/bin/sh ./libtool  --tag=CC   --mode=link i686-pld-linux-gcc  -O2 -fwrapv -pipe -Wformat -Werror=format-security -gdwarf-4 -fno-debug-types-section -fvar-tracking-assignments -g2 -Wp,-D_FORTIFY_SOURCE=2 -fstack-protector-strong --param=ssp-buffer-size=4 -Werror=trampolines -fomit-frame-pointer -march=i686 -fasynchronous-unwind-tables -mtune=pentium4 -gdwarf-4 -fno-debug-types-section -fvar-tracking-assignments -g2   -Wl,--as-needed -Wl,--no-copy-dt-needed-entries -Wl,-z,relro -Wl,-z,combreloc  -o sync_catter sync_catter-sync_catter.o libafdt.la 
libtool: link: i686-pld-linux-gcc -O2 -fwrapv -pipe -Wformat -Werror=format-security -gdwarf-4 -fno-debug-types-section -fvar-tracking-assignments -g2 -Wp,-D_FORTIFY_SOURCE=2 -fstack-protector-strong --param=ssp-buffer-size=4 -Werror=trampolines -fomit-frame-pointer -march=i686 -fasynchronous-unwind-tables -mtune=pentium4 -gdwarf-4 -fno-debug-types-section -fvar-tracking-assignments -g2 -Wl,--as-needed -Wl,--no-copy-dt-needed-entries -Wl,-z -Wl,relro -Wl,-z -Wl,combreloc -o .libs/sync_catter sync_catter-sync_catter.o  ./.libs/libafdt.so -levent
make[1]: Leaving directory '/tmp/B.683z3i/BUILD/libafdt-0.1.0'
make[1]: Entering directory '/tmp/B.683z3i/BUILD/libafdt-0.1.0'
/bin/sh ./libtool  --tag=CC   --mode=link i686-pld-linux-gcc  -O2 -fwrapv -pipe -Wformat -Werror=format-security -gdwarf-4 -fno-debug-types-section -fvar-tracking-assignments -g2 -Wp,-D_FORTIFY_SOURCE=2 -fstack-protector-strong --param=ssp-buffer-size=4 -Werror=trampolines -fomit-frame-pointer -march=i686 -fasynchronous-unwind-tables -mtune=pentium4 -gdwarf-4 -fno-debug-types-section -fvar-tracking-assignments -g2   -Wl,--as-needed -Wl,--no-copy-dt-needed-entries -Wl,-z,relro -Wl,-z,combreloc  -o catter catter-catter.o libafdt.la 
libtool: link: i686-pld-linux-gcc -O2 -fwrapv -pipe -Wformat -Werror=format-security -gdwarf-4 -fno-debug-types-section -fvar-tracking-assignments -g2 -Wp,-D_FORTIFY_SOURCE=2 -fstack-protector-strong --param=ssp-buffer-size=4 -Werror=trampolines -fomit-frame-pointer -march=i686 -fasynchronous-unwind-tables -mtune=pentium4 -gdwarf-4 -fno-debug-types-section -fvar-tracking-assignments -g2 -Wl,--as-needed -Wl,--no-copy-dt-needed-entries -Wl,-z -Wl,relro -Wl,-z -Wl,combreloc -o .libs/catter catter-catter.o  ./.libs/libafdt.so -levent
make[1]: Leaving directory '/tmp/B.683z3i/BUILD/libafdt-0.1.0'
+ /usr/bin/make -Otarget -j9 check
/usr/bin/make  check-TESTS
make[2]: Entering directory '/tmp/B.683z3i/BUILD/libafdt-0.1.0'
FAIL: test/runtests.py
make[2]: Leaving directory '/tmp/B.683z3i/BUILD/libafdt-0.1.0'
make[2]: Entering directory '/tmp/B.683z3i/BUILD/libafdt-0.1.0'
============================================================================
Testsuite summary for libafdt 0.1.0
============================================================================
# TOTAL: 1
# PASS:  0
# SKIP:  0
# XFAIL: 0
# FAIL:  1
# XPASS: 0
# ERROR: 0
============================================================================
See ./test-suite.log
Please report to dreiss@facebook.com
============================================================================
make[2]: *** [Makefile:932: test-suite.log] Error 1
make[2]: Leaving directory '/tmp/B.683z3i/BUILD/libafdt-0.1.0'
make[1]: *** [Makefile:1040: check-TESTS] Error 2
make: *** [Makefile:1246: check-am] Error 2
error: Bad exit status from /tmp/B.683z3i/BUILD/tmp/rpm-tmp.41822 (%build)


RPM build errors:
    Bad exit status from /tmp/B.683z3i/BUILD/tmp/rpm-tmp.41822 (%build)
ended at: Sat Feb  8 18:18:57 2020, done in 0:00:13.331673
error: No files produced.
+ chmod -R u+rwX /tmp/B.683z3i/BUILD
+ rm -rf /tmp/B.683z3i/tmp /tmp/B.683z3i/BUILD
+ rm -rf /tmp/B.683z3i
Begin-PLD-Builder-Info
Build-Time: user:11.55s sys:1.21s real:17.67s (faults io:0 non-io:672755)

End-PLD-Builder-Info
[Back to list of logs] [View rpm -qa of builder]