FailedOk

th/SRPMS[OK]
th/x32[OK]
th/i686[OK]
th/x86_64[OK]

ac/SRPMS[OK]
ac/i386[OK]
ac/i586[OK]
ac/i686[OK]
ac/alpha[OK]
ac/amd64[OK]
ac/athlon[OK]
ac/ppc[OK]
ac/sparc[OK]
ac/sparc64[OK]

Advanced Search
main()
Powered by PLD Linux
(c) 2002-2018 PLD Team
$Revision: 1.37 $
Powered by Paranoid Android.
Your IP: 54.162.239.233

libcarvpath 8aa78008-c327-4acd-b0e9-fdbabc7862b7

Status:Failed
Source URL:ftp://buildlogs.pld-linux.org/th/i686/FAIL/libcarvpath,8aa78008-c327-4acd-b0e9-fdbabc7862b7.bz2
text/plain URL:View!
full text:View!
rpm -qa of builder:View!
Date:2018/09/14 20:10:02
Runtime:0:00:01.167880

Toc:

  • error 1
  • /tmp/B.HyWHgz/BUILD/libcarvpath2.3.0/src/longtoken.c:89:14: error: storage size of 'CtxSHA1' isn't known
  • error 2
  • make[2]: *** [CMakeFiles/carvpath.dir/build.make:76: CMakeFiles/carvpath.dir/longtoken.c.o] Error 1
  • error 3
  • make[1]: *** [CMakeFiles/Makefile2:142: CMakeFiles/carvpath.dir/all] Error 2
  • error 4
  • error: Bad exit status from /tmp/B.HyWHgz/BUILD/tmp/rpm-tmp.54519 (%build)
  • error 5
  • RPM build errors:
  • error 6
  • error: No files produced.

Content:

checking if we should skip the build
started at: Fri Sep 14 20:09:56 2018
killing old processes on a builder
sending signal 9 to pid -1
Killed
cleaning up /tmp
fetching https://srcbuilder.pld-linux.org/th//srpms/8aa78008-c327-4acd-b0e9-fdbabc7862b7/libcarvpath-2.3.0-2.src.rpm
fetched 344457 bytes, 716.9 K/s
installing srpm: libcarvpath-2.3.0-2.src.rpm
+ install -d /tmp/B.HyWHgz/BUILD /tmp/B.HyWHgz/RPMS
+ LC_ALL=en_US.UTF-8
+ rpm -qp --changelog libcarvpath-2.3.0-2.src.rpm
* Fri Sep 14 2018 PLD Linux Team <feedback@pld-linux.org>
- For complete changelog see: http://git.pld-linux.org/?p=packages/libcarvpath.git;a=log;h=master
* Fri Sep 14 2018 Arkadiusz Miƛkiewicz <arekm@maven.pl> 578274c
- release 2 (by relup.sh) + rpm -Uhv --nodeps --define '_topdir /tmp/B.HyWHgz' --define '_specdir %{_topdir}' --define '_sourcedir %{_specdir}' --define '_rpmdir %{_topdir}/RPMS' --define '_builddir %{_topdir}/BUILD' libcarvpath-2.3.0-2.src.rpm Preparing... ################################################## libcarvpath ################################################## + rm -f libcarvpath-2.3.0-2.src.rpm + install -m 700 -d /tmp/B.HyWHgz/BUILD/tmp + TMPDIR=/tmp/B.HyWHgz/BUILD/tmp + exec nice -n 0 rpmbuild -bp --short-circuit --nodeps --define '_topdir /tmp/B.HyWHgz' --define '_specdir %{_topdir}' --define '_sourcedir %{_specdir}' --define '_rpmdir %{_topdir}/RPMS' --define '_builddir %{_topdir}/BUILD' --target i686-pld-linux --define 'prep exit 0' /tmp/B.HyWHgz/libcarvpath.spec Building target platforms: i686-pld-linux checking BuildConflict-ing packages no BuildConflicts found checking BR rpm: Building target platforms: i686-pld-linux no BR needed building RPM using: set -ex; : build-id: 8aa78008-c327-4acd-b0e9-fdbabc7862b7; TMPDIR=/tmp/B.HyWHgz/BUILD/tmp exec nice -n 0 rpmbuild -bb --define '_smp_mflags -j9' --define '_make_opts -Otarget' --define '_pld_builder 1' --define '_topdir /tmp/B.HyWHgz' --define '_specdir %{_topdir}' --define '_sourcedir %{_specdir}' --define '_rpmdir %{_topdir}/RPMS' --define '_builddir %{_topdir}/BUILD' --target i686-pld-linux /tmp/B.HyWHgz/libcarvpath.spec + : build-id: 8aa78008-c327-4acd-b0e9-fdbabc7862b7 + TMPDIR=/tmp/B.HyWHgz/BUILD/tmp + exec nice -n 0 rpmbuild -bb --define '_smp_mflags -j9' --define '_make_opts -Otarget' --define '_pld_builder 1' --define '_topdir /tmp/B.HyWHgz' --define '_specdir %{_topdir}' --define '_sourcedir %{_specdir}' --define '_rpmdir %{_topdir}/RPMS' --define '_builddir %{_topdir}/BUILD' --target i686-pld-linux /tmp/B.HyWHgz/libcarvpath.spec Building target platforms: i686-pld-linux Executing(%prep): /bin/sh -e /tmp/B.HyWHgz/BUILD/tmp/rpm-tmp.54519 + umask 022 + cd /tmp/B.HyWHgz/BUILD + cd /tmp/B.HyWHgz/BUILD + rm -rf libcarvpath2.3.0 + /usr/bin/gzip -dc /tmp/B.HyWHgz/libcarvpath2.3.0.tgz + /bin/tar -xf - + STATUS=0 + '[' 0 -ne 0 ']' + cd libcarvpath2.3.0 + /bin/id -u + '[' 1001 '=' 0 ']' + /bin/id -u + '[' 1001 '=' 0 ']' + /bin/chmod -Rf a+rX,u+w,g-w,o-w . + sed -e 's|/lib\b|/lib|g' -i src/CMakeLists.txt + exit 0 Executing(%build): /bin/sh -e /tmp/B.HyWHgz/BUILD/tmp/rpm-tmp.54519 TMP=/home/users/builder/tmp HOME=/home/users/builder PATH=/usr/local/bin:/usr/bin:/bin:/home/users/builder/bin TMPDIR=/tmp/B.HyWHgz/BUILD/tmp + umask 022 + cd /tmp/B.HyWHgz/BUILD + cd libcarvpath2.3.0 + export 'CFLAGS=-O2 -fwrapv -pipe -Wformat -Werror=format-security -gdwarf-4 -fno-debug-types-section -fvar-tracking-assignments -g2 -Wp,-D_FORTIFY_SOURCE=2 -fstack-protector-strong --param=ssp-buffer-size=4 -fomit-frame-pointer -march=i686 -fasynchronous-unwind-tables -mtune=pentium4 -gdwarf-4 -fno-debug-types-section -fvar-tracking-assignments -g2 ' + export 'CXXFLAGS=-O2 -fwrapv -pipe -Wformat -Werror=format-security -gdwarf-4 -fno-debug-types-section -fvar-tracking-assignments -g2 -Wp,-D_FORTIFY_SOURCE=2 -fstack-protector-strong --param=ssp-buffer-size=4 -fomit-frame-pointer -march=i686 -fasynchronous-unwind-tables -mtune=pentium4 -gdwarf-4 -fno-debug-types-section -fvar-tracking-assignments -g2 ' + /usr/bin/cmake src '-DCMAKE_INSTALL_PREFIX=/usr' -- The C compiler identification is GNU 8.2.0 -- Check for working C compiler: /usr/bin/cc -- Check for working C compiler: /usr/bin/cc -- works -- Detecting C compiler ABI info -- Detecting C compiler ABI info - done -- Detecting C compile features -- Detecting C compile features - done -- Found OpenSSL: /usr/lib/libcrypto.so (found version "1.1.1") -- Looking for sqlite3.h -- Looking for sqlite3.h - found -- Configuring done -- Generating done -- Build files have been written to: /tmp/B.HyWHgz/BUILD/libcarvpath2.3.0 + /usr/bin/make -Otarget -j9 Scanning dependencies of target carvpath [ 9%] Building C object CMakeFiles/carvpath.dir/longtoken.c.o /tmp/B.HyWHgz/BUILD/libcarvpath2.3.0/src/longtoken.c: In function 'carvpath_longtoken_fixup': /tmp/B.HyWHgz/BUILD/libcarvpath2.3.0/src/longtoken.c:89:14: error: storage size of 'CtxSHA1' isn't known EVP_MD_CTX CtxSHA1; ^~~~~~~ make[2]: *** [CMakeFiles/carvpath.dir/build.make:76: CMakeFiles/carvpath.dir/longtoken.c.o] Error 1 make[2]: *** Waiting for unfinished jobs.... [ 22%] Building C object CMakeFiles/carvpath.dir/utility.c.o [ 18%] Building C object CMakeFiles/carvpath.dir/fragment.c.o [ 9%] Building C object CMakeFiles/carvpath.dir/libcarvpath.c.o [ 18%] Building C object CMakeFiles/carvpath.dir/entity.c.o make[1]: *** [CMakeFiles/Makefile2:142: CMakeFiles/carvpath.dir/all] Error 2 make: *** [Makefile:141: all] Error 2 error: Bad exit status from /tmp/B.HyWHgz/BUILD/tmp/rpm-tmp.54519 (%build) RPM build errors: Bad exit status from /tmp/B.HyWHgz/BUILD/tmp/rpm-tmp.54519 (%build) ended at: Fri Sep 14 20:10:02 2018, done in 0:00:01.167880 error: No files produced. + chmod -R u+rwX /tmp/B.HyWHgz/BUILD + rm -rf /tmp/B.HyWHgz/tmp /tmp/B.HyWHgz/BUILD + rm -rf /tmp/B.HyWHgz Begin-PLD-Builder-Info Build-Time: user:4.03s sys:0.41s real:5.47s (faults io:0 non-io:111456) End-PLD-Builder-Info
[Back to list of logs] [View rpm -qa of builder]