FailedOk

th/SRPMS[OK]
th/x32[OK]
th/i686[OK]
th/x86_64[OK]

ac/SRPMS[OK]
ac/i386[OK]
ac/i586[OK]
ac/i686[OK]
ac/alpha[OK]
ac/amd64[OK]
ac/athlon[OK]
ac/ppc[OK]
ac/sparc[OK]
ac/sparc64[OK]

Advanced Search
main()
Powered by PLD Linux
(c) 2002-2018 PLD Team
$Revision: 1.37 $
Powered by VAX.
Your IP: 54.162.227.37

libdbi-drivers 8a49818e-47bb-43a3-923f-69ea55d7c7de

Status:Failed
Source URL:ftp://buildlogs.pld-linux.org/th/i686/FAIL/libdbi-drivers,8a49818e-47bb-43a3-923f-69ea55d7c7de.bz2
text/plain URL:View!
rpm -qa of builder:View!
Date:2018/03/07 10:52:47
Runtime:0:00:13.328213

Toc:

  • prep
  • Executing(%prep): /bin/sh -e /tmp/B.42mr3W/BUILD/tmp/rpm-tmp.92360
  • build
  • Executing(%build): /bin/sh -e /tmp/B.42mr3W/BUILD/tmp/rpm-tmp.92360
  • error 1
  • collect2: error: ld returned 1 exit status
  • error 2
  • make[3]: *** [Makefile:479: libdbdmysql.la] Error 1
  • error 3
  • make[2]: *** [Makefile:403: all-recursive] Error 1
  • error 4
  • make[1]: *** [Makefile:454: all-recursive] Error 1
  • error 5
  • error: Bad exit status from /tmp/B.42mr3W/BUILD/tmp/rpm-tmp.92360 (%build)
  • error 6
  • RPM build errors:
  • error 7
  • error: No files produced.

Content:

request from: baggins
checking if we should skip the build
started at: Wed Mar  7 10:52:26 2018
fetching https://srcbuilder.pld-linux.org/th//srpms/8a49818e-47bb-43a3-923f-69ea55d7c7de/libdbi-drivers-0.9.0-2.src.rpm
fetched 1846680 bytes, 2845.1 K/s
installing srpm: libdbi-drivers-0.9.0-2.src.rpm
+ install -d /tmp/B.42mr3W/BUILD /tmp/B.42mr3W/RPMS
+ LC_ALL=en_US.UTF-8
+ rpm -qp --changelog libdbi-drivers-0.9.0-2.src.rpm
* Wed Mar 07 2018 PLD Linux Team <feedback@pld-linux.org>
- For complete changelog see: http://git.pld-linux.org/?p=packages/libdbi-drivers.git;a=log;h=master
+ rpm -Uhv --nodeps --define '_topdir /tmp/B.42mr3W' --define '_specdir %{_topdir}' --define '_sourcedir %{_specdir}' --define '_rpmdir %{_topdir}/RPMS' --define '_builddir %{_topdir}/BUILD' libdbi-drivers-0.9.0-2.src.rpm Preparing... ################################################## libdbi-drivers ################################################## + rm -f libdbi-drivers-0.9.0-2.src.rpm + install -m 700 -d /tmp/B.42mr3W/BUILD/tmp + TMPDIR=/tmp/B.42mr3W/BUILD/tmp + exec nice -n 0 rpmbuild -bp --short-circuit --nodeps --define '_topdir /tmp/B.42mr3W' --define '_specdir %{_topdir}' --define '_sourcedir %{_specdir}' --define '_rpmdir %{_topdir}/RPMS' --define '_builddir %{_topdir}/BUILD' --target i686-pld-linux --define 'prep exit 0' /tmp/B.42mr3W/libdbi-drivers.spec Building target platforms: i686-pld-linux checking BuildConflict-ing packages no BuildConflicts found checking BR rpm: Building target platforms: i686-pld-linux no BR needed building RPM using: set -ex; : build-id: 8a49818e-47bb-43a3-923f-69ea55d7c7de; TMPDIR=/tmp/B.42mr3W/BUILD/tmp exec nice -n 0 rpmbuild -bb --define '_smp_mflags -j9' --define '_make_opts -Otarget' --define '_pld_builder 1' --define '_topdir /tmp/B.42mr3W' --define '_specdir %{_topdir}' --define '_sourcedir %{_specdir}' --define '_rpmdir %{_topdir}/RPMS' --define '_builddir %{_topdir}/BUILD' --target i686-pld-linux /tmp/B.42mr3W/libdbi-drivers.spec + : build-id: 8a49818e-47bb-43a3-923f-69ea55d7c7de + TMPDIR=/tmp/B.42mr3W/BUILD/tmp + exec nice -n 0 rpmbuild -bb --define '_smp_mflags -j9' --define '_make_opts -Otarget' --define '_pld_builder 1' --define '_topdir /tmp/B.42mr3W' --define '_specdir %{_topdir}' --define '_sourcedir %{_specdir}' --define '_rpmdir %{_topdir}/RPMS' --define '_builddir %{_topdir}/BUILD' --target i686-pld-linux /tmp/B.42mr3W/libdbi-drivers.spec Building target platforms: i686-pld-linux Executing(%prep): /bin/sh -e /tmp/B.42mr3W/BUILD/tmp/rpm-tmp.92360 + umask 022 + cd /tmp/B.42mr3W/BUILD + cd /tmp/B.42mr3W/BUILD + rm -rf libdbi-drivers-0.9.0 + /usr/bin/gzip -dc /tmp/B.42mr3W/libdbi-drivers-0.9.0.tar.gz + /bin/tar -xf - + STATUS=0 + '[' 0 -ne 0 ']' + cd libdbi-drivers-0.9.0 + /bin/id -u + '[' 1001 '=' 0 ']' + /bin/id -u + '[' 1001 '=' 0 ']' + /bin/chmod -Rf a+rX,u+w,g-w,o-w . + echo 'Patch #0 (libdbi-drivers-sqlite3_libs.patch):' Patch #0 (libdbi-drivers-sqlite3_libs.patch): + '[' -f /tmp/B.42mr3W/libdbi-drivers-sqlite3_libs.patch ']' + /bin/cat /tmp/B.42mr3W/libdbi-drivers-sqlite3_libs.patch + /usr/bin/patch -s -p1 + echo 'Patch #1 (freetds-1.0.patch):' Patch #1 (freetds-1.0.patch): + '[' -f /tmp/B.42mr3W/freetds-1.0.patch ']' + /bin/cat /tmp/B.42mr3W/freetds-1.0.patch + /usr/bin/patch -s -p1 + echo 'Patch #2 (firebird3.patch):' Patch #2 (firebird3.patch): + '[' -f /tmp/B.42mr3W/firebird3.patch ']' + /usr/bin/patch -s -p1 + /bin/cat /tmp/B.42mr3W/firebird3.patch + exit 0 Executing(%build): /bin/sh -e /tmp/B.42mr3W/BUILD/tmp/rpm-tmp.92360 TMP=/home/users/builder/tmp HOME=/home/users/builder PATH=/home/users/builder/GNUstep/Tools:/usr/local/bin:/usr/bin:/bin:/home/users/builder/bin TMPDIR=/tmp/B.42mr3W/BUILD/tmp + umask 022 + cd /tmp/B.42mr3W/BUILD + cd libdbi-drivers-0.9.0 + libtoolize --copy --force --install libtoolize: putting auxiliary files in '.'. libtoolize: copying file './config.guess' libtoolize: copying file './config.sub' libtoolize: copying file './install-sh' libtoolize: copying file './ltmain.sh' libtoolize: putting macros in AC_CONFIG_MACRO_DIRS, 'm4'. libtoolize: copying file 'm4/libtool.m4' libtoolize: copying file 'm4/ltoptions.m4' libtoolize: copying file 'm4/ltsugar.m4' libtoolize: copying file 'm4/ltversion.m4' libtoolize: copying file 'm4/lt~obsolete.m4' + aclocal aclocal: warning: autoconf input should be named 'configure.ac', not 'configure.in' + autoconf + autoheader + automake -a -c -f --foreign automake: warning: autoconf input should be named 'configure.ac', not 'configure.in' configure.in:5: warning: AM_INIT_AUTOMAKE: two- and three-arguments forms are deprecated. For more info, see: configure.in:5: https://www.gnu.org/software/automake/manual/automake.html#Modernize-AM_005fINIT_005fAUTOMAKE-invocation configure.in:34: installing './compile' configure.in:5: installing './missing' drivers/db2/Makefile.am:33: warning: 'INCLUDES' is the old name for 'AM_CPPFLAGS' (or '*_CPPFLAGS') automake: warning: autoconf input should be named 'configure.ac', not 'configure.in' drivers/db2/Makefile.am: installing './depcomp' drivers/firebird/Makefile.am:33: warning: 'INCLUDES' is the old name for 'AM_CPPFLAGS' (or '*_CPPFLAGS') drivers/freetds/Makefile.am:32: warning: 'INCLUDES' is the old name for 'AM_CPPFLAGS' (or '*_CPPFLAGS') drivers/ingres/Makefile.am:33: warning: 'INCLUDES' is the old name for 'AM_CPPFLAGS' (or '*_CPPFLAGS') drivers/msql/Makefile.am:35: warning: 'INCLUDES' is the old name for 'AM_CPPFLAGS' (or '*_CPPFLAGS') drivers/mysql/Makefile.am:37: warning: 'INCLUDES' is the old name for 'AM_CPPFLAGS' (or '*_CPPFLAGS') drivers/oracle/Makefile.am:35: warning: 'INCLUDES' is the old name for 'AM_CPPFLAGS' (or '*_CPPFLAGS') drivers/pgsql/Makefile.am:35: warning: 'INCLUDES' is the old name for 'AM_CPPFLAGS' (or '*_CPPFLAGS') drivers/sqlite/Makefile.am:35: warning: 'INCLUDES' is the old name for 'AM_CPPFLAGS' (or '*_CPPFLAGS') drivers/sqlite3/Makefile.am:35: warning: 'INCLUDES' is the old name for 'AM_CPPFLAGS' (or '*_CPPFLAGS') tests/Makefile.am:17: warning: 'INCLUDES' is the old name for 'AM_CPPFLAGS' (or '*_CPPFLAGS') parallel-tests: installing './test-driver' tests/cgreen/Makefile.am:7: warning: 'INCLUDES' is the old name for 'AM_CPPFLAGS' (or '*_CPPFLAGS') tests/cgreen/Makefile.am:9: warning: source file 'src/unit.c' is in a subdirectory, tests/cgreen/Makefile.am:9: but option 'subdir-objects' is disabled automake: warning: possible forward-incompatibility. automake: At least a source file is in a subdirectory, but the 'subdir-objects' automake: automake option hasn't been enabled. For now, the corresponding output automake: object file(s) will be placed in the top-level directory. However, automake: this behaviour will change in future Automake versions: they will automake: unconditionally cause object files to be placed in the same subdirectory automake: of the corresponding sources. automake: You are advised to start using 'subdir-objects' option throughout your automake: project, to avoid future incompatibilities. tests/cgreen/Makefile.am:9: warning: source file 'src/messaging.c' is in a subdirectory, tests/cgreen/Makefile.am:9: but option 'subdir-objects' is disabled tests/cgreen/Makefile.am:9: warning: source file 'src/breadcrumb.c' is in a subdirectory, tests/cgreen/Makefile.am:9: but option 'subdir-objects' is disabled tests/cgreen/Makefile.am:9: warning: source file 'src/reporter.c' is in a subdirectory, tests/cgreen/Makefile.am:9: but option 'subdir-objects' is disabled tests/cgreen/Makefile.am:9: warning: source file 'src/assertions.c' is in a subdirectory, tests/cgreen/Makefile.am:9: but option 'subdir-objects' is disabled tests/cgreen/Makefile.am:9: warning: source file 'src/vector.c' is in a subdirectory, tests/cgreen/Makefile.am:9: but option 'subdir-objects' is disabled tests/cgreen/Makefile.am:9: warning: source file 'src/mocks.c' is in a subdirectory, tests/cgreen/Makefile.am:9: but option 'subdir-objects' is disabled tests/cgreen/Makefile.am:9: warning: source file 'src/constraint.c' is in a subdirectory, tests/cgreen/Makefile.am:9: but option 'subdir-objects' is disabled tests/cgreen/Makefile.am:9: warning: source file 'src/parameters.c' is in a subdirectory, tests/cgreen/Makefile.am:9: but option 'subdir-objects' is disabled tests/cgreen/Makefile.am:9: warning: source file 'src/text_reporter.c' is in a subdirectory, tests/cgreen/Makefile.am:9: but option 'subdir-objects' is disabled tests/cgreen/Makefile.am:9: warning: source file 'src/cdash_reporter.c' is in a subdirectory, tests/cgreen/Makefile.am:9: but option 'subdir-objects' is disabled + ./configure 'LDFLAGS=-Wl,--as-needed -Wl,--no-copy-dt-needed-entries -Wl,-z,relro -Wl,-z,combreloc ' 'CFLAGS=-O2 -fwrapv -pipe -Wformat -Werror=format-security -gdwarf-4 -fno-debug-types-section -fvar-tracking-assignments -g2 -Wp,-D_FORTIFY_SOURCE=2 -fstack-protector-strong --param=ssp-buffer-size=4 -fomit-frame-pointer -march=i686 -fasynchronous-unwind-tables -mtune=pentium4 -gdwarf-4 -fno-debug-types-section -fvar-tracking-assignments -g2 ' 'CXXFLAGS=-O2 -fwrapv -pipe -Wformat -Werror=format-security -gdwarf-4 -fno-debug-types-section -fvar-tracking-assignments -g2 -Wp,-D_FORTIFY_SOURCE=2 -fstack-protector-strong --param=ssp-buffer-size=4 -fomit-frame-pointer -march=i686 -fasynchronous-unwind-tables -mtune=pentium4 -gdwarf-4 -fno-debug-types-section -fvar-tracking-assignments -g2 ' 'FFLAGS=-O2 -fwrapv -pipe -Wformat -Werror=format-security -gdwarf-4 -fno-debug-types-section -fvar-tracking-assignments -g2 -Wp,-D_FORTIFY_SOURCE=2 -fstack-protector-strong --param=ssp-buffer-size=4 -fomit-frame-pointer -march=i686 -fasynchronous-unwind-tables -mtune=pentium4 -gdwarf-4 -fno-debug-types-section -fvar-tracking-assignments -g2 ' 'FCFLAGS=-O2 -fwrapv -pipe -Wformat -Werror=format-security -gdwarf-4 -fno-debug-types-section -fvar-tracking-assignments -g2 -Wp,-D_FORTIFY_SOURCE=2 -fstack-protector-strong --param=ssp-buffer-size=4 -fomit-frame-pointer -march=i686 -fasynchronous-unwind-tables -mtune=pentium4 -gdwarf-4 -fno-debug-types-section -fvar-tracking-assignments -g2 ' 'CPPFLAGS=' 'CC=i686-pld-linux-gcc' 'CXX=i686-pld-linux-g++' '--host=i686-pld-linux' '--build=i686-pld-linux' '--prefix=/usr' '--exec-prefix=/usr' '--bindir=/usr/bin' '--sbindir=/usr/sbin' '--sysconfdir=/etc' '--datadir=/usr/share' '--includedir=/usr/include' '--libdir=/usr/lib' '--libexecdir=/usr/libexec' '--localstatedir=/var' '--sharedstatedir=/var/lib' '--mandir=/usr/share/man' '--infodir=/usr/share/info' '--x-libraries=/usr/lib' --disable-static --disable-docs --with-firebird '--with-firebird-libdir=/usr/lib' '--with-firebird-incdir=/usr/include' --with-freetds '--with-freetds-libdir=/usr/lib' '--with-freetds-incdir=/usr/include' --enable-mysql-threadsafe --with-mysql '--with-mysql-libdir=/usr/lib' '--with-mysql-incdir=/usr/include/mysql' --with-pgsql '--with-pgsql-libdir=/usr/lib' '--with-pgsql-incdir=/usr/include' --with-sqlite '--with-sqlite-libdir=/usr/lib' '--with-sqlite-incdir=/usr/include' --with-sqlite3 '--with-sqlite3-libdir=/usr/lib' '--with-sqlite3-incdir=/usr/include' '--with-dbi-incdir=/usr/include' '--with-dbi-libdir=/usr/lib' checking whether to enable maintainer-specific portions of Makefiles... no checking for a BSD-compatible install... /usr/bin/install -c checking whether build environment is sane... yes checking for a thread-safe mkdir -p... /bin/mkdir -p checking for mawk... mawk checking whether make sets $(MAKE)... yes checking whether make supports nested variables... yes checking build system type... i686-pld-linux-gnu checking host system type... i686-pld-linux-gnu checking for i686-pld-linux-gcc... i686-pld-linux-gcc checking whether the C compiler works... yes checking for C compiler default output file name... a.out checking for suffix of executables... checking whether we are cross compiling... no checking for suffix of object files... o checking whether we are using the GNU C compiler... yes checking whether i686-pld-linux-gcc accepts -g... yes checking for i686-pld-linux-gcc option to accept ISO C89... none needed checking whether i686-pld-linux-gcc understands -c and -o together... yes checking whether make supports the include directive... yes (GNU style) checking dependency style of i686-pld-linux-gcc... gcc3 checking for a sed that does not truncate output... /bin/sed checking for grep that handles long lines and -e... /bin/grep checking for egrep... /bin/grep -E checking for fgrep... /bin/grep -F checking how to print strings... print -r checking for ld used by i686-pld-linux-gcc... /usr/bin/ld checking if the linker (/usr/bin/ld) is GNU ld... yes checking for BSD- or MS-compatible name lister (nm)... /usr/bin/nm -B checking the name lister (/usr/bin/nm -B) interface... BSD nm checking whether ln -s works... yes checking the maximum length of command line arguments... 1572864 checking how to convert i686-pld-linux-gnu file names to i686-pld-linux-gnu format... func_convert_file_noop checking how to convert i686-pld-linux-gnu file names to toolchain format... func_convert_file_noop checking for /usr/bin/ld option to reload object files... -r checking for i686-pld-linux-objdump... objdump checking how to recognize dependent libraries... pass_all checking for i686-pld-linux-dlltool... dlltool checking how to associate runtime and link libraries... print -r -- checking for i686-pld-linux-ar... no checking for ar... ar checking for archiver @FILE support... @ checking for i686-pld-linux-strip... no checking for strip... strip checking for i686-pld-linux-ranlib... no checking for ranlib... ranlib checking command to parse /usr/bin/nm -B output from i686-pld-linux-gcc object... ok checking for sysroot... no checking for a working dd... /bin/dd checking how to truncate binary pipes... /bin/dd bs=4096 count=1 checking for i686-pld-linux-mt... no checking for mt... no checking if : is a manifest tool... no checking how to run the C preprocessor... i686-pld-linux-gcc -E checking for ANSI C header files... yes checking for sys/types.h... yes checking for sys/stat.h... yes checking for stdlib.h... yes checking for string.h... yes checking for memory.h... yes checking for strings.h... yes checking for inttypes.h... yes checking for stdint.h... yes checking for unistd.h... yes checking for dlfcn.h... yes checking for objdir... .libs checking if i686-pld-linux-gcc supports -fno-rtti -fno-exceptions... no checking for i686-pld-linux-gcc option to produce PIC... -fPIC -DPIC checking if i686-pld-linux-gcc PIC flag -fPIC -DPIC works... yes checking if i686-pld-linux-gcc static flag -static works... yes checking if i686-pld-linux-gcc supports -c -o file.o... yes checking if i686-pld-linux-gcc supports -c -o file.o... (cached) yes checking whether the i686-pld-linux-gcc linker (/usr/bin/ld) supports shared libraries... yes checking whether -lc should be explicitly linked in... no checking dynamic linker characteristics... GNU/Linux ld.so checking how to hardcode library paths into programs... immediate checking whether stripping libraries is possible... yes checking if libtool supports shared libraries... yes checking whether to build shared libraries... yes checking whether to build static libraries... no checking how to run the C preprocessor... i686-pld-linux-gcc -E checking for libdbi framework... checking for MySQL support... yes checking for MySQL includes... -I/usr/include/mysql checking for MySQL libraries... checking for PostgreSQL support... yes checking for PostgreSQL includes... -I/usr/include checking for PostgreSQL libraries... -L/usr/lib checking for SQLite support... yes checking for SQLite3 support... yes checking for Msql support... no checking for Oracle support... no checking for Firebird/Interbase support... yes checking for isql-fb... no checking for isql... isql checking for Freetds support... yes checking CS_TDS_80... CS_TDS_71 checking for Ingres support... no checking for IBM DB2 support... no checking for strtoll... yes checking for atoll... yes checking for vasprintf... yes checking for asprintf... yes checking for libdbi library... yes: libs in /usr/lib checking for string.h... (cached) yes checking for strings.h... (cached) yes checking that generated files are newer than configure... done configure: creating ./config.status config.status: creating libdbi-drivers.spec config.status: creating Makefile config.status: creating doc/Makefile config.status: creating doc/include/Makefile config.status: creating drivers/Makefile config.status: creating drivers/mysql/Makefile config.status: creating drivers/pgsql/Makefile config.status: creating drivers/sqlite/Makefile config.status: creating drivers/sqlite3/Makefile config.status: creating drivers/msql/Makefile config.status: creating drivers/oracle/Makefile config.status: creating drivers/firebird/Makefile config.status: creating drivers/freetds/Makefile config.status: creating drivers/ingres/Makefile config.status: creating drivers/db2/Makefile config.status: creating tests/Makefile config.status: creating tests/cgreen/Makefile config.status: creating tests/test_dbi.cfg config.status: creating tests/plugin_settings.sh config.status: creating config.h config.status: executing depfiles commands config.status: executing libtool commands + /usr/bin/make -Otarget -j9 /usr/bin/make all-recursive Making all in drivers Making all in mysql make[3]: Entering directory '/tmp/B.42mr3W/BUILD/libdbi-drivers-0.9.0/drivers/mysql' /bin/sh ../../libtool --tag=CC --mode=compile i686-pld-linux-gcc -DHAVE_CONFIG_H -I. -I../.. -I../.. -I../../include -I/usr/include -I/usr/include/mysql -std=gnu99 -O2 -fwrapv -pipe -Wformat -Werror=format-security -gdwarf-4 -fno-debug-types-section -fvar-tracking-assignments -g2 -Wp,-D_FORTIFY_SOURCE=2 -fstack-protector-strong --param=ssp-buffer-size=4 -fomit-frame-pointer -march=i686 -fasynchronous-unwind-tables -mtune=pentium4 -gdwarf-4 -fno-debug-types-section -fvar-tracking-assignments -g2 -MT dbd_mysql.lo -MD -MP -MF .deps/dbd_mysql.Tpo -c -o dbd_mysql.lo dbd_mysql.c libtool: compile: i686-pld-linux-gcc -DHAVE_CONFIG_H -I. -I../.. -I../.. -I../../include -I/usr/include -I/usr/include/mysql -std=gnu99 -O2 -fwrapv -pipe -Wformat -Werror=format-security -gdwarf-4 -fno-debug-types-section -fvar-tracking-assignments -g2 -Wp,-D_FORTIFY_SOURCE=2 -fstack-protector-strong --param=ssp-buffer-size=4 -fomit-frame-pointer -march=i686 -fasynchronous-unwind-tables -mtune=pentium4 -gdwarf-4 -fno-debug-types-section -fvar-tracking-assignments -g2 -MT dbd_mysql.lo -MD -MP -MF .deps/dbd_mysql.Tpo -c dbd_mysql.c -fPIC -DPIC -o .libs/dbd_mysql.o /usr/include/dbi/dbd.h: In function 'dbd_connect': dbd_mysql.c:231:8: warning: ignoring return value of 'asprintf', declared with attribute warn_unused_result [-Wunused-result] asprintf(&sql_cmd, "SET NAMES '%s'", dbd_encoding_from_iana(encoding)); ^~~~~~~~~~~~~~~~~~~~~~~~~~~~~~~~~~~~~~~~~~~~~~~~~~~~~~~~~~~~~~~~~~~~~~ dbd_mysql.c:238:6: warning: ignoring return value of 'asprintf', declared with attribute warn_unused_result [-Wunused-result] asprintf(&sql_cmd, "SET NAMES '%s'", dbd_encoding_from_iana(encoding)); ^~~~~~~~~~~~~~~~~~~~~~~~~~~~~~~~~~~~~~~~~~~~~~~~~~~~~~~~~~~~~~~~~~~~~~ /usr/include/dbi/dbd.h: In function 'dbd_get_encoding': dbd_mysql.c:312:4: warning: ignoring return value of 'asprintf', declared with attribute warn_unused_result [-Wunused-result] asprintf(&sql_cmd, "SHOW CREATE DATABASE %s", conn->current_db); ^~~~~~~~~~~~~~~~~~~~~~~~~~~~~~~~~~~~~~~~~~~~~~~~~~~~~~~~~~~~~~~ dbd_mysql.c:337:4: warning: ignoring return value of 'asprintf', declared with attribute warn_unused_result [-Wunused-result] asprintf(&sql_cmd, "SHOW VARIABLES LIKE '%s'", "character_set_connection"); ^~~~~~~~~~~~~~~~~~~~~~~~~~~~~~~~~~~~~~~~~~~~~~~~~~~~~~~~~~~~~~~~~~~~~~~~~~ dbd_mysql.c:355:6: warning: ignoring return value of 'asprintf', declared with attribute warn_unused_result [-Wunused-result] asprintf(&sql_cmd, "SHOW VARIABLES LIKE '%s'", "character_set"); ^~~~~~~~~~~~~~~~~~~~~~~~~~~~~~~~~~~~~~~~~~~~~~~~~~~~~~~~~~~~~~~ /usr/include/dbi/dbd.h: In function 'dbd_list_dbs': dbd_mysql.c:466:3: warning: ignoring return value of 'asprintf', declared with attribute warn_unused_result [-Wunused-result] asprintf(&sql_cmd, "SHOW DATABASES LIKE '%s'", pattern); ^~~~~~~~~~~~~~~~~~~~~~~~~~~~~~~~~~~~~~~~~~~~~~~~~~~~~~~ /usr/include/dbi/dbd.h: In function 'dbd_list_tables': dbd_mysql.c:482:3: warning: ignoring return value of 'asprintf', declared with attribute warn_unused_result [-Wunused-result] asprintf(&sql_cmd, "SHOW TABLES FROM %s", db); ^~~~~~~~~~~~~~~~~~~~~~~~~~~~~~~~~~~~~~~~~~~~~ dbd_mysql.c:488:3: warning: ignoring return value of 'asprintf', declared with attribute warn_unused_result [-Wunused-result] asprintf(&sql_cmd, "SHOW TABLES FROM %s LIKE '%s'", db, pattern); ^~~~~~~~~~~~~~~~~~~~~~~~~~~~~~~~~~~~~~~~~~~~~~~~~~~~~~~~~~~~~~~~ /usr/include/dbi/dbd.h: In function 'dbd_savepoint': dbd_mysql.c:631:3: warning: ignoring return value of 'asprintf', declared with attribute warn_unused_result [-Wunused-result] asprintf(&query, "SAVEPOINT %s", savepoint); ^~~~~~~~~~~~~~~~~~~~~~~~~~~~~~~~~~~~~~~~~~~ /usr/include/dbi/dbd.h: In function 'dbd_rollback_to_savepoint': dbd_mysql.c:650:3: warning: ignoring return value of 'asprintf', declared with attribute warn_unused_result [-Wunused-result] asprintf(&query, "ROLLBACK TO SAVEPOINT %s", savepoint); ^~~~~~~~~~~~~~~~~~~~~~~~~~~~~~~~~~~~~~~~~~~~~~~~~~~~~~~ /usr/include/dbi/dbd.h: In function 'dbd_release_savepoint': dbd_mysql.c:669:3: warning: ignoring return value of 'asprintf', declared with attribute warn_unused_result [-Wunused-result] asprintf(&query, "RELEASE SAVEPOINT %s", savepoint); ^~~~~~~~~~~~~~~~~~~~~~~~~~~~~~~~~~~~~~~~~~~~~~~~~~~ mv -f .deps/dbd_mysql.Tpo .deps/dbd_mysql.Plo make[3]: Leaving directory '/tmp/B.42mr3W/BUILD/libdbi-drivers-0.9.0/drivers/mysql' make[3]: Entering directory '/tmp/B.42mr3W/BUILD/libdbi-drivers-0.9.0/drivers/mysql' /bin/sh ../../libtool --tag=CC --mode=link i686-pld-linux-gcc -std=gnu99 -O2 -fwrapv -pipe -Wformat -Werror=format-security -gdwarf-4 -fno-debug-types-section -fvar-tracking-assignments -g2 -Wp,-D_FORTIFY_SOURCE=2 -fstack-protector-strong --param=ssp-buffer-size=4 -fomit-frame-pointer -march=i686 -fasynchronous-unwind-tables -mtune=pentium4 -gdwarf-4 -fno-debug-types-section -fvar-tracking-assignments -g2 -module -avoid-version -L/usr/lib -lmysqlclient_r -no-undefined -ldbi -L/usr/lib -Wl,--as-needed -Wl,--no-copy-dt-needed-entries -Wl,-z,relro -Wl,-z,combreloc -o libdbdmysql.la -rpath /usr/lib/dbd dbd_mysql.lo libtool: link: i686-pld-linux-gcc -shared -fPIC -DPIC -O2 -gdwarf-4 -g2 -fstack-protector-strong -march=i686 -mtune=pentium4 -gdwarf-4 -g2 -Wl,--as-needed -Wl,--no-copy-dt-needed-entries -Wl,-z -Wl,relro -Wl,-z -Wl,combreloc .libs/dbd_mysql.o -L/usr/lib -lmysqlclient_r /usr/lib/libdbi.so -ldl -lm -Wl,-soname -Wl,libdbdmysql.so -o .libs/libdbdmysql.so /usr/bin/ld: cannot find -lmysqlclient_r collect2: error: ld returned 1 exit status make[3]: *** [Makefile:479: libdbdmysql.la] Error 1 make[3]: Leaving directory '/tmp/B.42mr3W/BUILD/libdbi-drivers-0.9.0/drivers/mysql' make[2]: *** [Makefile:403: all-recursive] Error 1 make[1]: *** [Makefile:454: all-recursive] Error 1 make: *** [Makefile:384: all] Error 2 error: Bad exit status from /tmp/B.42mr3W/BUILD/tmp/rpm-tmp.92360 (%build) RPM build errors: Bad exit status from /tmp/B.42mr3W/BUILD/tmp/rpm-tmp.92360 (%build) ended at: Wed Mar 7 10:52:47 2018, done in 0:00:13.328213 error: No files produced. + chmod -R u+rwX /tmp/B.42mr3W/BUILD + rm -rf /tmp/B.42mr3W/tmp /tmp/B.42mr3W/BUILD + rm -rf /tmp/B.42mr3W Begin-PLD-Builder-Info Build-Time: user:15.54s sys:0.84s real:21.35s (faults io:0 non-io:568601) End-PLD-Builder-Info
[Back to list of logs] [View rpm -qa of builder]