FailedOk

th/SRPMS[OK]
th/x32[OK]
th/i686[OK]
th/x86_64[OK]

ac/SRPMS[OK]
ac/i386[OK]
ac/i586[OK]
ac/i686[OK]
ac/alpha[OK]
ac/amd64[OK]
ac/athlon[OK]
ac/ppc[OK]
ac/sparc[OK]
ac/sparc64[OK]

Advanced Search
main()
Powered by PLD Linux
(c) 2002-2018 PLD Team
$Revision: 1.37 $
Powered by /dev/ill.
Your IP: 54.166.141.69

libdomainkeys 6dc3445f-422b-4c55-b968-cf0c49b58304

Status:Failed
Source URL:ftp://buildlogs.pld-linux.org/th/i686/FAIL/libdomainkeys,6dc3445f-422b-4c55-b968-cf0c49b58304.bz2
text/plain URL:View!
rpm -qa of builder:View!
Date:2018/09/14 20:12:40
Runtime:0:00:00.799690

Toc:

  • prep
  • Executing(%prep): /bin/sh -e /tmp/B.aX_9bR/BUILD/tmp/rpm-tmp.97405
  • build
  • Executing(%build): /bin/sh -e /tmp/B.aX_9bR/BUILD/tmp/rpm-tmp.97405
  • error 1
  • domainkeys.c:123:14: error: field 'mdctx' has incomplete type
  • error 2
  • error: Bad exit status from /tmp/B.aX_9bR/BUILD/tmp/rpm-tmp.97405 (%build)
  • error 3
  • RPM build errors:
  • error 4
  • error: No files produced.

Content:

request from: arekm
checking if we should skip the build
started at: Fri Sep 14 20:12:36 2018
killing old processes on a builder
sending signal 9 to pid -1
Killed
cleaning up /tmp
fetching https://srcbuilder.pld-linux.org/th//srpms/6dc3445f-422b-4c55-b968-cf0c49b58304/libdomainkeys-0.69-2.src.rpm
fetched 52304 bytes, 150.8 K/s
installing srpm: libdomainkeys-0.69-2.src.rpm
+ install -d /tmp/B.aX_9bR/BUILD /tmp/B.aX_9bR/RPMS
+ LC_ALL=en_US.UTF-8
+ rpm -qp --changelog libdomainkeys-0.69-2.src.rpm
* Fri Sep 14 2018 PLD Linux Team <feedback@pld-linux.org>
- For complete changelog see: http://git.pld-linux.org/?p=packages/libdomainkeys.git;a=log;h=master
* Fri Sep 14 2018 Arkadiusz Miƛkiewicz <arekm@maven.pl> d95079b
- release 2 (by relup.sh) * Sun Nov 19 2017 Jakub Bogusz <qboosh@pld-linux.org> 917cf19
- updated to 0.69 - updated libtool patch, drop unnecessary libstdc++ dependency + rpm -Uhv --nodeps --define '_topdir /tmp/B.aX_9bR' --define '_specdir %{_topdir}' --define '_sourcedir %{_specdir}' --define '_rpmdir %{_topdir}/RPMS' --define '_builddir %{_topdir}/BUILD' libdomainkeys-0.69-2.src.rpm Preparing... ################################################## libdomainkeys ################################################## + rm -f libdomainkeys-0.69-2.src.rpm + install -m 700 -d /tmp/B.aX_9bR/BUILD/tmp + TMPDIR=/tmp/B.aX_9bR/BUILD/tmp + exec nice -n 0 rpmbuild -bp --short-circuit --nodeps --define '_topdir /tmp/B.aX_9bR' --define '_specdir %{_topdir}' --define '_sourcedir %{_specdir}' --define '_rpmdir %{_topdir}/RPMS' --define '_builddir %{_topdir}/BUILD' --target i686-pld-linux --define 'prep exit 0' /tmp/B.aX_9bR/libdomainkeys.spec Building target platforms: i686-pld-linux checking BuildConflict-ing packages no BuildConflicts found checking BR rpm: Building target platforms: i686-pld-linux no BR needed building RPM using: set -ex; : build-id: 6dc3445f-422b-4c55-b968-cf0c49b58304; TMPDIR=/tmp/B.aX_9bR/BUILD/tmp exec nice -n 0 rpmbuild -bb --define '_smp_mflags -j9' --define '_make_opts -Otarget' --define '_pld_builder 1' --define '_topdir /tmp/B.aX_9bR' --define '_specdir %{_topdir}' --define '_sourcedir %{_specdir}' --define '_rpmdir %{_topdir}/RPMS' --define '_builddir %{_topdir}/BUILD' --target i686-pld-linux /tmp/B.aX_9bR/libdomainkeys.spec + : build-id: 6dc3445f-422b-4c55-b968-cf0c49b58304 + TMPDIR=/tmp/B.aX_9bR/BUILD/tmp + exec nice -n 0 rpmbuild -bb --define '_smp_mflags -j9' --define '_make_opts -Otarget' --define '_pld_builder 1' --define '_topdir /tmp/B.aX_9bR' --define '_specdir %{_topdir}' --define '_sourcedir %{_specdir}' --define '_rpmdir %{_topdir}/RPMS' --define '_builddir %{_topdir}/BUILD' --target i686-pld-linux /tmp/B.aX_9bR/libdomainkeys.spec Building target platforms: i686-pld-linux Executing(%prep): /bin/sh -e /tmp/B.aX_9bR/BUILD/tmp/rpm-tmp.97405 + umask 022 + cd /tmp/B.aX_9bR/BUILD + cd /tmp/B.aX_9bR/BUILD + rm -rf libdomainkeys-0.69 + /bin/tar -xf - + /usr/bin/gzip -dc /tmp/B.aX_9bR/libdomainkeys-0.69.tar.gz + STATUS=0 + '[' 0 -ne 0 ']' + cd libdomainkeys-0.69 + /bin/id -u + '[' 1001 '=' 0 ']' + /bin/id -u + '[' 1001 '=' 0 ']' + /bin/chmod -Rf a+rX,u+w,g-w,o-w . + echo 'Patch #0 (libdomainkeys-libtool.patch):' Patch #0 (libdomainkeys-libtool.patch): + '[' -f /tmp/B.aX_9bR/libdomainkeys-libtool.patch ']' + /bin/cat /tmp/B.aX_9bR/libdomainkeys-libtool.patch + /usr/bin/patch -s -p1 + echo 'Patch #1 (libdomainkeys-segv.patch):' Patch #1 (libdomainkeys-segv.patch): + '[' -f /tmp/B.aX_9bR/libdomainkeys-segv.patch ']' + /bin/cat /tmp/B.aX_9bR/libdomainkeys-segv.patch + /usr/bin/patch -s -p1 + echo 'Patch #2 (libdomainkeys-dknewkey.patch):' Patch #2 (libdomainkeys-dknewkey.patch): + '[' -f /tmp/B.aX_9bR/libdomainkeys-dknewkey.patch ']' + /bin/cat /tmp/B.aX_9bR/libdomainkeys-dknewkey.patch + /usr/bin/patch -s -p1 + exit 0 Executing(%build): /bin/sh -e /tmp/B.aX_9bR/BUILD/tmp/rpm-tmp.97405 TMP=/home/users/builder/tmp HOME=/home/users/builder PATH=/usr/local/bin:/usr/bin:/bin:/home/users/builder/bin TMPDIR=/tmp/B.aX_9bR/BUILD/tmp + umask 022 + cd /tmp/B.aX_9bR/BUILD + cd libdomainkeys-0.69 + /usr/bin/make -Otarget -j9 'CC=i686-pld-linux-gcc' 'CFLAGS=-O2 -fwrapv -pipe -Wformat -Werror=format-security -gdwarf-4 -fno-debug-types-section -fvar-tracking-assignments -g2 -Wp,-D_FORTIFY_SOURCE=2 -fstack-protector-strong --param=ssp-buffer-size=4 -fomit-frame-pointer -march=i686 -fasynchronous-unwind-tables -mtune=pentium4 -gdwarf-4 -fno-debug-types-section -fvar-tracking-assignments -g2 -DBIND_8_COMPAT' 'LDFLAGS=-Wl,--as-needed -Wl,--no-copy-dt-needed-entries -Wl,-z,relro -Wl,-z,combreloc ' i686-pld-linux-gcc -O2 -fwrapv -pipe -Wformat -Werror=format-security -gdwarf-4 -fno-debug-types-section -fvar-tracking-assignments -g2 -Wp,-D_FORTIFY_SOURCE=2 -fstack-protector-strong --param=ssp-buffer-size=4 -fomit-frame-pointer -march=i686 -fasynchronous-unwind-tables -mtune=pentium4 -gdwarf-4 -fno-debug-types-section -fvar-tracking-assignments -g2 -DBIND_8_COMPAT -o makeheader makeheader.c ./makeheader <domainkeys.c >domainkeys.h libtool --mode=compile --tag=CC i686-pld-linux-gcc -O2 -fwrapv -pipe -Wformat -Werror=format-security -gdwarf-4 -fno-debug-types-section -fvar-tracking-assignments -g2 -Wp,-D_FORTIFY_SOURCE=2 -fstack-protector-strong --param=ssp-buffer-size=4 -fomit-frame-pointer -march=i686 -fasynchronous-unwind-tables -mtune=pentium4 -gdwarf-4 -fno-debug-types-section -fvar-tracking-assignments -g2 -DBIND_8_COMPAT -c domainkeys.c -o domainkeys.lo -I. libtool: compile: i686-pld-linux-gcc -O2 -fwrapv -pipe -Wformat -Werror=format-security -gdwarf-4 -fno-debug-types-section -fvar-tracking-assignments -g2 -Wp,-D_FORTIFY_SOURCE=2 -fstack-protector-strong --param=ssp-buffer-size=4 -fomit-frame-pointer -march=i686 -fasynchronous-unwind-tables -mtune=pentium4 -gdwarf-4 -fno-debug-types-section -fvar-tracking-assignments -g2 -DBIND_8_COMPAT -c domainkeys.c -I. -fPIC -DPIC -o .libs/domainkeys.o domainkeys.c:123:14: error: field 'mdctx' has incomplete type EVP_MD_CTX mdctx; /* the hash */ ^~~~~ domainkeys.c: In function 'dk_free': domainkeys.c:2158:3: warning: implicit declaration of function 'EVP_MD_CTX_cleanup'; did you mean 'EVP_MD_CTX_create'? [-Wimplicit-function-declaration] EVP_MD_CTX_cleanup(&dk->mdctx); ^~~~~~~~~~~~~~~~~~ EVP_MD_CTX_create domainkeys.c:2165:6: warning: 'ERR_remove_state' is deprecated [-Wdeprecated-declarations] ERR_remove_state(0); ^~~~~~~~~~~~~~~~ In file included from /usr/include/openssl/evp.h:13, from domainkeys.c:27: /usr/include/openssl/err.h:260:1: note: declared here DEPRECATEDIN_1_0_0(void ERR_remove_state(unsigned long pid)) ^~~~~~~~~~~~~~~~~~ make: *** [Makefile:24: domainkeys.lo] Error 1 make: *** Waiting for unfinished jobs.... libtool --mode=compile --tag=CC i686-pld-linux-gcc -O2 -fwrapv -pipe -Wformat -Werror=format-security -gdwarf-4 -fno-debug-types-section -fvar-tracking-assignments -g2 -Wp,-D_FORTIFY_SOURCE=2 -fstack-protector-strong --param=ssp-buffer-size=4 -fomit-frame-pointer -march=i686 -fasynchronous-unwind-tables -mtune=pentium4 -gdwarf-4 -fno-debug-types-section -fvar-tracking-assignments -g2 -DBIND_8_COMPAT -c dns_txt.c -o dns_txt.lo -I. libtool: compile: i686-pld-linux-gcc -O2 -fwrapv -pipe -Wformat -Werror=format-security -gdwarf-4 -fno-debug-types-section -fvar-tracking-assignments -g2 -Wp,-D_FORTIFY_SOURCE=2 -fstack-protector-strong --param=ssp-buffer-size=4 -fomit-frame-pointer -march=i686 -fasynchronous-unwind-tables -mtune=pentium4 -gdwarf-4 -fno-debug-types-section -fvar-tracking-assignments -g2 -DBIND_8_COMPAT -c dns_txt.c -I. -fPIC -DPIC -o .libs/dns_txt.o libtool: compile: i686-pld-linux-gcc -O2 -fwrapv -pipe -Wformat -Werror=format-security -gdwarf-4 -fno-debug-types-section -fvar-tracking-assignments -g2 -Wp,-D_FORTIFY_SOURCE=2 -fstack-protector-strong --param=ssp-buffer-size=4 -fomit-frame-pointer -march=i686 -fasynchronous-unwind-tables -mtune=pentium4 -gdwarf-4 -fno-debug-types-section -fvar-tracking-assignments -g2 -DBIND_8_COMPAT -c dns_txt.c -I. -o dns_txt.o >/dev/null 2>&1 libtool --mode=compile --tag=CC i686-pld-linux-gcc -O2 -fwrapv -pipe -Wformat -Werror=format-security -gdwarf-4 -fno-debug-types-section -fvar-tracking-assignments -g2 -Wp,-D_FORTIFY_SOURCE=2 -fstack-protector-strong --param=ssp-buffer-size=4 -fomit-frame-pointer -march=i686 -fasynchronous-unwind-tables -mtune=pentium4 -gdwarf-4 -fno-debug-types-section -fvar-tracking-assignments -g2 -DBIND_8_COMPAT -c dktrace.c -o dktrace.lo -I. libtool: compile: i686-pld-linux-gcc -O2 -fwrapv -pipe -Wformat -Werror=format-security -gdwarf-4 -fno-debug-types-section -fvar-tracking-assignments -g2 -Wp,-D_FORTIFY_SOURCE=2 -fstack-protector-strong --param=ssp-buffer-size=4 -fomit-frame-pointer -march=i686 -fasynchronous-unwind-tables -mtune=pentium4 -gdwarf-4 -fno-debug-types-section -fvar-tracking-assignments -g2 -DBIND_8_COMPAT -c dktrace.c -I. -fPIC -DPIC -o .libs/dktrace.o libtool: compile: i686-pld-linux-gcc -O2 -fwrapv -pipe -Wformat -Werror=format-security -gdwarf-4 -fno-debug-types-section -fvar-tracking-assignments -g2 -Wp,-D_FORTIFY_SOURCE=2 -fstack-protector-strong --param=ssp-buffer-size=4 -fomit-frame-pointer -march=i686 -fasynchronous-unwind-tables -mtune=pentium4 -gdwarf-4 -fno-debug-types-section -fvar-tracking-assignments -g2 -DBIND_8_COMPAT -c dktrace.c -I. -o dktrace.o >/dev/null 2>&1 i686-pld-linux-gcc -O2 -fwrapv -pipe -Wformat -Werror=format-security -gdwarf-4 -fno-debug-types-section -fvar-tracking-assignments -g2 -Wp,-D_FORTIFY_SOURCE=2 -fstack-protector-strong --param=ssp-buffer-size=4 -fomit-frame-pointer -march=i686 -fasynchronous-unwind-tables -mtune=pentium4 -gdwarf-4 -fno-debug-types-section -fvar-tracking-assignments -g2 -DBIND_8_COMPAT -c dktest.c -I. error: Bad exit status from /tmp/B.aX_9bR/BUILD/tmp/rpm-tmp.97405 (%build) RPM build errors: Bad exit status from /tmp/B.aX_9bR/BUILD/tmp/rpm-tmp.97405 (%build) ended at: Fri Sep 14 20:12:40 2018, done in 0:00:00.799690 error: No files produced. + chmod -R u+rwX /tmp/B.aX_9bR/BUILD + rm -rf /tmp/B.aX_9bR/tmp /tmp/B.aX_9bR/BUILD + rm -rf /tmp/B.aX_9bR Begin-PLD-Builder-Info Build-Time: user:2.80s sys:0.26s real:3.73s (faults io:0 non-io:77155) End-PLD-Builder-Info
[Back to list of logs] [View rpm -qa of builder]