FailedOk

th/SRPMS[OK]
th/x32[OK]
th/i686[OK]
th/x86_64[OK]

ac/SRPMS[OK]
ac/i386[OK]
ac/i586[OK]
ac/i686[OK]
ac/alpha[OK]
ac/amd64[OK]
ac/athlon[OK]
ac/ppc[OK]
ac/sparc[OK]
ac/sparc64[OK]

Advanced Search
main()
Powered by PLD Linux
(c) 2002-2018 PLD Team
$Revision: 1.37 $
Powered by /dev/zero.
Your IP: 54.163.20.57

libeap-ikev2 2948c0a6-edd5-494b-9ad5-d6f4a9a07e3b

Status:Failed
Source URL:ftp://buildlogs.pld-linux.org/th/i686/FAIL/libeap-ikev2,2948c0a6-edd5-494b-9ad5-d6f4a9a07e3b.bz2
text/plain URL:View!
full text:View!
rpm -qa of builder:View!
Date:2018/09/14 20:13:03
Runtime:0:00:12.467740

Toc:

  • error 1
  • encr.c:145:3: error: unknown type name 'des_key_schedule'; did you mean 'DES_key_schedule'?
  • error 2
  • encr.c:146:24: error: 'des_cblock' undeclared (first use in this function); did you mean 'DES_cblock'?
  • error 3
  • encr.c:146:36: error: expected expression before ')' token
  • error 4
  • encr.c:147:31: error: expected expression before ')' token
  • error 5
  • encr.c:148:36: error: expected expression before ')' token
  • error 6
  • encr.c:149:31: error: expected expression before ')' token
  • error 7
  • encr.c:150:36: error: expected expression before ')' token
  • error 8
  • encr.c:151:31: error: expected expression before ')' token
  • error 9
  • encr.c:245:11: error: dereferencing pointer to incomplete type 'EVP_CIPHER' {aka 'const struct evp_cipher_st'}
  • error 10
  • encr.c:270:20: error: storage size of 'ctx' isn't known
  • error 11
  • make[2]: *** [Makefile:511: encr.lo] Error 1
  • error 12
  • hmac.c:216:20: error: storage size of 'ctx' isn't known
  • error 13
  • make[2]: *** [Makefile:511: hmac.lo] Error 1
  • error 14
  • dh.c:102:5: error: dereferencing pointer to incomplete type 'DH' {aka 'struct dh_st'}
  • error 15
  • make[2]: *** [Makefile:511: dh.lo] Error 1
  • error 16
  • auth.c:560:19: error: dereferencing pointer to incomplete type 'X509_STORE' {aka 'struct x509_store_st'}
  • error 17
  • auth.c:568:17: error: dereferencing pointer to incomplete type 'X509_OBJECT' {aka 'struct x509_object_st'}
  • error 18
  • auth.c:584:39: error: dereferencing pointer to incomplete type 'X509_PUBKEY' {aka 'struct X509_pubkey_st'}
  • error 19
  • auth.c:613:30: error: dereferencing pointer to incomplete type 'EVP_PKEY' {aka 'struct evp_pkey_st'}
  • error 20
  • auth.c:705:14: error: dereferencing pointer to incomplete type 'X509_STORE_CTX' {aka 'struct x509_store_ctx_st'}
  • error 21
  • make[2]: *** [Makefile:511: auth.lo] Error 1
  • error 22
  • make[1]: *** [Makefile:379: all] Error 2
  • error 23
  • error: Bad exit status from /tmp/B.tu3zM5/BUILD/tmp/rpm-tmp.52019 (%build)
  • error 24
  • RPM build errors:
  • error 25
  • error: No files produced.

Content:

checking for objdir... .libs
checking if i686-pld-linux-gcc supports -fno-rtti -fno-exceptions... no
checking for i686-pld-linux-gcc option to produce PIC... -fPIC -DPIC
checking if i686-pld-linux-gcc PIC flag -fPIC -DPIC works... yes
checking if i686-pld-linux-gcc static flag -static works... yes
checking if i686-pld-linux-gcc supports -c -o file.o... yes
checking if i686-pld-linux-gcc supports -c -o file.o... (cached) yes
checking whether the i686-pld-linux-gcc linker (/usr/bin/ld) supports shared libraries... yes
checking whether -lc should be explicitly linked in... no
checking dynamic linker characteristics... GNU/Linux ld.so
checking how to hardcode library paths into programs... immediate
checking whether stripping libraries is possible... yes
checking if libtool supports shared libraries... yes
checking whether to build shared libraries... yes
checking whether to build static libraries... yes
checking for i686-pld-linux-gcc... (cached) i686-pld-linux-gcc
checking whether we are using the GNU C compiler... (cached) yes
checking whether i686-pld-linux-gcc accepts -g... (cached) yes
checking for i686-pld-linux-gcc option to accept ISO C89... (cached) none needed
checking whether i686-pld-linux-gcc understands -c and -o together... (cached) yes
checking dependency style of i686-pld-linux-gcc... (cached) gcc3
checking whether make sets $(MAKE)... (cached) yes
checking for an ANSI C-conforming const... yes
checking for working memcmp... yes
checking for vprintf... yes
checking for _doprnt... no
checking for ANSI C header files... (cached) yes
checking netinet/in.h usability... yes
checking netinet/in.h presence... yes
checking for netinet/in.h... yes
checking winsock.h usability... no
checking winsock.h presence... no
checking for winsock.h... no
checking for stdint.h... (cached) yes
checking pthread.h usability... yes
checking pthread.h presence... yes
checking for pthread.h... yes
checking for OpenSSL_add_all_algorithms... no
checking for openssl/ssl.h... yes
checking openssl/err.h usability... yes
checking openssl/err.h presence... yes
checking for openssl/err.h... yes
checking openssl/crypto.h usability... yes
checking openssl/crypto.h presence... yes
checking for openssl/crypto.h... yes
checking openssl/rand.h usability... yes
checking openssl/rand.h presence... yes
checking for openssl/rand.h... yes
checking openssl/engine.h usability... yes
checking openssl/engine.h presence... yes
checking for openssl/engine.h... yes
checking for OpenSSL version >= 0.9.7... yes
checking for developer gcc flags... no
checking for required OpenSSL algorithms... yes
checking that generated files are newer than configure... done
configure: creating ./config.status
config.status: creating Makefile
config.status: creating src/config.h
config.status: executing depfiles commands
config.status: executing libtool commands
checking that generated files are newer than configure... done
configure: creating ./config.status
config.status: creating Makefile
config.status: creating src/Makefile
config.status: creating src/config.h
config.status: src/config.h is unchanged
config.status: executing depfiles commands
config.status: executing libtool commands
checking that generated files are newer than configure... done
configure: creating ./config.status
config.status: creating Makefile
config.status: creating src/Makefile
config.status: creating docs/Makefile
config.status: creating src/config.h
config.status: src/config.h is unchanged
config.status: executing depfiles commands
config.status: executing libtool commands
checking that generated files are newer than configure... done
configure: creating ./config.status
config.status: creating Makefile
config.status: creating src/Makefile
config.status: creating docs/Makefile
config.status: creating docs/Doxyfile
config.status: creating src/config.h
config.status: src/config.h is unchanged
config.status: executing depfiles commands
config.status: executing libtool commands


Good, your configure finished.  Now run 'make'.
For deatialed instructions please read 'INSTALL' file.

+ /usr/bin/make -Otarget -j9
Making all in src
/usr/bin/make  all-am
make[2]: Entering directory '/tmp/B.tu3zM5/BUILD/libeap-ikev2-0.2.1/src'
/bin/sh ../libtool  --tag=CC   --mode=compile i686-pld-linux-gcc -DHAVE_CONFIG_H -I.     -O2 -fwrapv -pipe -Wformat -Werror=format-security -gdwarf-4 -fno-debug-types-section -fvar-tracking-assignments -g2 -Wp,-D_FORTIFY_SOURCE=2 -fstack-protector-strong --param=ssp-buffer-size=4 -fomit-frame-pointer -march=i686 -fasynchronous-unwind-tables -mtune=pentium4 -gdwarf-4 -fno-debug-types-section -fvar-tracking-assignments -g2    -MT encr.lo -MD -MP -MF .deps/encr.Tpo -c -o encr.lo encr.c
libtool: compile:  i686-pld-linux-gcc -DHAVE_CONFIG_H -I. -O2 -fwrapv -pipe -Wformat -Werror=format-security -gdwarf-4 -fno-debug-types-section -fvar-tracking-assignments -g2 -Wp,-D_FORTIFY_SOURCE=2 -fstack-protector-strong --param=ssp-buffer-size=4 -fomit-frame-pointer -march=i686 -fasynchronous-unwind-tables -mtune=pentium4 -gdwarf-4 -fno-debug-types-section -fvar-tracking-assignments -g2 -MT encr.lo -MD -MP -MF .deps/encr.Tpo -c encr.c  -fPIC -DPIC -o .libs/encr.o
encr.c: In function 'Do3DES':
encr.c:145:3: error: unknown type name 'des_key_schedule'; did you mean 'DES_key_schedule'?
   des_key_schedule k1, k2, k3;
   ^~~~~~~~~~~~~~~~
   DES_key_schedule
encr.c:146:3: warning: implicit declaration of function 'des_set_odd_parity'; did you mean 'DES_set_odd_parity'? [-Wimplicit-function-declaration]
   des_set_odd_parity( (des_cblock *)key );    // set parity, generate expanded keys
   ^~~~~~~~~~~~~~~~~~
   DES_set_odd_parity
encr.c:146:24: error: 'des_cblock' undeclared (first use in this function); did you mean 'DES_cblock'?
   des_set_odd_parity( (des_cblock *)key );    // set parity, generate expanded keys
                        ^~~~~~~~~~
                        DES_cblock
encr.c:146:24: note: each undeclared identifier is reported only once for each function it appears in
encr.c:146:36: error: expected expression before ')' token
   des_set_odd_parity( (des_cblock *)key );    // set parity, generate expanded keys
                                    ^
encr.c:147:3: warning: implicit declaration of function 'des_key_sched'; did you mean 'DES_key_sched'? [-Wimplicit-function-declaration]
   des_key_sched( (des_cblock *)key, k1 );
   ^~~~~~~~~~~~~
   DES_key_sched
encr.c:147:31: error: expected expression before ')' token
   des_key_sched( (des_cblock *)key, k1 );
                               ^
encr.c:148:36: error: expected expression before ')' token
   des_set_odd_parity( (des_cblock *)( key + 8 ) );
                                    ^
encr.c:149:31: error: expected expression before ')' token
   des_key_sched( (des_cblock *)( key + 8 ), k2 );
                               ^
encr.c:150:36: error: expected expression before ')' token
   des_set_odd_parity( (des_cblock *)( key + 16 ) );
                                    ^
encr.c:151:31: error: expected expression before ')' token
   des_key_sched( (des_cblock *)( key + 16 ), k3 );
                               ^
encr.c:154:5: warning: implicit declaration of function 'des_ecb3_encrypt'; did you mean 'DES_ecb3_encrypt'? [-Wimplicit-function-declaration]
     des_ecb3_encrypt( (uint8_t *)( data + i * 8 ), (uint8_t *)( data + i * 8 ), k1, k2, k3, enc );
     ^~~~~~~~~~~~~~~~
     DES_ecb3_encrypt
encr.c: In function 'FindEVPCipher':
encr.c:245:11: error: dereferencing pointer to incomplete type 'EVP_CIPHER' {aka 'const struct evp_cipher_st'}
  if(result->flags & EVP_CIPH_VARIABLE_LENGTH) {
           ^~
encr.c: In function 'DoEVPCrypt':
encr.c:270:20: error: storage size of 'ctx' isn't known
     EVP_CIPHER_CTX ctx;
                    ^~~
make[2]: *** [Makefile:511: encr.lo] Error 1
make[2]: Leaving directory '/tmp/B.tu3zM5/BUILD/libeap-ikev2-0.2.1/src'
make[2]: *** Waiting for unfinished jobs....
make[2]: Entering directory '/tmp/B.tu3zM5/BUILD/libeap-ikev2-0.2.1/src'
/bin/sh ../libtool  --tag=CC   --mode=compile i686-pld-linux-gcc -DHAVE_CONFIG_H -I.     -O2 -fwrapv -pipe -Wformat -Werror=format-security -gdwarf-4 -fno-debug-types-section -fvar-tracking-assignments -g2 -Wp,-D_FORTIFY_SOURCE=2 -fstack-protector-strong --param=ssp-buffer-size=4 -fomit-frame-pointer -march=i686 -fasynchronous-unwind-tables -mtune=pentium4 -gdwarf-4 -fno-debug-types-section -fvar-tracking-assignments -g2    -MT hmac.lo -MD -MP -MF .deps/hmac.Tpo -c -o hmac.lo hmac.c
libtool: compile:  i686-pld-linux-gcc -DHAVE_CONFIG_H -I. -O2 -fwrapv -pipe -Wformat -Werror=format-security -gdwarf-4 -fno-debug-types-section -fvar-tracking-assignments -g2 -Wp,-D_FORTIFY_SOURCE=2 -fstack-protector-strong --param=ssp-buffer-size=4 -fomit-frame-pointer -march=i686 -fasynchronous-unwind-tables -mtune=pentium4 -gdwarf-4 -fno-debug-types-section -fvar-tracking-assignments -g2 -MT hmac.lo -MD -MP -MF .deps/hmac.Tpo -c hmac.c  -fPIC -DPIC -o .libs/hmac.o
hmac.c: In function 'i2_des_mac':
hmac.c:216:20: error: storage size of 'ctx' isn't known
     EVP_CIPHER_CTX ctx;
                    ^~~
make[2]: *** [Makefile:511: hmac.lo] Error 1
make[2]: Leaving directory '/tmp/B.tu3zM5/BUILD/libeap-ikev2-0.2.1/src'
make[2]: Entering directory '/tmp/B.tu3zM5/BUILD/libeap-ikev2-0.2.1/src'
/bin/sh ../libtool  --tag=CC   --mode=compile i686-pld-linux-gcc -DHAVE_CONFIG_H -I.     -O2 -fwrapv -pipe -Wformat -Werror=format-security -gdwarf-4 -fno-debug-types-section -fvar-tracking-assignments -g2 -Wp,-D_FORTIFY_SOURCE=2 -fstack-protector-strong --param=ssp-buffer-size=4 -fomit-frame-pointer -march=i686 -fasynchronous-unwind-tables -mtune=pentium4 -gdwarf-4 -fno-debug-types-section -fvar-tracking-assignments -g2    -MT dh.lo -MD -MP -MF .deps/dh.Tpo -c -o dh.lo dh.c
libtool: compile:  i686-pld-linux-gcc -DHAVE_CONFIG_H -I. -O2 -fwrapv -pipe -Wformat -Werror=format-security -gdwarf-4 -fno-debug-types-section -fvar-tracking-assignments -g2 -Wp,-D_FORTIFY_SOURCE=2 -fstack-protector-strong --param=ssp-buffer-size=4 -fomit-frame-pointer -march=i686 -fasynchronous-unwind-tables -mtune=pentium4 -gdwarf-4 -fno-debug-types-section -fvar-tracking-assignments -g2 -MT dh.lo -MD -MP -MF .deps/dh.Tpo -c dh.c  -fPIC -DPIC -o .libs/dh.o
dh.c: In function 'DHGenerateKEData_MODP':
dh.c:102:5: error: dereferencing pointer to incomplete type 'DH' {aka 'struct dh_st'}
   dh->p = p;
     ^~
make[2]: *** [Makefile:511: dh.lo] Error 1
make[2]: Leaving directory '/tmp/B.tu3zM5/BUILD/libeap-ikev2-0.2.1/src'
make[2]: Entering directory '/tmp/B.tu3zM5/BUILD/libeap-ikev2-0.2.1/src'
/bin/sh ../libtool  --tag=CC   --mode=compile i686-pld-linux-gcc -DHAVE_CONFIG_H -I.     -O2 -fwrapv -pipe -Wformat -Werror=format-security -gdwarf-4 -fno-debug-types-section -fvar-tracking-assignments -g2 -Wp,-D_FORTIFY_SOURCE=2 -fstack-protector-strong --param=ssp-buffer-size=4 -fomit-frame-pointer -march=i686 -fasynchronous-unwind-tables -mtune=pentium4 -gdwarf-4 -fno-debug-types-section -fvar-tracking-assignments -g2    -MT auth.lo -MD -MP -MF .deps/auth.Tpo -c -o auth.lo auth.c
libtool: compile:  i686-pld-linux-gcc -DHAVE_CONFIG_H -I. -O2 -fwrapv -pipe -Wformat -Werror=format-security -gdwarf-4 -fno-debug-types-section -fvar-tracking-assignments -g2 -Wp,-D_FORTIFY_SOURCE=2 -fstack-protector-strong --param=ssp-buffer-size=4 -fomit-frame-pointer -march=i686 -fasynchronous-unwind-tables -mtune=pentium4 -gdwarf-4 -fno-debug-types-section -fvar-tracking-assignments -g2 -MT auth.lo -MD -MP -MF .deps/auth.Tpo -c auth.c  -fPIC -DPIC -o .libs/auth.o
auth.c:59:2: warning: #warning Using own implemetation of OpenSSL_add_all_algorithms() [-Wcpp]
 #warning Using own implemetation of OpenSSL_add_all_algorithms()
  ^~~~~~~
auth.c: In function 'CreateCAHashString':
auth.c:560:19: error: dereferencing pointer to incomplete type 'X509_STORE' {aka 'struct x509_store_st'}
     if(!x509_store->objs) {
                   ^~
auth.c:568:17: error: dereferencing pointer to incomplete type 'X509_OBJECT' {aka 'struct x509_object_st'}
  if(xobj && xobj->type==X509_LU_X509) {
                 ^~
auth.c:584:39: error: dereferencing pointer to incomplete type 'X509_PUBKEY' {aka 'struct X509_pubkey_st'}
      pkdata=X509_get_X509_PUBKEY(x509)->public_key->data;
                                       ^~
auth.c: In function 'GenerateCertAuthData':
auth.c:613:30: error: dereferencing pointer to incomplete type 'EVP_PKEY' {aka 'struct evp_pkey_st'}
     switch(EVP_PKEY_type(pkey->type)) {
                              ^~
auth.c: In function 'CertAuthenticate':
auth.c:699:28: warning: passing argument 2 of 'd2i_X509' from incompatible pointer type [-Wincompatible-pointer-types]
     x509 = d2i_X509( NULL, (unsigned char **)&cdata, cdlen );
                            ^~~~~~~~~~~~~~~~~~~~~~~~
In file included from /usr/include/openssl/objects.h:15,
                 from /usr/include/openssl/evp.h:28,
                 from /usr/include/openssl/x509.h:18,
                 from auth.c:41:
/usr/include/openssl/x509.h:551:1: note: expected 'const unsigned char **' but argument is of type 'unsigned char **'
 DECLARE_ASN1_FUNCTIONS(X509)
 ^~~~~~~~~~~~~~~~~~~~~~
auth.c:705:14: error: dereferencing pointer to incomplete type 'X509_STORE_CTX' {aka 'struct x509_store_ctx_st'}
     err = csc->error;
              ^~
make[2]: *** [Makefile:511: auth.lo] Error 1
make[2]: Leaving directory '/tmp/B.tu3zM5/BUILD/libeap-ikev2-0.2.1/src'
make[2]: Entering directory '/tmp/B.tu3zM5/BUILD/libeap-ikev2-0.2.1/src'
/bin/sh ../libtool  --tag=CC   --mode=compile i686-pld-linux-gcc -DHAVE_CONFIG_H -I.     -O2 -fwrapv -pipe -Wformat -Werror=format-security -gdwarf-4 -fno-debug-types-section -fvar-tracking-assignments -g2 -Wp,-D_FORTIFY_SOURCE=2 -fstack-protector-strong --param=ssp-buffer-size=4 -fomit-frame-pointer -march=i686 -fasynchronous-unwind-tables -mtune=pentium4 -gdwarf-4 -fno-debug-types-section -fvar-tracking-assignments -g2    -MT logging.lo -MD -MP -MF .deps/logging.Tpo -c -o logging.lo logging.c
libtool: compile:  i686-pld-linux-gcc -DHAVE_CONFIG_H -I. -O2 -fwrapv -pipe -Wformat -Werror=format-security -gdwarf-4 -fno-debug-types-section -fvar-tracking-assignments -g2 -Wp,-D_FORTIFY_SOURCE=2 -fstack-protector-strong --param=ssp-buffer-size=4 -fomit-frame-pointer -march=i686 -fasynchronous-unwind-tables -mtune=pentium4 -gdwarf-4 -fno-debug-types-section -fvar-tracking-assignments -g2 -MT logging.lo -MD -MP -MF .deps/logging.Tpo -c logging.c  -fPIC -DPIC -o .libs/logging.o
libtool: compile:  i686-pld-linux-gcc -DHAVE_CONFIG_H -I. -O2 -fwrapv -pipe -Wformat -Werror=format-security -gdwarf-4 -fno-debug-types-section -fvar-tracking-assignments -g2 -Wp,-D_FORTIFY_SOURCE=2 -fstack-protector-strong --param=ssp-buffer-size=4 -fomit-frame-pointer -march=i686 -fasynchronous-unwind-tables -mtune=pentium4 -gdwarf-4 -fno-debug-types-section -fvar-tracking-assignments -g2 -MT logging.lo -MD -MP -MF .deps/logging.Tpo -c logging.c -o logging.o >/dev/null 2>&1
mv -f .deps/logging.Tpo .deps/logging.Plo
make[2]: Leaving directory '/tmp/B.tu3zM5/BUILD/libeap-ikev2-0.2.1/src'
make[2]: Entering directory '/tmp/B.tu3zM5/BUILD/libeap-ikev2-0.2.1/src'
/bin/sh ../libtool  --tag=CC   --mode=compile i686-pld-linux-gcc -DHAVE_CONFIG_H -I.     -O2 -fwrapv -pipe -Wformat -Werror=format-security -gdwarf-4 -fno-debug-types-section -fvar-tracking-assignments -g2 -Wp,-D_FORTIFY_SOURCE=2 -fstack-protector-strong --param=ssp-buffer-size=4 -fomit-frame-pointer -march=i686 -fasynchronous-unwind-tables -mtune=pentium4 -gdwarf-4 -fno-debug-types-section -fvar-tracking-assignments -g2    -MT integ.lo -MD -MP -MF .deps/integ.Tpo -c -o integ.lo integ.c
libtool: compile:  i686-pld-linux-gcc -DHAVE_CONFIG_H -I. -O2 -fwrapv -pipe -Wformat -Werror=format-security -gdwarf-4 -fno-debug-types-section -fvar-tracking-assignments -g2 -Wp,-D_FORTIFY_SOURCE=2 -fstack-protector-strong --param=ssp-buffer-size=4 -fomit-frame-pointer -march=i686 -fasynchronous-unwind-tables -mtune=pentium4 -gdwarf-4 -fno-debug-types-section -fvar-tracking-assignments -g2 -MT integ.lo -MD -MP -MF .deps/integ.Tpo -c integ.c  -fPIC -DPIC -o .libs/integ.o
libtool: compile:  i686-pld-linux-gcc -DHAVE_CONFIG_H -I. -O2 -fwrapv -pipe -Wformat -Werror=format-security -gdwarf-4 -fno-debug-types-section -fvar-tracking-assignments -g2 -Wp,-D_FORTIFY_SOURCE=2 -fstack-protector-strong --param=ssp-buffer-size=4 -fomit-frame-pointer -march=i686 -fasynchronous-unwind-tables -mtune=pentium4 -gdwarf-4 -fno-debug-types-section -fvar-tracking-assignments -g2 -MT integ.lo -MD -MP -MF .deps/integ.Tpo -c integ.c -o integ.o >/dev/null 2>&1
mv -f .deps/integ.Tpo .deps/integ.Plo
make[2]: Leaving directory '/tmp/B.tu3zM5/BUILD/libeap-ikev2-0.2.1/src'
make[2]: Entering directory '/tmp/B.tu3zM5/BUILD/libeap-ikev2-0.2.1/src'
/bin/sh ../libtool  --tag=CC   --mode=compile i686-pld-linux-gcc -DHAVE_CONFIG_H -I.     -O2 -fwrapv -pipe -Wformat -Werror=format-security -gdwarf-4 -fno-debug-types-section -fvar-tracking-assignments -g2 -Wp,-D_FORTIFY_SOURCE=2 -fstack-protector-strong --param=ssp-buffer-size=4 -fomit-frame-pointer -march=i686 -fasynchronous-unwind-tables -mtune=pentium4 -gdwarf-4 -fno-debug-types-section -fvar-tracking-assignments -g2    -MT conf_utils.lo -MD -MP -MF .deps/conf_utils.Tpo -c -o conf_utils.lo conf_utils.c
libtool: compile:  i686-pld-linux-gcc -DHAVE_CONFIG_H -I. -O2 -fwrapv -pipe -Wformat -Werror=format-security -gdwarf-4 -fno-debug-types-section -fvar-tracking-assignments -g2 -Wp,-D_FORTIFY_SOURCE=2 -fstack-protector-strong --param=ssp-buffer-size=4 -fomit-frame-pointer -march=i686 -fasynchronous-unwind-tables -mtune=pentium4 -gdwarf-4 -fno-debug-types-section -fvar-tracking-assignments -g2 -MT conf_utils.lo -MD -MP -MF .deps/conf_utils.Tpo -c conf_utils.c  -fPIC -DPIC -o .libs/conf_utils.o
libtool: compile:  i686-pld-linux-gcc -DHAVE_CONFIG_H -I. -O2 -fwrapv -pipe -Wformat -Werror=format-security -gdwarf-4 -fno-debug-types-section -fvar-tracking-assignments -g2 -Wp,-D_FORTIFY_SOURCE=2 -fstack-protector-strong --param=ssp-buffer-size=4 -fomit-frame-pointer -march=i686 -fasynchronous-unwind-tables -mtune=pentium4 -gdwarf-4 -fno-debug-types-section -fvar-tracking-assignments -g2 -MT conf_utils.lo -MD -MP -MF .deps/conf_utils.Tpo -c conf_utils.c -o conf_utils.o >/dev/null 2>&1
mv -f .deps/conf_utils.Tpo .deps/conf_utils.Plo
make[2]: Leaving directory '/tmp/B.tu3zM5/BUILD/libeap-ikev2-0.2.1/src'
make[2]: Entering directory '/tmp/B.tu3zM5/BUILD/libeap-ikev2-0.2.1/src'
/bin/sh ../libtool  --tag=CC   --mode=compile i686-pld-linux-gcc -DHAVE_CONFIG_H -I.     -O2 -fwrapv -pipe -Wformat -Werror=format-security -gdwarf-4 -fno-debug-types-section -fvar-tracking-assignments -g2 -Wp,-D_FORTIFY_SOURCE=2 -fstack-protector-strong --param=ssp-buffer-size=4 -fomit-frame-pointer -march=i686 -fasynchronous-unwind-tables -mtune=pentium4 -gdwarf-4 -fno-debug-types-section -fvar-tracking-assignments -g2    -MT IKEv2.lo -MD -MP -MF .deps/IKEv2.Tpo -c -o IKEv2.lo IKEv2.c
libtool: compile:  i686-pld-linux-gcc -DHAVE_CONFIG_H -I. -O2 -fwrapv -pipe -Wformat -Werror=format-security -gdwarf-4 -fno-debug-types-section -fvar-tracking-assignments -g2 -Wp,-D_FORTIFY_SOURCE=2 -fstack-protector-strong --param=ssp-buffer-size=4 -fomit-frame-pointer -march=i686 -fasynchronous-unwind-tables -mtune=pentium4 -gdwarf-4 -fno-debug-types-section -fvar-tracking-assignments -g2 -MT IKEv2.lo -MD -MP -MF .deps/IKEv2.Tpo -c IKEv2.c  -fPIC -DPIC -o .libs/IKEv2.o
libtool: compile:  i686-pld-linux-gcc -DHAVE_CONFIG_H -I. -O2 -fwrapv -pipe -Wformat -Werror=format-security -gdwarf-4 -fno-debug-types-section -fvar-tracking-assignments -g2 -Wp,-D_FORTIFY_SOURCE=2 -fstack-protector-strong --param=ssp-buffer-size=4 -fomit-frame-pointer -march=i686 -fasynchronous-unwind-tables -mtune=pentium4 -gdwarf-4 -fno-debug-types-section -fvar-tracking-assignments -g2 -MT IKEv2.lo -MD -MP -MF .deps/IKEv2.Tpo -c IKEv2.c -o IKEv2.o >/dev/null 2>&1
mv -f .deps/IKEv2.Tpo .deps/IKEv2.Plo
make[2]: Leaving directory '/tmp/B.tu3zM5/BUILD/libeap-ikev2-0.2.1/src'
make[2]: Entering directory '/tmp/B.tu3zM5/BUILD/libeap-ikev2-0.2.1/src'
/bin/sh ../libtool  --tag=CC   --mode=compile i686-pld-linux-gcc -DHAVE_CONFIG_H -I.     -O2 -fwrapv -pipe -Wformat -Werror=format-security -gdwarf-4 -fno-debug-types-section -fvar-tracking-assignments -g2 -Wp,-D_FORTIFY_SOURCE=2 -fstack-protector-strong --param=ssp-buffer-size=4 -fomit-frame-pointer -march=i686 -fasynchronous-unwind-tables -mtune=pentium4 -gdwarf-4 -fno-debug-types-section -fvar-tracking-assignments -g2    -MT connector.lo -MD -MP -MF .deps/connector.Tpo -c -o connector.lo connector.c
libtool: compile:  i686-pld-linux-gcc -DHAVE_CONFIG_H -I. -O2 -fwrapv -pipe -Wformat -Werror=format-security -gdwarf-4 -fno-debug-types-section -fvar-tracking-assignments -g2 -Wp,-D_FORTIFY_SOURCE=2 -fstack-protector-strong --param=ssp-buffer-size=4 -fomit-frame-pointer -march=i686 -fasynchronous-unwind-tables -mtune=pentium4 -gdwarf-4 -fno-debug-types-section -fvar-tracking-assignments -g2 -MT connector.lo -MD -MP -MF .deps/connector.Tpo -c connector.c  -fPIC -DPIC -o .libs/connector.o
libtool: compile:  i686-pld-linux-gcc -DHAVE_CONFIG_H -I. -O2 -fwrapv -pipe -Wformat -Werror=format-security -gdwarf-4 -fno-debug-types-section -fvar-tracking-assignments -g2 -Wp,-D_FORTIFY_SOURCE=2 -fstack-protector-strong --param=ssp-buffer-size=4 -fomit-frame-pointer -march=i686 -fasynchronous-unwind-tables -mtune=pentium4 -gdwarf-4 -fno-debug-types-section -fvar-tracking-assignments -g2 -MT connector.lo -MD -MP -MF .deps/connector.Tpo -c connector.c -o connector.o >/dev/null 2>&1
mv -f .deps/connector.Tpo .deps/connector.Plo
make[2]: Leaving directory '/tmp/B.tu3zM5/BUILD/libeap-ikev2-0.2.1/src'
make[1]: *** [Makefile:379: all] Error 2
make: *** [Makefile:379: all-recursive] Error 1
error: Bad exit status from /tmp/B.tu3zM5/BUILD/tmp/rpm-tmp.52019 (%build)


RPM build errors:
    Bad exit status from /tmp/B.tu3zM5/BUILD/tmp/rpm-tmp.52019 (%build)
ended at: Fri Sep 14 20:13:02 2018, done in 0:00:12.467740
error: No files produced.
+ chmod -R u+rwX /tmp/B.tu3zM5/BUILD
+ rm -rf /tmp/B.tu3zM5/tmp /tmp/B.tu3zM5/BUILD
+ rm -rf /tmp/B.tu3zM5
Begin-PLD-Builder-Info
Build-Time: user:12.18s sys:1.31s real:16.33s (faults io:0 non-io:772704)

End-PLD-Builder-Info
[Back to list of logs] [View rpm -qa of builder]