FailedOk

th/SRPMS[OK]
th/x32[OK]
th/i686[OK]
th/x86_64[OK]

ac/SRPMS[OK]
ac/i386[OK]
ac/i586[OK]
ac/i686[OK]
ac/alpha[OK]
ac/amd64[OK]
ac/athlon[OK]
ac/ppc[OK]
ac/sparc[OK]
ac/sparc64[OK]

Advanced Search
main()
Powered by PLD Linux
(c) 2002-2018 PLD Team
$Revision: 1.37 $
Powered by bogon.
Your IP: 54.147.142.16

libjingle b2c87afa-a0a4-48ee-9a8e-3b6c6e836812

Status:Failed
Source URL:ftp://buildlogs.pld-linux.org/th/i686/FAIL/libjingle,b2c87afa-a0a4-48ee-9a8e-3b6c6e836812.bz2
text/plain URL:View!
full text:View!
rpm -qa of builder:View!
Date:2018/09/14 20:27:05
Runtime:0:00:18.190952

Toc:

  • error 1
  • opensslidentity.cc:171:20: error: invalid use of incomplete type 'EVP_PKEY' {aka 'struct evp_pkey_st'}
  • error 2
  • opensslidentity.cc:171:37: error: 'CRYPTO_LOCK_EVP_PKEY' was not declared in this scope
  • error 3
  • opensslidentity.cc:171:3: error: 'CRYPTO_add' was not declared in this scope
  • error 4
  • opensslidentity.cc:317:20: error: invalid use of incomplete type 'X509' {aka 'struct x509_st'}
  • error 5
  • opensslidentity.cc:317:37: error: 'CRYPTO_LOCK_X509' was not declared in this scope
  • error 6
  • opensslidentity.cc:317:3: error: 'CRYPTO_add' was not declared in this scope
  • error 7
  • make[3]: *** [Makefile:847: opensslidentity.lo] Error 1
  • error 8
  • openssladapter.cc:87:19: error: variable 'BIO_METHOD methods_socket' has initializer but incomplete type
  • error 9
  • openssladapter.cc:107:6: error: invalid use of incomplete type 'BIO' {aka 'struct bio_st'}
  • error 10
  • openssladapter.cc:112:4: error: invalid use of incomplete type 'BIO' {aka 'struct bio_st'}
  • error 11
  • openssladapter.cc:113:4: error: invalid use of incomplete type 'BIO' {aka 'struct bio_st'}
  • error 12
  • openssladapter.cc:114:4: error: invalid use of incomplete type 'BIO' {aka 'struct bio_st'}
  • error 13
  • openssladapter.cc:115:4: error: invalid use of incomplete type 'BIO' {aka 'struct bio_st'}
  • error 14
  • openssladapter.cc:128:74: error: invalid use of incomplete type 'BIO' {aka 'struct bio_st'}
  • error 15
  • openssladapter.cc:134:6: error: invalid use of incomplete type 'BIO' {aka 'struct bio_st'}
  • error 16
  • openssladapter.cc:144:74: error: invalid use of incomplete type 'BIO' {aka 'struct bio_st'}
  • error 17
  • openssladapter.cc:167:13: error: invalid use of incomplete type 'BIO' {aka 'struct bio_st'}
  • error 18
  • openssladapter.cc:699:48: error: invalid use of incomplete type 'X509_EXTENSION' {aka 'struct X509_extension_st'}
  • error 19
  • openssladapter.cc:710:42: error: invalid use of incomplete type 'X509_EXTENSION' {aka 'struct X509_extension_st'}
  • error 20
  • openssladapter.cc:713:64: error: invalid use of incomplete type 'X509_EXTENSION' {aka 'struct X509_extension_st'}
  • error 21
  • make[3]: *** [Makefile:847: openssladapter.lo] Error 1
  • error 22
  • opensslstreamadapter.cc:89:19: error: variable 'BIO_METHOD talk_base::methods_stream' has initializer but incomplete type
  • error 23
  • opensslstreamadapter.cc:108:6: error: invalid use of incomplete type 'BIO' {aka 'struct bio_st'}
  • error 24
  • opensslstreamadapter.cc:115:4: error: invalid use of incomplete type 'BIO' {aka 'struct bio_st'}
  • error 25
  • opensslstreamadapter.cc:116:4: error: invalid use of incomplete type 'BIO' {aka 'struct bio_st'}
  • error 26
  • opensslstreamadapter.cc:117:4: error: invalid use of incomplete type 'BIO' {aka 'struct bio_st'}
  • error 27
  • opensslstreamadapter.cc:118:4: error: invalid use of incomplete type 'BIO' {aka 'struct bio_st'}
  • error 28
  • opensslstreamadapter.cc:131:60: error: invalid use of incomplete type 'BIO' {aka 'struct bio_st'}
  • error 29
  • opensslstreamadapter.cc:139:6: error: invalid use of incomplete type 'BIO' {aka 'struct bio_st'}
  • error 30
  • opensslstreamadapter.cc:149:60: error: invalid use of incomplete type 'BIO' {aka 'struct bio_st'}
  • error 31
  • opensslstreamadapter.cc:174:15: error: invalid use of incomplete type 'BIO' {aka 'struct bio_st'}
  • error 32
  • make[3]: *** [Makefile:847: opensslstreamadapter.lo] Error 1
  • error 33
  • make[2]: *** [Makefile:371: all-recursive] Error 1
  • error 34
  • make[1]: *** [Makefile:470: all-recursive] Error 1
  • error 35
  • error: Bad exit status from /tmp/B.kGR6Lo/BUILD/tmp/rpm-tmp.91731 (%build)
  • error 36
  • RPM build errors:
  • error 37
  • error: No files produced.

Content:

make[3]: Entering directory '/tmp/B.kGR6Lo/BUILD/libjingle-0.6.14/talk/base'
/bin/sh ../../libtool --silent  --tag=CXX   --mode=compile i686-pld-linux-g++ -DHAVE_CONFIG_H -I. -I../..    -DPOSIX -DLINUX -DFEATURE_ENABLE_VOICEMAIL   -O2 -fwrapv -pipe -Wformat -Werror=format-security -gdwarf-4 -fno-debug-types-section -fvar-tracking-assignments -g2 -Wp,-D_FORTIFY_SOURCE=2 -fstack-protector-strong --param=ssp-buffer-size=4 -fomit-frame-pointer -march=i686 -fasynchronous-unwind-tables -mtune=pentium4 -gdwarf-4 -fno-debug-types-section -fvar-tracking-assignments -g2  -MT asyncudpsocket.lo -MD -MP -MF .deps/asyncudpsocket.Tpo -c -o asyncudpsocket.lo asyncudpsocket.cc
mv -f .deps/asyncudpsocket.Tpo .deps/asyncudpsocket.Plo
make[3]: Leaving directory '/tmp/B.kGR6Lo/BUILD/libjingle-0.6.14/talk/base'
make[3]: Entering directory '/tmp/B.kGR6Lo/BUILD/libjingle-0.6.14/talk/base'
/bin/sh ../../libtool --silent  --tag=CXX   --mode=compile i686-pld-linux-g++ -DHAVE_CONFIG_H -I. -I../..    -DPOSIX -DLINUX -DFEATURE_ENABLE_VOICEMAIL   -O2 -fwrapv -pipe -Wformat -Werror=format-security -gdwarf-4 -fno-debug-types-section -fvar-tracking-assignments -g2 -Wp,-D_FORTIFY_SOURCE=2 -fstack-protector-strong --param=ssp-buffer-size=4 -fomit-frame-pointer -march=i686 -fasynchronous-unwind-tables -mtune=pentium4 -gdwarf-4 -fno-debug-types-section -fvar-tracking-assignments -g2  -MT asynctcpsocket.lo -MD -MP -MF .deps/asynctcpsocket.Tpo -c -o asynctcpsocket.lo asynctcpsocket.cc
mv -f .deps/asynctcpsocket.Tpo .deps/asynctcpsocket.Plo
make[3]: Leaving directory '/tmp/B.kGR6Lo/BUILD/libjingle-0.6.14/talk/base'
make[3]: Entering directory '/tmp/B.kGR6Lo/BUILD/libjingle-0.6.14/talk/base'
/bin/sh ../../libtool --silent  --tag=CXX   --mode=compile i686-pld-linux-g++ -DHAVE_CONFIG_H -I. -I../..    -DPOSIX -DLINUX -DFEATURE_ENABLE_VOICEMAIL   -O2 -fwrapv -pipe -Wformat -Werror=format-security -gdwarf-4 -fno-debug-types-section -fvar-tracking-assignments -g2 -Wp,-D_FORTIFY_SOURCE=2 -fstack-protector-strong --param=ssp-buffer-size=4 -fomit-frame-pointer -march=i686 -fasynchronous-unwind-tables -mtune=pentium4 -gdwarf-4 -fno-debug-types-section -fvar-tracking-assignments -g2  -MT host.lo -MD -MP -MF .deps/host.Tpo -c -o host.lo host.cc
mv -f .deps/host.Tpo .deps/host.Plo
make[3]: Leaving directory '/tmp/B.kGR6Lo/BUILD/libjingle-0.6.14/talk/base'
make[3]: Entering directory '/tmp/B.kGR6Lo/BUILD/libjingle-0.6.14/talk/base'
/bin/sh ../../libtool --silent  --tag=CXX   --mode=compile i686-pld-linux-g++ -DHAVE_CONFIG_H -I. -I../..    -DPOSIX -DLINUX -DFEATURE_ENABLE_VOICEMAIL   -O2 -fwrapv -pipe -Wformat -Werror=format-security -gdwarf-4 -fno-debug-types-section -fvar-tracking-assignments -g2 -Wp,-D_FORTIFY_SOURCE=2 -fstack-protector-strong --param=ssp-buffer-size=4 -fomit-frame-pointer -march=i686 -fasynchronous-unwind-tables -mtune=pentium4 -gdwarf-4 -fno-debug-types-section -fvar-tracking-assignments -g2  -MT helpers.lo -MD -MP -MF .deps/helpers.Tpo -c -o helpers.lo helpers.cc
mv -f .deps/helpers.Tpo .deps/helpers.Plo
make[3]: Leaving directory '/tmp/B.kGR6Lo/BUILD/libjingle-0.6.14/talk/base'
make[3]: Entering directory '/tmp/B.kGR6Lo/BUILD/libjingle-0.6.14/talk/base'
/bin/sh ../../libtool --silent  --tag=CXX   --mode=compile i686-pld-linux-g++ -DHAVE_CONFIG_H -I. -I../..    -DPOSIX -DLINUX -DFEATURE_ENABLE_VOICEMAIL   -O2 -fwrapv -pipe -Wformat -Werror=format-security -gdwarf-4 -fno-debug-types-section -fvar-tracking-assignments -g2 -Wp,-D_FORTIFY_SOURCE=2 -fstack-protector-strong --param=ssp-buffer-size=4 -fomit-frame-pointer -march=i686 -fasynchronous-unwind-tables -mtune=pentium4 -gdwarf-4 -fno-debug-types-section -fvar-tracking-assignments -g2  -MT fileutils.lo -MD -MP -MF .deps/fileutils.Tpo -c -o fileutils.lo fileutils.cc
mv -f .deps/fileutils.Tpo .deps/fileutils.Plo
make[3]: Leaving directory '/tmp/B.kGR6Lo/BUILD/libjingle-0.6.14/talk/base'
make[3]: Entering directory '/tmp/B.kGR6Lo/BUILD/libjingle-0.6.14/talk/base'
/bin/sh ../../libtool --silent  --tag=CXX   --mode=compile i686-pld-linux-g++ -DHAVE_CONFIG_H -I. -I../..    -DPOSIX -DLINUX -DFEATURE_ENABLE_VOICEMAIL   -O2 -fwrapv -pipe -Wformat -Werror=format-security -gdwarf-4 -fno-debug-types-section -fvar-tracking-assignments -g2 -Wp,-D_FORTIFY_SOURCE=2 -fstack-protector-strong --param=ssp-buffer-size=4 -fomit-frame-pointer -march=i686 -fasynchronous-unwind-tables -mtune=pentium4 -gdwarf-4 -fno-debug-types-section -fvar-tracking-assignments -g2  -MT diskcache.lo -MD -MP -MF .deps/diskcache.Tpo -c -o diskcache.lo diskcache.cc
mv -f .deps/diskcache.Tpo .deps/diskcache.Plo
make[3]: Leaving directory '/tmp/B.kGR6Lo/BUILD/libjingle-0.6.14/talk/base'
make[3]: Entering directory '/tmp/B.kGR6Lo/BUILD/libjingle-0.6.14/talk/base'
/bin/sh ../../libtool --silent  --tag=CXX   --mode=compile i686-pld-linux-g++ -DHAVE_CONFIG_H -I. -I../..    -DPOSIX -DLINUX -DFEATURE_ENABLE_VOICEMAIL   -O2 -fwrapv -pipe -Wformat -Werror=format-security -gdwarf-4 -fno-debug-types-section -fvar-tracking-assignments -g2 -Wp,-D_FORTIFY_SOURCE=2 -fstack-protector-strong --param=ssp-buffer-size=4 -fomit-frame-pointer -march=i686 -fasynchronous-unwind-tables -mtune=pentium4 -gdwarf-4 -fno-debug-types-section -fvar-tracking-assignments -g2  -MT cpumonitor.lo -MD -MP -MF .deps/cpumonitor.Tpo -c -o cpumonitor.lo cpumonitor.cc
mv -f .deps/cpumonitor.Tpo .deps/cpumonitor.Plo
make[3]: Leaving directory '/tmp/B.kGR6Lo/BUILD/libjingle-0.6.14/talk/base'
make[3]: Entering directory '/tmp/B.kGR6Lo/BUILD/libjingle-0.6.14/talk/base'
/bin/sh ../../libtool --silent  --tag=CXX   --mode=compile i686-pld-linux-g++ -DHAVE_CONFIG_H -I. -I../..    -DPOSIX -DLINUX -DFEATURE_ENABLE_VOICEMAIL   -O2 -fwrapv -pipe -Wformat -Werror=format-security -gdwarf-4 -fno-debug-types-section -fvar-tracking-assignments -g2 -Wp,-D_FORTIFY_SOURCE=2 -fstack-protector-strong --param=ssp-buffer-size=4 -fomit-frame-pointer -march=i686 -fasynchronous-unwind-tables -mtune=pentium4 -gdwarf-4 -fno-debug-types-section -fvar-tracking-assignments -g2  -MT firewallsocketserver.lo -MD -MP -MF .deps/firewallsocketserver.Tpo -c -o firewallsocketserver.lo firewallsocketserver.cc
mv -f .deps/firewallsocketserver.Tpo .deps/firewallsocketserver.Plo
make[3]: Leaving directory '/tmp/B.kGR6Lo/BUILD/libjingle-0.6.14/talk/base'
make[3]: Entering directory '/tmp/B.kGR6Lo/BUILD/libjingle-0.6.14/talk/base'
/bin/sh ../../libtool --silent  --tag=CXX   --mode=compile i686-pld-linux-g++ -DHAVE_CONFIG_H -I. -I../..    -DPOSIX -DLINUX -DFEATURE_ENABLE_VOICEMAIL   -O2 -fwrapv -pipe -Wformat -Werror=format-security -gdwarf-4 -fno-debug-types-section -fvar-tracking-assignments -g2 -Wp,-D_FORTIFY_SOURCE=2 -fstack-protector-strong --param=ssp-buffer-size=4 -fomit-frame-pointer -march=i686 -fasynchronous-unwind-tables -mtune=pentium4 -gdwarf-4 -fno-debug-types-section -fvar-tracking-assignments -g2  -MT latebindingsymboltable.lo -MD -MP -MF .deps/latebindingsymboltable.Tpo -c -o latebindingsymboltable.lo latebindingsymboltable.cc
mv -f .deps/latebindingsymboltable.Tpo .deps/latebindingsymboltable.Plo
make[3]: Leaving directory '/tmp/B.kGR6Lo/BUILD/libjingle-0.6.14/talk/base'
make[3]: Entering directory '/tmp/B.kGR6Lo/BUILD/libjingle-0.6.14/talk/base'
/bin/sh ../../libtool --silent  --tag=CXX   --mode=compile i686-pld-linux-g++ -DHAVE_CONFIG_H -I. -I../..    -DPOSIX -DLINUX -DFEATURE_ENABLE_VOICEMAIL   -O2 -fwrapv -pipe -Wformat -Werror=format-security -gdwarf-4 -fno-debug-types-section -fvar-tracking-assignments -g2 -Wp,-D_FORTIFY_SOURCE=2 -fstack-protector-strong --param=ssp-buffer-size=4 -fomit-frame-pointer -march=i686 -fasynchronous-unwind-tables -mtune=pentium4 -gdwarf-4 -fno-debug-types-section -fvar-tracking-assignments -g2  -MT libdbusglibsymboltable.lo -MD -MP -MF .deps/libdbusglibsymboltable.Tpo -c -o libdbusglibsymboltable.lo libdbusglibsymboltable.cc
mv -f .deps/libdbusglibsymboltable.Tpo .deps/libdbusglibsymboltable.Plo
make[3]: Leaving directory '/tmp/B.kGR6Lo/BUILD/libjingle-0.6.14/talk/base'
make[3]: Entering directory '/tmp/B.kGR6Lo/BUILD/libjingle-0.6.14/talk/base'
/bin/sh ../../libtool --silent  --tag=CXX   --mode=compile i686-pld-linux-g++ -DHAVE_CONFIG_H -I. -I../..    -DPOSIX -DLINUX -DFEATURE_ENABLE_VOICEMAIL   -O2 -fwrapv -pipe -Wformat -Werror=format-security -gdwarf-4 -fno-debug-types-section -fvar-tracking-assignments -g2 -Wp,-D_FORTIFY_SOURCE=2 -fstack-protector-strong --param=ssp-buffer-size=4 -fomit-frame-pointer -march=i686 -fasynchronous-unwind-tables -mtune=pentium4 -gdwarf-4 -fno-debug-types-section -fvar-tracking-assignments -g2  -MT ipaddress.lo -MD -MP -MF .deps/ipaddress.Tpo -c -o ipaddress.lo ipaddress.cc
mv -f .deps/ipaddress.Tpo .deps/ipaddress.Plo
make[3]: Leaving directory '/tmp/B.kGR6Lo/BUILD/libjingle-0.6.14/talk/base'
make[3]: Entering directory '/tmp/B.kGR6Lo/BUILD/libjingle-0.6.14/talk/base'
/bin/sh ../../libtool --silent  --tag=CC   --mode=compile i686-pld-linux-gcc -DHAVE_CONFIG_H -I. -I../..     -O2 -fwrapv -pipe -Wformat -Werror=format-security -gdwarf-4 -fno-debug-types-section -fvar-tracking-assignments -g2 -Wp,-D_FORTIFY_SOURCE=2 -fstack-protector-strong --param=ssp-buffer-size=4 -fomit-frame-pointer -march=i686 -fasynchronous-unwind-tables -mtune=pentium4 -gdwarf-4 -fno-debug-types-section -fvar-tracking-assignments -g2  -MT linuxfdwalk.lo -MD -MP -MF .deps/linuxfdwalk.Tpo -c -o linuxfdwalk.lo linuxfdwalk.c
mv -f .deps/linuxfdwalk.Tpo .deps/linuxfdwalk.Plo
make[3]: Leaving directory '/tmp/B.kGR6Lo/BUILD/libjingle-0.6.14/talk/base'
make[3]: Entering directory '/tmp/B.kGR6Lo/BUILD/libjingle-0.6.14/talk/base'
/bin/sh ../../libtool --silent  --tag=CC   --mode=compile i686-pld-linux-gcc -DHAVE_CONFIG_H -I. -I../..     -O2 -fwrapv -pipe -Wformat -Werror=format-security -gdwarf-4 -fno-debug-types-section -fvar-tracking-assignments -g2 -Wp,-D_FORTIFY_SOURCE=2 -fstack-protector-strong --param=ssp-buffer-size=4 -fomit-frame-pointer -march=i686 -fasynchronous-unwind-tables -mtune=pentium4 -gdwarf-4 -fno-debug-types-section -fvar-tracking-assignments -g2  -MT md5c.lo -MD -MP -MF .deps/md5c.Tpo -c -o md5c.lo md5c.c
mv -f .deps/md5c.Tpo .deps/md5c.Plo
make[3]: Leaving directory '/tmp/B.kGR6Lo/BUILD/libjingle-0.6.14/talk/base'
make[3]: Entering directory '/tmp/B.kGR6Lo/BUILD/libjingle-0.6.14/talk/base'
/bin/sh ../../libtool --silent  --tag=CXX   --mode=compile i686-pld-linux-g++ -DHAVE_CONFIG_H -I. -I../..    -DPOSIX -DLINUX -DFEATURE_ENABLE_VOICEMAIL   -O2 -fwrapv -pipe -Wformat -Werror=format-security -gdwarf-4 -fno-debug-types-section -fvar-tracking-assignments -g2 -Wp,-D_FORTIFY_SOURCE=2 -fstack-protector-strong --param=ssp-buffer-size=4 -fomit-frame-pointer -march=i686 -fasynchronous-unwind-tables -mtune=pentium4 -gdwarf-4 -fno-debug-types-section -fvar-tracking-assignments -g2  -MT httpbase.lo -MD -MP -MF .deps/httpbase.Tpo -c -o httpbase.lo httpbase.cc
mv -f .deps/httpbase.Tpo .deps/httpbase.Plo
make[3]: Leaving directory '/tmp/B.kGR6Lo/BUILD/libjingle-0.6.14/talk/base'
make[3]: Entering directory '/tmp/B.kGR6Lo/BUILD/libjingle-0.6.14/talk/base'
/bin/sh ../../libtool --silent  --tag=CXX   --mode=compile i686-pld-linux-g++ -DHAVE_CONFIG_H -I. -I../..    -DPOSIX -DLINUX -DFEATURE_ENABLE_VOICEMAIL   -O2 -fwrapv -pipe -Wformat -Werror=format-security -gdwarf-4 -fno-debug-types-section -fvar-tracking-assignments -g2 -Wp,-D_FORTIFY_SOURCE=2 -fstack-protector-strong --param=ssp-buffer-size=4 -fomit-frame-pointer -march=i686 -fasynchronous-unwind-tables -mtune=pentium4 -gdwarf-4 -fno-debug-types-section -fvar-tracking-assignments -g2  -MT httprequest.lo -MD -MP -MF .deps/httprequest.Tpo -c -o httprequest.lo httprequest.cc
mv -f .deps/httprequest.Tpo .deps/httprequest.Plo
make[3]: Leaving directory '/tmp/B.kGR6Lo/BUILD/libjingle-0.6.14/talk/base'
make[3]: Entering directory '/tmp/B.kGR6Lo/BUILD/libjingle-0.6.14/talk/base'
/bin/sh ../../libtool --silent  --tag=CXX   --mode=compile i686-pld-linux-g++ -DHAVE_CONFIG_H -I. -I../..    -DPOSIX -DLINUX -DFEATURE_ENABLE_VOICEMAIL   -O2 -fwrapv -pipe -Wformat -Werror=format-security -gdwarf-4 -fno-debug-types-section -fvar-tracking-assignments -g2 -Wp,-D_FORTIFY_SOURCE=2 -fstack-protector-strong --param=ssp-buffer-size=4 -fomit-frame-pointer -march=i686 -fasynchronous-unwind-tables -mtune=pentium4 -gdwarf-4 -fno-debug-types-section -fvar-tracking-assignments -g2  -MT messagehandler.lo -MD -MP -MF .deps/messagehandler.Tpo -c -o messagehandler.lo messagehandler.cc
mv -f .deps/messagehandler.Tpo .deps/messagehandler.Plo
make[3]: Leaving directory '/tmp/B.kGR6Lo/BUILD/libjingle-0.6.14/talk/base'
make[3]: Entering directory '/tmp/B.kGR6Lo/BUILD/libjingle-0.6.14/talk/base'
/bin/sh ../../libtool --silent  --tag=CXX   --mode=compile i686-pld-linux-g++ -DHAVE_CONFIG_H -I. -I../..    -DPOSIX -DLINUX -DFEATURE_ENABLE_VOICEMAIL   -O2 -fwrapv -pipe -Wformat -Werror=format-security -gdwarf-4 -fno-debug-types-section -fvar-tracking-assignments -g2 -Wp,-D_FORTIFY_SOURCE=2 -fstack-protector-strong --param=ssp-buffer-size=4 -fomit-frame-pointer -march=i686 -fasynchronous-unwind-tables -mtune=pentium4 -gdwarf-4 -fno-debug-types-section -fvar-tracking-assignments -g2  -MT logging.lo -MD -MP -MF .deps/logging.Tpo -c -o logging.lo logging.cc
mv -f .deps/logging.Tpo .deps/logging.Plo
make[3]: Leaving directory '/tmp/B.kGR6Lo/BUILD/libjingle-0.6.14/talk/base'
make[3]: Entering directory '/tmp/B.kGR6Lo/BUILD/libjingle-0.6.14/talk/base'
/bin/sh ../../libtool --silent  --tag=CXX   --mode=compile i686-pld-linux-g++ -DHAVE_CONFIG_H -I. -I../..    -DPOSIX -DLINUX -DFEATURE_ENABLE_VOICEMAIL   -O2 -fwrapv -pipe -Wformat -Werror=format-security -gdwarf-4 -fno-debug-types-section -fvar-tracking-assignments -g2 -Wp,-D_FORTIFY_SOURCE=2 -fstack-protector-strong --param=ssp-buffer-size=4 -fomit-frame-pointer -march=i686 -fasynchronous-unwind-tables -mtune=pentium4 -gdwarf-4 -fno-debug-types-section -fvar-tracking-assignments -g2  -MT linux.lo -MD -MP -MF .deps/linux.Tpo -c -o linux.lo linux.cc
mv -f .deps/linux.Tpo .deps/linux.Plo
make[3]: Leaving directory '/tmp/B.kGR6Lo/BUILD/libjingle-0.6.14/talk/base'
make[3]: Entering directory '/tmp/B.kGR6Lo/BUILD/libjingle-0.6.14/talk/base'
/bin/sh ../../libtool --silent  --tag=CXX   --mode=compile i686-pld-linux-g++ -DHAVE_CONFIG_H -I. -I../..    -DPOSIX -DLINUX -DFEATURE_ENABLE_VOICEMAIL   -O2 -fwrapv -pipe -Wformat -Werror=format-security -gdwarf-4 -fno-debug-types-section -fvar-tracking-assignments -g2 -Wp,-D_FORTIFY_SOURCE=2 -fstack-protector-strong --param=ssp-buffer-size=4 -fomit-frame-pointer -march=i686 -fasynchronous-unwind-tables -mtune=pentium4 -gdwarf-4 -fno-debug-types-section -fvar-tracking-assignments -g2  -MT linuxwindowpicker.lo -MD -MP -MF .deps/linuxwindowpicker.Tpo -c -o linuxwindowpicker.lo linuxwindowpicker.cc
mv -f .deps/linuxwindowpicker.Tpo .deps/linuxwindowpicker.Plo
make[3]: Leaving directory '/tmp/B.kGR6Lo/BUILD/libjingle-0.6.14/talk/base'
make[3]: Entering directory '/tmp/B.kGR6Lo/BUILD/libjingle-0.6.14/talk/base'
/bin/sh ../../libtool --silent  --tag=CXX   --mode=compile i686-pld-linux-g++ -DHAVE_CONFIG_H -I. -I../..    -DPOSIX -DLINUX -DFEATURE_ENABLE_VOICEMAIL   -O2 -fwrapv -pipe -Wformat -Werror=format-security -gdwarf-4 -fno-debug-types-section -fvar-tracking-assignments -g2 -Wp,-D_FORTIFY_SOURCE=2 -fstack-protector-strong --param=ssp-buffer-size=4 -fomit-frame-pointer -march=i686 -fasynchronous-unwind-tables -mtune=pentium4 -gdwarf-4 -fno-debug-types-section -fvar-tracking-assignments -g2  -MT nattypes.lo -MD -MP -MF .deps/nattypes.Tpo -c -o nattypes.lo nattypes.cc
mv -f .deps/nattypes.Tpo .deps/nattypes.Plo
make[3]: Leaving directory '/tmp/B.kGR6Lo/BUILD/libjingle-0.6.14/talk/base'
make[3]: Entering directory '/tmp/B.kGR6Lo/BUILD/libjingle-0.6.14/talk/base'
/bin/sh ../../libtool --silent  --tag=CXX   --mode=compile i686-pld-linux-g++ -DHAVE_CONFIG_H -I. -I../..    -DPOSIX -DLINUX -DFEATURE_ENABLE_VOICEMAIL   -O2 -fwrapv -pipe -Wformat -Werror=format-security -gdwarf-4 -fno-debug-types-section -fvar-tracking-assignments -g2 -Wp,-D_FORTIFY_SOURCE=2 -fstack-protector-strong --param=ssp-buffer-size=4 -fomit-frame-pointer -march=i686 -fasynchronous-unwind-tables -mtune=pentium4 -gdwarf-4 -fno-debug-types-section -fvar-tracking-assignments -g2  -MT httpserver.lo -MD -MP -MF .deps/httpserver.Tpo -c -o httpserver.lo httpserver.cc
mv -f .deps/httpserver.Tpo .deps/httpserver.Plo
make[3]: Leaving directory '/tmp/B.kGR6Lo/BUILD/libjingle-0.6.14/talk/base'
make[3]: Entering directory '/tmp/B.kGR6Lo/BUILD/libjingle-0.6.14/talk/base'
/bin/sh ../../libtool --silent  --tag=CXX   --mode=compile i686-pld-linux-g++ -DHAVE_CONFIG_H -I. -I../..    -DPOSIX -DLINUX -DFEATURE_ENABLE_VOICEMAIL   -O2 -fwrapv -pipe -Wformat -Werror=format-security -gdwarf-4 -fno-debug-types-section -fvar-tracking-assignments -g2 -Wp,-D_FORTIFY_SOURCE=2 -fstack-protector-strong --param=ssp-buffer-size=4 -fomit-frame-pointer -march=i686 -fasynchronous-unwind-tables -mtune=pentium4 -gdwarf-4 -fno-debug-types-section -fvar-tracking-assignments -g2  -MT httpcommon.lo -MD -MP -MF .deps/httpcommon.Tpo -c -o httpcommon.lo httpcommon.cc
mv -f .deps/httpcommon.Tpo .deps/httpcommon.Plo
make[3]: Leaving directory '/tmp/B.kGR6Lo/BUILD/libjingle-0.6.14/talk/base'
make[3]: Entering directory '/tmp/B.kGR6Lo/BUILD/libjingle-0.6.14/talk/base'
/bin/sh ../../libtool --silent  --tag=CXX   --mode=compile i686-pld-linux-g++ -DHAVE_CONFIG_H -I. -I../..    -DPOSIX -DLINUX -DFEATURE_ENABLE_VOICEMAIL   -O2 -fwrapv -pipe -Wformat -Werror=format-security -gdwarf-4 -fno-debug-types-section -fvar-tracking-assignments -g2 -Wp,-D_FORTIFY_SOURCE=2 -fstack-protector-strong --param=ssp-buffer-size=4 -fomit-frame-pointer -march=i686 -fasynchronous-unwind-tables -mtune=pentium4 -gdwarf-4 -fno-debug-types-section -fvar-tracking-assignments -g2  -MT httpclient.lo -MD -MP -MF .deps/httpclient.Tpo -c -o httpclient.lo httpclient.cc
mv -f .deps/httpclient.Tpo .deps/httpclient.Plo
make[3]: Leaving directory '/tmp/B.kGR6Lo/BUILD/libjingle-0.6.14/talk/base'
make[3]: Entering directory '/tmp/B.kGR6Lo/BUILD/libjingle-0.6.14/talk/base'
/bin/sh ../../libtool --silent  --tag=CXX   --mode=compile i686-pld-linux-g++ -DHAVE_CONFIG_H -I. -I../..    -DPOSIX -DLINUX -DFEATURE_ENABLE_VOICEMAIL   -O2 -fwrapv -pipe -Wformat -Werror=format-security -gdwarf-4 -fno-debug-types-section -fvar-tracking-assignments -g2 -Wp,-D_FORTIFY_SOURCE=2 -fstack-protector-strong --param=ssp-buffer-size=4 -fomit-frame-pointer -march=i686 -fasynchronous-unwind-tables -mtune=pentium4 -gdwarf-4 -fno-debug-types-section -fvar-tracking-assignments -g2  -MT messagequeue.lo -MD -MP -MF .deps/messagequeue.Tpo -c -o messagequeue.lo messagequeue.cc
mv -f .deps/messagequeue.Tpo .deps/messagequeue.Plo
make[3]: Leaving directory '/tmp/B.kGR6Lo/BUILD/libjingle-0.6.14/talk/base'
make[3]: Entering directory '/tmp/B.kGR6Lo/BUILD/libjingle-0.6.14/talk/base'
/bin/sh ../../libtool --silent  --tag=CXX   --mode=compile i686-pld-linux-g++ -DHAVE_CONFIG_H -I. -I../..    -DPOSIX -DLINUX -DFEATURE_ENABLE_VOICEMAIL   -O2 -fwrapv -pipe -Wformat -Werror=format-security -gdwarf-4 -fno-debug-types-section -fvar-tracking-assignments -g2 -Wp,-D_FORTIFY_SOURCE=2 -fstack-protector-strong --param=ssp-buffer-size=4 -fomit-frame-pointer -march=i686 -fasynchronous-unwind-tables -mtune=pentium4 -gdwarf-4 -fno-debug-types-section -fvar-tracking-assignments -g2  -MT opensslidentity.lo -MD -MP -MF .deps/opensslidentity.Tpo -c -o opensslidentity.lo opensslidentity.cc
opensslidentity.cc: In member function 'void talk_base::OpenSSLKeyPair::AddReference()':
opensslidentity.cc:171:20: error: invalid use of incomplete type 'EVP_PKEY' {aka 'struct evp_pkey_st'}
   CRYPTO_add(&pkey_->references, 1, CRYPTO_LOCK_EVP_PKEY);
                    ^~
In file included from /usr/include/openssl/evp.h:14,
                 from ../../talk/base/opensslidentity.h:31,
                 from opensslidentity.cc:28:
/usr/include/openssl/ossl_typ.h:93:16: note: forward declaration of 'EVP_PKEY' {aka 'struct evp_pkey_st'}
 typedef struct evp_pkey_st EVP_PKEY;
                ^~~~~~~~~~~
opensslidentity.cc:171:37: error: 'CRYPTO_LOCK_EVP_PKEY' was not declared in this scope
   CRYPTO_add(&pkey_->references, 1, CRYPTO_LOCK_EVP_PKEY);
                                     ^~~~~~~~~~~~~~~~~~~~
opensslidentity.cc:171:37: note: suggested alternative: 'CRYPTO_LOCK'
   CRYPTO_add(&pkey_->references, 1, CRYPTO_LOCK_EVP_PKEY);
                                     ^~~~~~~~~~~~~~~~~~~~
                                     CRYPTO_LOCK
opensslidentity.cc:171:3: error: 'CRYPTO_add' was not declared in this scope
   CRYPTO_add(&pkey_->references, 1, CRYPTO_LOCK_EVP_PKEY);
   ^~~~~~~~~~
opensslidentity.cc:171:3: note: suggested alternative: 'CRYPTO_ONCE'
   CRYPTO_add(&pkey_->references, 1, CRYPTO_LOCK_EVP_PKEY);
   ^~~~~~~~~~
   CRYPTO_ONCE
opensslidentity.cc: In member function 'void talk_base::OpenSSLCertificate::AddReference()':
opensslidentity.cc:317:20: error: invalid use of incomplete type 'X509' {aka 'struct x509_st'}
   CRYPTO_add(&x509_->references, 1, CRYPTO_LOCK_X509);
                    ^~
In file included from /usr/include/openssl/evp.h:14,
                 from ../../talk/base/opensslidentity.h:31,
                 from opensslidentity.cc:28:
/usr/include/openssl/ossl_typ.h:120:16: note: forward declaration of 'X509' {aka 'struct x509_st'}
 typedef struct x509_st X509;
                ^~~~~~~
opensslidentity.cc:317:37: error: 'CRYPTO_LOCK_X509' was not declared in this scope
   CRYPTO_add(&x509_->references, 1, CRYPTO_LOCK_X509);
                                     ^~~~~~~~~~~~~~~~
opensslidentity.cc:317:37: note: suggested alternative: 'CRYPTO_LOCK'
   CRYPTO_add(&x509_->references, 1, CRYPTO_LOCK_X509);
                                     ^~~~~~~~~~~~~~~~
                                     CRYPTO_LOCK
opensslidentity.cc:317:3: error: 'CRYPTO_add' was not declared in this scope
   CRYPTO_add(&x509_->references, 1, CRYPTO_LOCK_X509);
   ^~~~~~~~~~
opensslidentity.cc:317:3: note: suggested alternative: 'CRYPTO_ONCE'
   CRYPTO_add(&x509_->references, 1, CRYPTO_LOCK_X509);
   ^~~~~~~~~~
   CRYPTO_ONCE
make[3]: *** [Makefile:847: opensslidentity.lo] Error 1
make[3]: Leaving directory '/tmp/B.kGR6Lo/BUILD/libjingle-0.6.14/talk/base'
make[3]: *** Waiting for unfinished jobs....
make[3]: Entering directory '/tmp/B.kGR6Lo/BUILD/libjingle-0.6.14/talk/base'
/bin/sh ../../libtool --silent  --tag=CXX   --mode=compile i686-pld-linux-g++ -DHAVE_CONFIG_H -I. -I../..    -DPOSIX -DLINUX -DFEATURE_ENABLE_VOICEMAIL   -O2 -fwrapv -pipe -Wformat -Werror=format-security -gdwarf-4 -fno-debug-types-section -fvar-tracking-assignments -g2 -Wp,-D_FORTIFY_SOURCE=2 -fstack-protector-strong --param=ssp-buffer-size=4 -fomit-frame-pointer -march=i686 -fasynchronous-unwind-tables -mtune=pentium4 -gdwarf-4 -fno-debug-types-section -fvar-tracking-assignments -g2  -MT nethelpers.lo -MD -MP -MF .deps/nethelpers.Tpo -c -o nethelpers.lo nethelpers.cc
mv -f .deps/nethelpers.Tpo .deps/nethelpers.Plo
make[3]: Leaving directory '/tmp/B.kGR6Lo/BUILD/libjingle-0.6.14/talk/base'
make[3]: Entering directory '/tmp/B.kGR6Lo/BUILD/libjingle-0.6.14/talk/base'
/bin/sh ../../libtool --silent  --tag=CXX   --mode=compile i686-pld-linux-g++ -DHAVE_CONFIG_H -I. -I../..    -DPOSIX -DLINUX -DFEATURE_ENABLE_VOICEMAIL   -O2 -fwrapv -pipe -Wformat -Werror=format-security -gdwarf-4 -fno-debug-types-section -fvar-tracking-assignments -g2 -Wp,-D_FORTIFY_SOURCE=2 -fstack-protector-strong --param=ssp-buffer-size=4 -fomit-frame-pointer -march=i686 -fasynchronous-unwind-tables -mtune=pentium4 -gdwarf-4 -fno-debug-types-section -fvar-tracking-assignments -g2  -MT multipart.lo -MD -MP -MF .deps/multipart.Tpo -c -o multipart.lo multipart.cc
mv -f .deps/multipart.Tpo .deps/multipart.Plo
make[3]: Leaving directory '/tmp/B.kGR6Lo/BUILD/libjingle-0.6.14/talk/base'
make[3]: Entering directory '/tmp/B.kGR6Lo/BUILD/libjingle-0.6.14/talk/base'
/bin/sh ../../libtool --silent  --tag=CXX   --mode=compile i686-pld-linux-g++ -DHAVE_CONFIG_H -I. -I../..    -DPOSIX -DLINUX -DFEATURE_ENABLE_VOICEMAIL   -O2 -fwrapv -pipe -Wformat -Werror=format-security -gdwarf-4 -fno-debug-types-section -fvar-tracking-assignments -g2 -Wp,-D_FORTIFY_SOURCE=2 -fstack-protector-strong --param=ssp-buffer-size=4 -fomit-frame-pointer -march=i686 -fasynchronous-unwind-tables -mtune=pentium4 -gdwarf-4 -fno-debug-types-section -fvar-tracking-assignments -g2  -MT openssladapter.lo -MD -MP -MF .deps/openssladapter.Tpo -c -o openssladapter.lo openssladapter.cc
openssladapter.cc:87:19: error: variable 'BIO_METHOD methods_socket' has initializer but incomplete type
 static BIO_METHOD methods_socket = {
                   ^~~~~~~~~~~~~~
openssladapter.cc: In function 'BIO* BIO_new_socket(talk_base::AsyncSocket*)':
openssladapter.cc:107:6: error: invalid use of incomplete type 'BIO' {aka 'struct bio_st'}
   ret->ptr = socket;
      ^~
In file included from /usr/include/openssl/crypto.h:25,
                 from /usr/include/openssl/bio.h:20,
                 from openssladapter.cc:34:
/usr/include/openssl/ossl_typ.h:79:16: note: forward declaration of 'BIO' {aka 'struct bio_st'}
 typedef struct bio_st BIO;
                ^~~~~~
openssladapter.cc: In function 'int socket_new(BIO*)':
openssladapter.cc:112:4: error: invalid use of incomplete type 'BIO' {aka 'struct bio_st'}
   b->shutdown = 0;
    ^~
In file included from /usr/include/openssl/crypto.h:25,
                 from /usr/include/openssl/bio.h:20,
                 from openssladapter.cc:34:
/usr/include/openssl/ossl_typ.h:79:16: note: forward declaration of 'BIO' {aka 'struct bio_st'}
 typedef struct bio_st BIO;
                ^~~~~~
openssladapter.cc:113:4: error: invalid use of incomplete type 'BIO' {aka 'struct bio_st'}
   b->init = 1;
    ^~
In file included from /usr/include/openssl/crypto.h:25,
                 from /usr/include/openssl/bio.h:20,
                 from openssladapter.cc:34:
/usr/include/openssl/ossl_typ.h:79:16: note: forward declaration of 'BIO' {aka 'struct bio_st'}
 typedef struct bio_st BIO;
                ^~~~~~
openssladapter.cc:114:4: error: invalid use of incomplete type 'BIO' {aka 'struct bio_st'}
   b->num = 0; // 1 means socket closed
    ^~
In file included from /usr/include/openssl/crypto.h:25,
                 from /usr/include/openssl/bio.h:20,
                 from openssladapter.cc:34:
/usr/include/openssl/ossl_typ.h:79:16: note: forward declaration of 'BIO' {aka 'struct bio_st'}
 typedef struct bio_st BIO;
                ^~~~~~
openssladapter.cc:115:4: error: invalid use of incomplete type 'BIO' {aka 'struct bio_st'}
   b->ptr = 0;
    ^~
In file included from /usr/include/openssl/crypto.h:25,
                 from /usr/include/openssl/bio.h:20,
                 from openssladapter.cc:34:
/usr/include/openssl/ossl_typ.h:79:16: note: forward declaration of 'BIO' {aka 'struct bio_st'}
 typedef struct bio_st BIO;
                ^~~~~~
openssladapter.cc: In function 'int socket_read(BIO*, char*, int)':
openssladapter.cc:128:74: error: invalid use of incomplete type 'BIO' {aka 'struct bio_st'}
   talk_base::AsyncSocket* socket = static_cast<talk_base::AsyncSocket*>(b->ptr);
                                                                          ^~
In file included from /usr/include/openssl/crypto.h:25,
                 from /usr/include/openssl/bio.h:20,
                 from openssladapter.cc:34:
/usr/include/openssl/ossl_typ.h:79:16: note: forward declaration of 'BIO' {aka 'struct bio_st'}
 typedef struct bio_st BIO;
                ^~~~~~
openssladapter.cc:134:6: error: invalid use of incomplete type 'BIO' {aka 'struct bio_st'}
     b->num = 1;
      ^~
In file included from /usr/include/openssl/crypto.h:25,
                 from /usr/include/openssl/bio.h:20,
                 from openssladapter.cc:34:
/usr/include/openssl/ossl_typ.h:79:16: note: forward declaration of 'BIO' {aka 'struct bio_st'}
 typedef struct bio_st BIO;
                ^~~~~~
openssladapter.cc: In function 'int socket_write(BIO*, const char*, int)':
openssladapter.cc:144:74: error: invalid use of incomplete type 'BIO' {aka 'struct bio_st'}
   talk_base::AsyncSocket* socket = static_cast<talk_base::AsyncSocket*>(b->ptr);
                                                                          ^~
In file included from /usr/include/openssl/crypto.h:25,
                 from /usr/include/openssl/bio.h:20,
                 from openssladapter.cc:34:
/usr/include/openssl/ossl_typ.h:79:16: note: forward declaration of 'BIO' {aka 'struct bio_st'}
 typedef struct bio_st BIO;
                ^~~~~~
openssladapter.cc: In function 'long int socket_ctrl(BIO*, int, long int, void*)':
openssladapter.cc:167:13: error: invalid use of incomplete type 'BIO' {aka 'struct bio_st'}
     return b->num;
             ^~
In file included from /usr/include/openssl/crypto.h:25,
                 from /usr/include/openssl/bio.h:20,
                 from openssladapter.cc:34:
/usr/include/openssl/ossl_typ.h:79:16: note: forward declaration of 'BIO' {aka 'struct bio_st'}
 typedef struct bio_st BIO;
                ^~~~~~
openssladapter.cc: In static member function 'static bool talk_base::OpenSSLAdapter::VerifyServerName(SSL*, const char*, bool)':
openssladapter.cc:699:48: error: invalid use of incomplete type 'X509_EXTENSION' {aka 'struct X509_extension_st'}
       unsigned char* ext_value_data = extension->value->data;
                                                ^~
In file included from /usr/include/openssl/ssl.h:20,
                 from openssladapter.cc:39:
/usr/include/openssl/x509.h:81:16: note: forward declaration of 'X509_EXTENSION' {aka 'struct X509_extension_st'}
 typedef struct X509_extension_st X509_EXTENSION;
                ^~~~~~~~~~~~~~~~~
openssladapter.cc:710:42: error: invalid use of incomplete type 'X509_EXTENSION' {aka 'struct X509_extension_st'}
                                 extension->value->length,
                                          ^~
In file included from /usr/include/openssl/ssl.h:20,
                 from openssladapter.cc:39:
/usr/include/openssl/x509.h:81:16: note: forward declaration of 'X509_EXTENSION' {aka 'struct X509_extension_st'}
 typedef struct X509_extension_st X509_EXTENSION;
                ^~~~~~~~~~~~~~~~~
openssladapter.cc:713:64: error: invalid use of incomplete type 'X509_EXTENSION' {aka 'struct X509_extension_st'}
         ext_str = meth->d2i(NULL, ext_value_data_ptr, extension->value->length);
                                                                ^~
In file included from /usr/include/openssl/ssl.h:20,
                 from openssladapter.cc:39:
/usr/include/openssl/x509.h:81:16: note: forward declaration of 'X509_EXTENSION' {aka 'struct X509_extension_st'}
 typedef struct X509_extension_st X509_EXTENSION;
                ^~~~~~~~~~~~~~~~~
openssladapter.cc: In static member function 'static SSL_CTX* talk_base::OpenSSLAdapter::SetupSSLContext()':
openssladapter.cc:875:50: warning: 'const SSL_METHOD* TLSv1_client_method()' is deprecated [-Wdeprecated-declarations]
   SSL_CTX* ctx = SSL_CTX_new(TLSv1_client_method());
                                                  ^
In file included from /usr/include/openssl/e_os2.h:13,
                 from /usr/include/openssl/bio.h:13,
                 from openssladapter.cc:34:
/usr/include/openssl/ssl.h:1854:1: note: declared here
 DEPRECATEDIN_1_1_0(__owur const SSL_METHOD *TLSv1_client_method(void))
 ^~~~~~~~~~~~~~~~~~
openssladapter.cc:875:50: warning: 'const SSL_METHOD* TLSv1_client_method()' is deprecated [-Wdeprecated-declarations]
   SSL_CTX* ctx = SSL_CTX_new(TLSv1_client_method());
                                                  ^
In file included from /usr/include/openssl/e_os2.h:13,
                 from /usr/include/openssl/bio.h:13,
                 from openssladapter.cc:34:
/usr/include/openssl/ssl.h:1854:1: note: declared here
 DEPRECATEDIN_1_1_0(__owur const SSL_METHOD *TLSv1_client_method(void))
 ^~~~~~~~~~~~~~~~~~
make[3]: *** [Makefile:847: openssladapter.lo] Error 1
make[3]: Leaving directory '/tmp/B.kGR6Lo/BUILD/libjingle-0.6.14/talk/base'
make[3]: Entering directory '/tmp/B.kGR6Lo/BUILD/libjingle-0.6.14/talk/base'
/bin/sh ../../libtool --silent  --tag=CXX   --mode=compile i686-pld-linux-g++ -DHAVE_CONFIG_H -I. -I../..    -DPOSIX -DLINUX -DFEATURE_ENABLE_VOICEMAIL   -O2 -fwrapv -pipe -Wformat -Werror=format-security -gdwarf-4 -fno-debug-types-section -fvar-tracking-assignments -g2 -Wp,-D_FORTIFY_SOURCE=2 -fstack-protector-strong --param=ssp-buffer-size=4 -fomit-frame-pointer -march=i686 -fasynchronous-unwind-tables -mtune=pentium4 -gdwarf-4 -fno-debug-types-section -fvar-tracking-assignments -g2  -MT opensslstreamadapter.lo -MD -MP -MF .deps/opensslstreamadapter.Tpo -c -o opensslstreamadapter.lo opensslstreamadapter.cc
opensslstreamadapter.cc:89:19: error: variable 'BIO_METHOD talk_base::methods_stream' has initializer but incomplete type
 static BIO_METHOD methods_stream = {
                   ^~~~~~~~~~~~~~
opensslstreamadapter.cc: In function 'BIO* talk_base::BIO_new_stream(talk_base::StreamInterface*)':
opensslstreamadapter.cc:108:6: error: invalid use of incomplete type 'BIO' {aka 'struct bio_st'}
   ret->ptr = stream;
      ^~
In file included from /usr/include/openssl/evp.h:14,
                 from ../../talk/base/opensslidentity.h:31,
                 from ../../talk/base/opensslstreamadapter.h:36,
                 from opensslstreamadapter.cc:34:
/usr/include/openssl/ossl_typ.h:79:16: note: forward declaration of 'BIO' {aka 'struct bio_st'}
 typedef struct bio_st BIO;
                ^~~~~~
opensslstreamadapter.cc: In function 'int talk_base::stream_new(BIO*)':
opensslstreamadapter.cc:115:4: error: invalid use of incomplete type 'BIO' {aka 'struct bio_st'}
   b->shutdown = 0;
    ^~
In file included from /usr/include/openssl/evp.h:14,
                 from ../../talk/base/opensslidentity.h:31,
                 from ../../talk/base/opensslstreamadapter.h:36,
                 from opensslstreamadapter.cc:34:
/usr/include/openssl/ossl_typ.h:79:16: note: forward declaration of 'BIO' {aka 'struct bio_st'}
 typedef struct bio_st BIO;
                ^~~~~~
opensslstreamadapter.cc:116:4: error: invalid use of incomplete type 'BIO' {aka 'struct bio_st'}
   b->init = 1;
    ^~
In file included from /usr/include/openssl/evp.h:14,
                 from ../../talk/base/opensslidentity.h:31,
                 from ../../talk/base/opensslstreamadapter.h:36,
                 from opensslstreamadapter.cc:34:
/usr/include/openssl/ossl_typ.h:79:16: note: forward declaration of 'BIO' {aka 'struct bio_st'}
 typedef struct bio_st BIO;
                ^~~~~~
opensslstreamadapter.cc:117:4: error: invalid use of incomplete type 'BIO' {aka 'struct bio_st'}
   b->num = 0;  // 1 means end-of-stream
    ^~
In file included from /usr/include/openssl/evp.h:14,
                 from ../../talk/base/opensslidentity.h:31,
                 from ../../talk/base/opensslstreamadapter.h:36,
                 from opensslstreamadapter.cc:34:
/usr/include/openssl/ossl_typ.h:79:16: note: forward declaration of 'BIO' {aka 'struct bio_st'}
 typedef struct bio_st BIO;
                ^~~~~~
opensslstreamadapter.cc:118:4: error: invalid use of incomplete type 'BIO' {aka 'struct bio_st'}
   b->ptr = 0;
    ^~
In file included from /usr/include/openssl/evp.h:14,
                 from ../../talk/base/opensslidentity.h:31,
                 from ../../talk/base/opensslstreamadapter.h:36,
                 from opensslstreamadapter.cc:34:
/usr/include/openssl/ossl_typ.h:79:16: note: forward declaration of 'BIO' {aka 'struct bio_st'}
 typedef struct bio_st BIO;
                ^~~~~~
opensslstreamadapter.cc: In function 'int talk_base::stream_read(BIO*, char*, int)':
opensslstreamadapter.cc:131:60: error: invalid use of incomplete type 'BIO' {aka 'struct bio_st'}
   StreamInterface* stream = static_cast<StreamInterface*>(b->ptr);
                                                            ^~
In file included from /usr/include/openssl/evp.h:14,
                 from ../../talk/base/opensslidentity.h:31,
                 from ../../talk/base/opensslstreamadapter.h:36,
                 from opensslstreamadapter.cc:34:
/usr/include/openssl/ossl_typ.h:79:16: note: forward declaration of 'BIO' {aka 'struct bio_st'}
 typedef struct bio_st BIO;
                ^~~~~~
opensslstreamadapter.cc:139:6: error: invalid use of incomplete type 'BIO' {aka 'struct bio_st'}
     b->num = 1;
      ^~
In file included from /usr/include/openssl/evp.h:14,
                 from ../../talk/base/opensslidentity.h:31,
                 from ../../talk/base/opensslstreamadapter.h:36,
                 from opensslstreamadapter.cc:34:
/usr/include/openssl/ossl_typ.h:79:16: note: forward declaration of 'BIO' {aka 'struct bio_st'}
 typedef struct bio_st BIO;
                ^~~~~~
opensslstreamadapter.cc: In function 'int talk_base::stream_write(BIO*, const char*, int)':
opensslstreamadapter.cc:149:60: error: invalid use of incomplete type 'BIO' {aka 'struct bio_st'}
   StreamInterface* stream = static_cast<StreamInterface*>(b->ptr);
                                                            ^~
In file included from /usr/include/openssl/evp.h:14,
                 from ../../talk/base/opensslidentity.h:31,
                 from ../../talk/base/opensslstreamadapter.h:36,
                 from opensslstreamadapter.cc:34:
/usr/include/openssl/ossl_typ.h:79:16: note: forward declaration of 'BIO' {aka 'struct bio_st'}
 typedef struct bio_st BIO;
                ^~~~~~
opensslstreamadapter.cc: In function 'long int talk_base::stream_ctrl(BIO*, int, long int, void*)':
opensslstreamadapter.cc:174:15: error: invalid use of incomplete type 'BIO' {aka 'struct bio_st'}
       return b->num;
               ^~
In file included from /usr/include/openssl/evp.h:14,
                 from ../../talk/base/opensslidentity.h:31,
                 from ../../talk/base/opensslstreamadapter.h:36,
                 from opensslstreamadapter.cc:34:
/usr/include/openssl/ossl_typ.h:79:16: note: forward declaration of 'BIO' {aka 'struct bio_st'}
 typedef struct bio_st BIO;
                ^~~~~~
opensslstreamadapter.cc: In member function 'SSL_CTX* talk_base::OpenSSLStreamAdapter::SetupSSLContext()':
opensslstreamadapter.cc:745:30: warning: 'const SSL_METHOD* DTLSv1_client_method()' is deprecated [-Wdeprecated-declarations]
         DTLSv1_client_method() : TLSv1_client_method());
                              ^
In file included from /usr/include/openssl/evp.h:13,
                 from ../../talk/base/opensslidentity.h:31,
                 from ../../talk/base/opensslstreamadapter.h:36,
                 from opensslstreamadapter.cc:34:
/usr/include/openssl/ssl.h:1872:1: note: declared here
 DEPRECATEDIN_1_1_0(__owur const SSL_METHOD *DTLSv1_client_method(void))
 ^~~~~~~~~~~~~~~~~~
opensslstreamadapter.cc:745:30: warning: 'const SSL_METHOD* DTLSv1_client_method()' is deprecated [-Wdeprecated-declarations]
         DTLSv1_client_method() : TLSv1_client_method());
                              ^
In file included from /usr/include/openssl/evp.h:13,
                 from ../../talk/base/opensslidentity.h:31,
                 from ../../talk/base/opensslstreamadapter.h:36,
                 from opensslstreamadapter.cc:34:
/usr/include/openssl/ssl.h:1872:1: note: declared here
 DEPRECATEDIN_1_1_0(__owur const SSL_METHOD *DTLSv1_client_method(void))
 ^~~~~~~~~~~~~~~~~~
opensslstreamadapter.cc:745:54: warning: 'const SSL_METHOD* TLSv1_client_method()' is deprecated [-Wdeprecated-declarations]
         DTLSv1_client_method() : TLSv1_client_method());
                                                      ^
In file included from /usr/include/openssl/evp.h:13,
                 from ../../talk/base/opensslidentity.h:31,
                 from ../../talk/base/opensslstreamadapter.h:36,
                 from opensslstreamadapter.cc:34:
/usr/include/openssl/ssl.h:1854:1: note: declared here
 DEPRECATEDIN_1_1_0(__owur const SSL_METHOD *TLSv1_client_method(void))
 ^~~~~~~~~~~~~~~~~~
opensslstreamadapter.cc:745:54: warning: 'const SSL_METHOD* TLSv1_client_method()' is deprecated [-Wdeprecated-declarations]
         DTLSv1_client_method() : TLSv1_client_method());
                                                      ^
In file included from /usr/include/openssl/evp.h:13,
                 from ../../talk/base/opensslidentity.h:31,
                 from ../../talk/base/opensslstreamadapter.h:36,
                 from opensslstreamadapter.cc:34:
/usr/include/openssl/ssl.h:1854:1: note: declared here
 DEPRECATEDIN_1_1_0(__owur const SSL_METHOD *TLSv1_client_method(void))
 ^~~~~~~~~~~~~~~~~~
opensslstreamadapter.cc:752:30: warning: 'const SSL_METHOD* DTLSv1_server_method()' is deprecated [-Wdeprecated-declarations]
         DTLSv1_server_method() : TLSv1_server_method());
                              ^
In file included from /usr/include/openssl/evp.h:13,
                 from ../../talk/base/opensslidentity.h:31,
                 from ../../talk/base/opensslstreamadapter.h:36,
                 from opensslstreamadapter.cc:34:
/usr/include/openssl/ssl.h:1871:1: note: declared here
 DEPRECATEDIN_1_1_0(__owur const SSL_METHOD *DTLSv1_server_method(void))
 ^~~~~~~~~~~~~~~~~~
opensslstreamadapter.cc:752:30: warning: 'const SSL_METHOD* DTLSv1_server_method()' is deprecated [-Wdeprecated-declarations]
         DTLSv1_server_method() : TLSv1_server_method());
                              ^
In file included from /usr/include/openssl/evp.h:13,
                 from ../../talk/base/opensslidentity.h:31,
                 from ../../talk/base/opensslstreamadapter.h:36,
                 from opensslstreamadapter.cc:34:
/usr/include/openssl/ssl.h:1871:1: note: declared here
 DEPRECATEDIN_1_1_0(__owur const SSL_METHOD *DTLSv1_server_method(void))
 ^~~~~~~~~~~~~~~~~~
opensslstreamadapter.cc:752:54: warning: 'const SSL_METHOD* TLSv1_server_method()' is deprecated [-Wdeprecated-declarations]
         DTLSv1_server_method() : TLSv1_server_method());
                                                      ^
In file included from /usr/include/openssl/evp.h:13,
                 from ../../talk/base/opensslidentity.h:31,
                 from ../../talk/base/opensslstreamadapter.h:36,
                 from opensslstreamadapter.cc:34:
/usr/include/openssl/ssl.h:1853:1: note: declared here
 DEPRECATEDIN_1_1_0(__owur const SSL_METHOD *TLSv1_server_method(void))
 ^~~~~~~~~~~~~~~~~~
opensslstreamadapter.cc:752:54: warning: 'const SSL_METHOD* TLSv1_server_method()' is deprecated [-Wdeprecated-declarations]
         DTLSv1_server_method() : TLSv1_server_method());
                                                      ^
In file included from /usr/include/openssl/evp.h:13,
                 from ../../talk/base/opensslidentity.h:31,
                 from ../../talk/base/opensslstreamadapter.h:36,
                 from opensslstreamadapter.cc:34:
/usr/include/openssl/ssl.h:1853:1: note: declared here
 DEPRECATEDIN_1_1_0(__owur const SSL_METHOD *TLSv1_server_method(void))
 ^~~~~~~~~~~~~~~~~~
make[3]: *** [Makefile:847: opensslstreamadapter.lo] Error 1
make[3]: Leaving directory '/tmp/B.kGR6Lo/BUILD/libjingle-0.6.14/talk/base'
make[3]: Entering directory '/tmp/B.kGR6Lo/BUILD/libjingle-0.6.14/talk/base'
/bin/sh ../../libtool --silent  --tag=CXX   --mode=compile i686-pld-linux-g++ -DHAVE_CONFIG_H -I. -I../..    -DPOSIX -DLINUX -DFEATURE_ENABLE_VOICEMAIL   -O2 -fwrapv -pipe -Wformat -Werror=format-security -gdwarf-4 -fno-debug-types-section -fvar-tracking-assignments -g2 -Wp,-D_FORTIFY_SOURCE=2 -fstack-protector-strong --param=ssp-buffer-size=4 -fomit-frame-pointer -march=i686 -fasynchronous-unwind-tables -mtune=pentium4 -gdwarf-4 -fno-debug-types-section -fvar-tracking-assignments -g2  -MT natserver.lo -MD -MP -MF .deps/natserver.Tpo -c -o natserver.lo natserver.cc
mv -f .deps/natserver.Tpo .deps/natserver.Plo
make[3]: Leaving directory '/tmp/B.kGR6Lo/BUILD/libjingle-0.6.14/talk/base'
make[3]: Entering directory '/tmp/B.kGR6Lo/BUILD/libjingle-0.6.14/talk/base'
/bin/sh ../../libtool --silent  --tag=CXX   --mode=compile i686-pld-linux-g++ -DHAVE_CONFIG_H -I. -I../..    -DPOSIX -DLINUX -DFEATURE_ENABLE_VOICEMAIL   -O2 -fwrapv -pipe -Wformat -Werror=format-security -gdwarf-4 -fno-debug-types-section -fvar-tracking-assignments -g2 -Wp,-D_FORTIFY_SOURCE=2 -fstack-protector-strong --param=ssp-buffer-size=4 -fomit-frame-pointer -march=i686 -fasynchronous-unwind-tables -mtune=pentium4 -gdwarf-4 -fno-debug-types-section -fvar-tracking-assignments -g2  -MT natsocketfactory.lo -MD -MP -MF .deps/natsocketfactory.Tpo -c -o natsocketfactory.lo natsocketfactory.cc
mv -f .deps/natsocketfactory.Tpo .deps/natsocketfactory.Plo
make[3]: Leaving directory '/tmp/B.kGR6Lo/BUILD/libjingle-0.6.14/talk/base'
make[3]: Entering directory '/tmp/B.kGR6Lo/BUILD/libjingle-0.6.14/talk/base'
/bin/sh ../../libtool --silent  --tag=CXX   --mode=compile i686-pld-linux-g++ -DHAVE_CONFIG_H -I. -I../..    -DPOSIX -DLINUX -DFEATURE_ENABLE_VOICEMAIL   -O2 -fwrapv -pipe -Wformat -Werror=format-security -gdwarf-4 -fno-debug-types-section -fvar-tracking-assignments -g2 -Wp,-D_FORTIFY_SOURCE=2 -fstack-protector-strong --param=ssp-buffer-size=4 -fomit-frame-pointer -march=i686 -fasynchronous-unwind-tables -mtune=pentium4 -gdwarf-4 -fno-debug-types-section -fvar-tracking-assignments -g2  -MT optionsfile.lo -MD -MP -MF .deps/optionsfile.Tpo -c -o optionsfile.lo optionsfile.cc
mv -f .deps/optionsfile.Tpo .deps/optionsfile.Plo
make[3]: Leaving directory '/tmp/B.kGR6Lo/BUILD/libjingle-0.6.14/talk/base'
make[3]: Entering directory '/tmp/B.kGR6Lo/BUILD/libjingle-0.6.14/talk/base'
/bin/sh ../../libtool --silent  --tag=CXX   --mode=compile i686-pld-linux-g++ -DHAVE_CONFIG_H -I. -I../..    -DPOSIX -DLINUX -DFEATURE_ENABLE_VOICEMAIL   -O2 -fwrapv -pipe -Wformat -Werror=format-security -gdwarf-4 -fno-debug-types-section -fvar-tracking-assignments -g2 -Wp,-D_FORTIFY_SOURCE=2 -fstack-protector-strong --param=ssp-buffer-size=4 -fomit-frame-pointer -march=i686 -fasynchronous-unwind-tables -mtune=pentium4 -gdwarf-4 -fno-debug-types-section -fvar-tracking-assignments -g2  -MT network.lo -MD -MP -MF .deps/network.Tpo -c -o network.lo network.cc
mv -f .deps/network.Tpo .deps/network.Plo
make[3]: Leaving directory '/tmp/B.kGR6Lo/BUILD/libjingle-0.6.14/talk/base'
make[2]: *** [Makefile:371: all-recursive] Error 1
make[1]: *** [Makefile:470: all-recursive] Error 1
make: *** [Makefile:381: all] Error 2
error: Bad exit status from /tmp/B.kGR6Lo/BUILD/tmp/rpm-tmp.91731 (%build)


RPM build errors:
    Bad exit status from /tmp/B.kGR6Lo/BUILD/tmp/rpm-tmp.91731 (%build)
ended at: Fri Sep 14 20:27:05 2018, done in 0:00:18.190952
error: No files produced.
+ chmod -R u+rwX /tmp/B.kGR6Lo/BUILD
+ rm -rf /tmp/B.kGR6Lo/tmp /tmp/B.kGR6Lo/BUILD
+ rm -rf /tmp/B.kGR6Lo
Begin-PLD-Builder-Info
Build-Time: user:61.21s sys:5.25s real:22.23s (faults io:0 non-io:1449127)

End-PLD-Builder-Info
[Back to list of logs] [View rpm -qa of builder]