FailedOk

th/SRPMS[OK]
th/x32[OK]
th/i686[OK]
th/x86_64[OK]

ac/SRPMS[OK]
ac/i386[OK]
ac/i586[OK]
ac/i686[OK]
ac/alpha[OK]
ac/amd64[OK]
ac/athlon[OK]
ac/ppc[OK]
ac/sparc[OK]
ac/sparc64[OK]

Advanced Search
main()
Powered by PLD Linux
(c) 2002-2019 PLD Team
$Revision: 1.37 $
Powered by foobar.
Your IP: 35.175.191.72

libldm 1513218f-69d9-4ba0-86b4-80a4f0ac5b51

Status:Failed
Source URL:ftp://buildlogs.pld-linux.org/th/i686/FAIL/libldm,1513218f-69d9-4ba0-86b4-80a4f0ac5b51.bz2
text/plain URL:View!
full text:View!
rpm -qa of builder:View!
Date:2019/10/19 14:32:36
Runtime:0:00:12.144086

Toc:

  • error 1
  • ldmtool.c:90:25: error: duplicate 'const' declaration specifier [-Werror=duplicate-decl-specifier]
  • error 2
  • make[2]: *** [Makefile:582: ldmtool-ldmtool.o] Error 1
  • error 3
  • ldm.c:289:13: error: G_ADD_PRIVATE [-Werror]
  • error 4
  • ldm.c:299:5: error: 'g_type_class_add_private' is deprecated [-Werror=deprecated-declarations]
  • error 5
  • ldm.c:395:5: error: 'g_type_class_add_private' is deprecated [-Werror=deprecated-declarations]
  • error 6
  • ldm.c:430:13: error: G_ADD_PRIVATE [-Werror]
  • error 7
  • ldm.c:576:5: error: 'g_type_class_add_private' is deprecated [-Werror=deprecated-declarations]
  • error 8
  • ldm.c:676:13: error: G_ADD_PRIVATE [-Werror]
  • error 9
  • ldm.c:795:5: error: 'g_type_class_add_private' is deprecated [-Werror=deprecated-declarations]
  • error 10
  • ldm.c:845:13: error: G_ADD_PRIVATE [-Werror]
  • error 11
  • ldm.c:947:5: error: 'g_type_class_add_private' is deprecated [-Werror=deprecated-declarations]
  • error 12
  • ldm.c:1061:13: error: G_ADD_PRIVATE [-Werror]
  • error 13
  • ldm.c:2410:40: error: implicit declaration of function 'major' [-Werror=implicit-function-declaration]
  • error 14
  • ldm.c:2410:59: error: implicit declaration of function 'minor'; did you mean 'mincore'? [-Werror=implicit-function-declaration]
  • error 15
  • make[2]: *** [Makefile:575: libldm_1_0_la-ldm.lo] Error 1
  • error 16
  • make[1]: *** [Makefile:498: all-recursive] Error 1
  • error 17
  • error: Bad exit status from /tmp/B.EE71Gd/BUILD/tmp/rpm-tmp.57296 (%build)
  • error 18
  • RPM build errors:
  • error 19
  • error: No files produced.

Content:

checking how to run the C preprocessor... i686-pld-linux-gcc -E
checking for ANSI C header files... yes
checking for sys/types.h... yes
checking for sys/stat.h... yes
checking for stdlib.h... yes
checking for string.h... yes
checking for memory.h... yes
checking for strings.h... yes
checking for inttypes.h... yes
checking for stdint.h... yes
checking for unistd.h... yes
checking for dlfcn.h... yes
checking for objdir... .libs
checking if i686-pld-linux-gcc supports -fno-rtti -fno-exceptions... no
checking for i686-pld-linux-gcc option to produce PIC... -fPIC -DPIC
checking if i686-pld-linux-gcc PIC flag -fPIC -DPIC works... yes
checking if i686-pld-linux-gcc static flag -static works... yes
checking if i686-pld-linux-gcc supports -c -o file.o... yes
checking if i686-pld-linux-gcc supports -c -o file.o... (cached) yes
checking whether the i686-pld-linux-gcc linker (/usr/bin/ld) supports shared libraries... yes
checking whether -lc should be explicitly linked in... no
checking dynamic linker characteristics... GNU/Linux ld.so
checking how to hardcode library paths into programs... immediate
checking whether stripping libraries is possible... yes
checking if libtool supports shared libraries... yes
checking whether to build shared libraries... yes
checking whether to build static libraries... yes
checking for readline in -lreadline... yes
checking for bzero... yes
checking for strerror... yes
checking for stdlib.h... (cached) yes
checking for GNU libc compatible malloc... yes
checking fcntl.h usability... yes
checking fcntl.h presence... yes
checking for fcntl.h... yes
checking for stdint.h... (cached) yes
checking for stdlib.h... (cached) yes
checking for string.h... (cached) yes
checking sys/ioctl.h usability... yes
checking sys/ioctl.h presence... yes
checking for sys/ioctl.h... yes
checking for unistd.h... (cached) yes
checking whether sys/types.h defines makedev... no
checking sys/mkdev.h usability... no
checking sys/mkdev.h presence... no
checking for sys/mkdev.h... no
checking sys/sysmacros.h usability... yes
checking sys/sysmacros.h presence... yes
checking for sys/sysmacros.h... yes
checking for off_t... yes
checking for size_t... yes
checking for ssize_t... yes
checking for uint16_t... yes
checking for uint32_t... yes
checking for uint64_t... yes
checking for uint8_t... yes
checking for i686-pld-linux-pkg-config... no
checking for pkg-config... /usr/bin/pkg-config
checking pkg-config is at least version 0.9.0... yes
checking for gobject-2.0 >= 2.26.0... yes
checking for json-glib-1.0 >= 0.14.0... yes
checking for gio-unix-2.0 >= 2.32.0... yes
checking for zlib >= 1.2.5... yes
checking for uuid >= 2.21.0... yes
checking for devmapper >= 1.0... yes
checking for gtkdoc-check... /usr/bin/gtkdoc-check
checking for gtkdoc-rebase... /usr/bin/gtkdoc-rebase
checking for gtkdoc-mkpdf... /usr/bin/gtkdoc-mkpdf
checking for glib-2.0 >= 2.10.0 gobject-2.0  >= 2.10.0... yes
checking whether to build gtk-doc documentation... yes
checking that generated files are newer than configure... done
configure: creating ./config.status
config.status: creating Makefile
config.status: creating src/Makefile
config.status: creating test/Makefile
config.status: creating docs/reference/libldm/Makefile
config.status: creating docs/reference/ldmtool/Makefile
config.status: creating ldm-1.0.pc
config.status: creating libldm.spec
config.status: creating config.h
config.status: executing depfiles commands
config.status: executing libtool commands
+ /usr/bin/make -Otarget -j9
/usr/bin/make  all-recursive
Making all in src
make[2]: Entering directory '/tmp/B.EE71Gd/BUILD/libldm-0.2.3/src'
/bin/sh ../libtool  --tag=CC   --mode=compile i686-pld-linux-gcc -DHAVE_CONFIG_H -I. -I..    -Wall -Werror -Wshadow -Wextra -Wno-missing-field-initializers -Wno-unused-parameter -I/usr/include/glib-2.0 -I/usr/lib/glib-2.0/include  -I/usr/include/uuid  -O2 -fwrapv -pipe -Wformat -Werror=format-security -gdwarf-4 -fno-debug-types-section -fvar-tracking-assignments -g2 -Wp,-D_FORTIFY_SOURCE=2 -fstack-protector-strong --param=ssp-buffer-size=4 -Werror=trampolines -fomit-frame-pointer -march=i686 -fasynchronous-unwind-tables -mtune=pentium4 -gdwarf-4 -fno-debug-types-section -fvar-tracking-assignments -g2  -MT libldm_1_0_la-mbr.lo -MD -MP -MF .deps/libldm_1_0_la-mbr.Tpo -c -o libldm_1_0_la-mbr.lo `test -f 'mbr.c' || echo './'`mbr.c
libtool: compile:  i686-pld-linux-gcc -DHAVE_CONFIG_H -I. -I.. -Wall -Werror -Wshadow -Wextra -Wno-missing-field-initializers -Wno-unused-parameter -I/usr/include/glib-2.0 -I/usr/lib/glib-2.0/include -I/usr/include/uuid -O2 -fwrapv -pipe -Wformat -Werror=format-security -gdwarf-4 -fno-debug-types-section -fvar-tracking-assignments -g2 -Wp,-D_FORTIFY_SOURCE=2 -fstack-protector-strong --param=ssp-buffer-size=4 -Werror=trampolines -fomit-frame-pointer -march=i686 -fasynchronous-unwind-tables -mtune=pentium4 -gdwarf-4 -fno-debug-types-section -fvar-tracking-assignments -g2 -MT libldm_1_0_la-mbr.lo -MD -MP -MF .deps/libldm_1_0_la-mbr.Tpo -c mbr.c  -fPIC -DPIC -o .libs/libldm_1_0_la-mbr.o
libtool: compile:  i686-pld-linux-gcc -DHAVE_CONFIG_H -I. -I.. -Wall -Werror -Wshadow -Wextra -Wno-missing-field-initializers -Wno-unused-parameter -I/usr/include/glib-2.0 -I/usr/lib/glib-2.0/include -I/usr/include/uuid -O2 -fwrapv -pipe -Wformat -Werror=format-security -gdwarf-4 -fno-debug-types-section -fvar-tracking-assignments -g2 -Wp,-D_FORTIFY_SOURCE=2 -fstack-protector-strong --param=ssp-buffer-size=4 -Werror=trampolines -fomit-frame-pointer -march=i686 -fasynchronous-unwind-tables -mtune=pentium4 -gdwarf-4 -fno-debug-types-section -fvar-tracking-assignments -g2 -MT libldm_1_0_la-mbr.lo -MD -MP -MF .deps/libldm_1_0_la-mbr.Tpo -c mbr.c -o libldm_1_0_la-mbr.o >/dev/null 2>&1
mv -f .deps/libldm_1_0_la-mbr.Tpo .deps/libldm_1_0_la-mbr.Plo
make[2]: Leaving directory '/tmp/B.EE71Gd/BUILD/libldm-0.2.3/src'
make[2]: Entering directory '/tmp/B.EE71Gd/BUILD/libldm-0.2.3/src'
/bin/sh ../libtool  --tag=CC   --mode=compile i686-pld-linux-gcc -DHAVE_CONFIG_H -I. -I..    -Wall -Werror -Wshadow -Wextra -Wno-missing-field-initializers -Wno-unused-parameter -I/usr/include/glib-2.0 -I/usr/lib/glib-2.0/include  -I/usr/include/uuid  -O2 -fwrapv -pipe -Wformat -Werror=format-security -gdwarf-4 -fno-debug-types-section -fvar-tracking-assignments -g2 -Wp,-D_FORTIFY_SOURCE=2 -fstack-protector-strong --param=ssp-buffer-size=4 -Werror=trampolines -fomit-frame-pointer -march=i686 -fasynchronous-unwind-tables -mtune=pentium4 -gdwarf-4 -fno-debug-types-section -fvar-tracking-assignments -g2  -MT libldm_1_0_la-gpt.lo -MD -MP -MF .deps/libldm_1_0_la-gpt.Tpo -c -o libldm_1_0_la-gpt.lo `test -f 'gpt.c' || echo './'`gpt.c
libtool: compile:  i686-pld-linux-gcc -DHAVE_CONFIG_H -I. -I.. -Wall -Werror -Wshadow -Wextra -Wno-missing-field-initializers -Wno-unused-parameter -I/usr/include/glib-2.0 -I/usr/lib/glib-2.0/include -I/usr/include/uuid -O2 -fwrapv -pipe -Wformat -Werror=format-security -gdwarf-4 -fno-debug-types-section -fvar-tracking-assignments -g2 -Wp,-D_FORTIFY_SOURCE=2 -fstack-protector-strong --param=ssp-buffer-size=4 -Werror=trampolines -fomit-frame-pointer -march=i686 -fasynchronous-unwind-tables -mtune=pentium4 -gdwarf-4 -fno-debug-types-section -fvar-tracking-assignments -g2 -MT libldm_1_0_la-gpt.lo -MD -MP -MF .deps/libldm_1_0_la-gpt.Tpo -c gpt.c  -fPIC -DPIC -o .libs/libldm_1_0_la-gpt.o
libtool: compile:  i686-pld-linux-gcc -DHAVE_CONFIG_H -I. -I.. -Wall -Werror -Wshadow -Wextra -Wno-missing-field-initializers -Wno-unused-parameter -I/usr/include/glib-2.0 -I/usr/lib/glib-2.0/include -I/usr/include/uuid -O2 -fwrapv -pipe -Wformat -Werror=format-security -gdwarf-4 -fno-debug-types-section -fvar-tracking-assignments -g2 -Wp,-D_FORTIFY_SOURCE=2 -fstack-protector-strong --param=ssp-buffer-size=4 -Werror=trampolines -fomit-frame-pointer -march=i686 -fasynchronous-unwind-tables -mtune=pentium4 -gdwarf-4 -fno-debug-types-section -fvar-tracking-assignments -g2 -MT libldm_1_0_la-gpt.lo -MD -MP -MF .deps/libldm_1_0_la-gpt.Tpo -c gpt.c -o libldm_1_0_la-gpt.o >/dev/null 2>&1
mv -f .deps/libldm_1_0_la-gpt.Tpo .deps/libldm_1_0_la-gpt.Plo
make[2]: Leaving directory '/tmp/B.EE71Gd/BUILD/libldm-0.2.3/src'
make[2]: Entering directory '/tmp/B.EE71Gd/BUILD/libldm-0.2.3/src'
i686-pld-linux-gcc -DHAVE_CONFIG_H -I. -I..    -Wall -Werror -Wshadow -Wextra -Wno-missing-field-initializers -Wno-unused-parameter -I/usr/include/glib-2.0 -I/usr/lib/glib-2.0/include -pthread -I/usr/include/json-glib-1.0 -I/usr/include/libmount -I/usr/include/blkid -I/usr/include/glib-2.0 -I/usr/lib/glib-2.0/include -pthread -I/usr/include/gio-unix-2.0 -I/usr/include/libmount -I/usr/include/blkid -I/usr/include/glib-2.0 -I/usr/lib/glib-2.0/include -O2 -fwrapv -pipe -Wformat -Werror=format-security -gdwarf-4 -fno-debug-types-section -fvar-tracking-assignments -g2 -Wp,-D_FORTIFY_SOURCE=2 -fstack-protector-strong --param=ssp-buffer-size=4 -Werror=trampolines -fomit-frame-pointer -march=i686 -fasynchronous-unwind-tables -mtune=pentium4 -gdwarf-4 -fno-debug-types-section -fvar-tracking-assignments -g2  -MT ldmtool-ldmtool.o -MD -MP -MF .deps/ldmtool-ldmtool.Tpo -c -o ldmtool-ldmtool.o `test -f 'ldmtool.c' || echo './'`ldmtool.c
ldmtool.c:90:25: error: duplicate 'const' declaration specifier [-Werror=duplicate-decl-specifier]
   90 | static const _command_t const commands[] = {
      |                         ^~~~~
cc1: all warnings being treated as errors
make[2]: *** [Makefile:582: ldmtool-ldmtool.o] Error 1
make[2]: Leaving directory '/tmp/B.EE71Gd/BUILD/libldm-0.2.3/src'
make[2]: *** Waiting for unfinished jobs....
make[2]: Entering directory '/tmp/B.EE71Gd/BUILD/libldm-0.2.3/src'
/bin/sh ../libtool  --tag=CC   --mode=compile i686-pld-linux-gcc -DHAVE_CONFIG_H -I. -I..    -Wall -Werror -Wshadow -Wextra -Wno-missing-field-initializers -Wno-unused-parameter -I/usr/include/glib-2.0 -I/usr/lib/glib-2.0/include  -I/usr/include/uuid  -O2 -fwrapv -pipe -Wformat -Werror=format-security -gdwarf-4 -fno-debug-types-section -fvar-tracking-assignments -g2 -Wp,-D_FORTIFY_SOURCE=2 -fstack-protector-strong --param=ssp-buffer-size=4 -Werror=trampolines -fomit-frame-pointer -march=i686 -fasynchronous-unwind-tables -mtune=pentium4 -gdwarf-4 -fno-debug-types-section -fvar-tracking-assignments -g2  -MT libldm_1_0_la-ldm.lo -MD -MP -MF .deps/libldm_1_0_la-ldm.Tpo -c -o libldm_1_0_la-ldm.lo `test -f 'ldm.c' || echo './'`ldm.c
libtool: compile:  i686-pld-linux-gcc -DHAVE_CONFIG_H -I. -I.. -Wall -Werror -Wshadow -Wextra -Wno-missing-field-initializers -Wno-unused-parameter -I/usr/include/glib-2.0 -I/usr/lib/glib-2.0/include -I/usr/include/uuid -O2 -fwrapv -pipe -Wformat -Werror=format-security -gdwarf-4 -fno-debug-types-section -fvar-tracking-assignments -g2 -Wp,-D_FORTIFY_SOURCE=2 -fstack-protector-strong --param=ssp-buffer-size=4 -Werror=trampolines -fomit-frame-pointer -march=i686 -fasynchronous-unwind-tables -mtune=pentium4 -gdwarf-4 -fno-debug-types-section -fvar-tracking-assignments -g2 -MT libldm_1_0_la-ldm.lo -MD -MP -MF .deps/libldm_1_0_la-ldm.Tpo -c ldm.c  -fPIC -DPIC -o .libs/libldm_1_0_la-ldm.o
ldm.c: In function 'ldm_init':
ldm.c:289:13: error: G_ADD_PRIVATE [-Werror]
  289 |     o->priv = LDM_GET_PRIVATE(o);
      |             ^~~~~~~~~~~~~~~
ldm.c: In function 'ldm_class_init':
ldm.c:299:5: error: 'g_type_class_add_private' is deprecated [-Werror=deprecated-declarations]
  299 |     g_type_class_add_private(klass, sizeof(LDMPrivate));
      |     ^~~~~~~~~~~~~~~~~~~~~~~~
In file included from /usr/include/glib-2.0/gobject/gobject.h:24,
                 from /usr/include/glib-2.0/gobject/gbinding.h:29,
                 from /usr/include/glib-2.0/glib-object.h:23,
                 from ldm.h:21,
                 from ldm.c:39:
/usr/include/glib-2.0/gobject/gtype.h:1308:10: note: declared here
 1308 | void     g_type_class_add_private       (gpointer                    g_class,
      |          ^~~~~~~~~~~~~~~~~~~~~~~~
ldm.c: In function 'ldm_disk_group_class_init':
ldm.c:395:5: error: 'g_type_class_add_private' is deprecated [-Werror=deprecated-declarations]
  395 |     g_type_class_add_private(klass, sizeof(LDMDiskGroupPrivate));
      |     ^~~~~~~~~~~~~~~~~~~~~~~~
In file included from /usr/include/glib-2.0/gobject/gobject.h:24,
                 from /usr/include/glib-2.0/gobject/gbinding.h:29,
                 from /usr/include/glib-2.0/glib-object.h:23,
                 from ldm.h:21,
                 from ldm.c:39:
/usr/include/glib-2.0/gobject/gtype.h:1308:10: note: declared here
 1308 | void     g_type_class_add_private       (gpointer                    g_class,
      |          ^~~~~~~~~~~~~~~~~~~~~~~~
ldm.c: In function 'ldm_disk_group_init':
ldm.c:430:13: error: G_ADD_PRIVATE [-Werror]
  430 |     o->priv = LDM_DISK_GROUP_GET_PRIVATE(o);
      |             ^~~~~~~~~~~~~~~
ldm.c: In function 'ldm_volume_class_init':
ldm.c:576:5: error: 'g_type_class_add_private' is deprecated [-Werror=deprecated-declarations]
  576 |     g_type_class_add_private(klass, sizeof(LDMVolumePrivate));
      |     ^~~~~~~~~~~~~~~~~~~~~~~~
In file included from /usr/include/glib-2.0/gobject/gobject.h:24,
                 from /usr/include/glib-2.0/gobject/gbinding.h:29,
                 from /usr/include/glib-2.0/glib-object.h:23,
                 from ldm.h:21,
                 from ldm.c:39:
/usr/include/glib-2.0/gobject/gtype.h:1308:10: note: declared here
 1308 | void     g_type_class_add_private       (gpointer                    g_class,
      |          ^~~~~~~~~~~~~~~~~~~~~~~~
ldm.c: In function 'ldm_volume_init':
ldm.c:676:13: error: G_ADD_PRIVATE [-Werror]
  676 |     o->priv = LDM_VOLUME_GET_PRIVATE(o);
      |             ^~~~~~~~~~~~~~~
ldm.c: In function 'ldm_partition_class_init':
ldm.c:795:5: error: 'g_type_class_add_private' is deprecated [-Werror=deprecated-declarations]
  795 |     g_type_class_add_private(klass, sizeof(LDMPartitionPrivate));
      |     ^~~~~~~~~~~~~~~~~~~~~~~~
In file included from /usr/include/glib-2.0/gobject/gobject.h:24,
                 from /usr/include/glib-2.0/gobject/gbinding.h:29,
                 from /usr/include/glib-2.0/glib-object.h:23,
                 from ldm.h:21,
                 from ldm.c:39:
/usr/include/glib-2.0/gobject/gtype.h:1308:10: note: declared here
 1308 | void     g_type_class_add_private       (gpointer                    g_class,
      |          ^~~~~~~~~~~~~~~~~~~~~~~~
ldm.c: In function 'ldm_partition_init':
ldm.c:845:13: error: G_ADD_PRIVATE [-Werror]
  845 |     o->priv = LDM_PARTITION_GET_PRIVATE(o);
      |             ^~~~~~~~~~~~~~~
ldm.c: In function 'ldm_disk_class_init':
ldm.c:947:5: error: 'g_type_class_add_private' is deprecated [-Werror=deprecated-declarations]
  947 |     g_type_class_add_private(klass, sizeof(LDMDiskPrivate));
      |     ^~~~~~~~~~~~~~~~~~~~~~~~
In file included from /usr/include/glib-2.0/gobject/gobject.h:24,
                 from /usr/include/glib-2.0/gobject/gbinding.h:29,
                 from /usr/include/glib-2.0/glib-object.h:23,
                 from ldm.h:21,
                 from ldm.c:39:
/usr/include/glib-2.0/gobject/gtype.h:1308:10: note: declared here
 1308 | void     g_type_class_add_private       (gpointer                    g_class,
      |          ^~~~~~~~~~~~~~~~~~~~~~~~
ldm.c: In function 'ldm_disk_init':
ldm.c:1061:13: error: G_ADD_PRIVATE [-Werror]
 1061 |     o->priv = LDM_DISK_GET_PRIVATE(o);
      |             ^~~~~~~~~~~~~~~
ldm.c: In function '_get_device_tree':
ldm.c:2410:40: error: implicit declaration of function 'major' [-Werror=implicit-function-declaration]
 2410 |             if (!dm_tree_add_dev(tree, major(names->dev), minor(names->dev))) {
      |                                        ^~~~~
ldm.c:2410:59: error: implicit declaration of function 'minor'; did you mean 'mincore'? [-Werror=implicit-function-declaration]
 2410 |             if (!dm_tree_add_dev(tree, major(names->dev), minor(names->dev))) {
      |                                                           ^~~~~
      |                                                           mincore
cc1: all warnings being treated as errors
make[2]: *** [Makefile:575: libldm_1_0_la-ldm.lo] Error 1
make[2]: Leaving directory '/tmp/B.EE71Gd/BUILD/libldm-0.2.3/src'
make[1]: *** [Makefile:498: all-recursive] Error 1
make: *** [Makefile:405: all] Error 2
error: Bad exit status from /tmp/B.EE71Gd/BUILD/tmp/rpm-tmp.57296 (%build)


RPM build errors:
    Bad exit status from /tmp/B.EE71Gd/BUILD/tmp/rpm-tmp.57296 (%build)
ended at: Sat Oct 19 14:32:36 2019, done in 0:00:12.144086
error: No files produced.
+ chmod -R u+rwX /tmp/B.EE71Gd/BUILD
+ rm -rf /tmp/B.EE71Gd/tmp /tmp/B.EE71Gd/BUILD
+ rm -rf /tmp/B.EE71Gd
Begin-PLD-Builder-Info
Build-Time: user:11.48s sys:1.06s real:15.26s (faults io:0 non-io:585133)

End-PLD-Builder-Info
[Back to list of logs] [View rpm -qa of builder]