FailedOk

th/SRPMS[OK]
th/x32[OK]
th/i686[OK]
th/x86_64[OK]

ac/SRPMS[OK]
ac/i386[OK]
ac/i586[OK]
ac/i686[OK]
ac/alpha[OK]
ac/amd64[OK]
ac/athlon[OK]
ac/ppc[OK]
ac/sparc[OK]
ac/sparc64[OK]

Advanced Search
main()
Powered by PLD Linux
(c) 2002-2018 PLD Team
$Revision: 1.37 $
Powered by ed.
Your IP: 54.234.228.78

libpng 5c2aaaae-4f5f-4857-9601-9a26c5376ec7

Status:Failed
Source URL:ftp://buildlogs.pld-linux.org/th/i686/FAIL/libpng,5c2aaaae-4f5f-4857-9601-9a26c5376ec7.bz2
text/plain URL:View!
full text:View!
rpm -qa of builder:View!
Date:2018/12/04 11:57:51
Runtime:0:01:10.167589

Toc:

  • error 1
  • FAIL: tests/pngvalid-gamma-sbit
  • error 2
  • FAIL: tests/pngvalid-gamma-background
  • error 3
  • FAIL: tests/pngvalid-gamma-expand16-transform
  • error 4
  • FAIL: tests/pngvalid-gamma-expand16-background
  • error 5
  • FAIL: tests/pngvalid-gamma-transform
  • error 6
  • FAIL: tests/pngvalid-transform
  • error 7
  • FAIL: tests/pngvalid-gamma-expand16-alpha-mode
  • error 8
  • FAIL: tests/pngstest-linear
  • error 9
  • FAIL: tests/pngstest-linear-alpha
  • error 10
  • FAIL: tests/pngstest-none-alpha
  • error 11
  • FAIL: tests/pngstest-none
  • error 12
  • FAIL: tests/pngstest-1.8-alpha
  • error 13
  • FAIL: tests/pngstest-1.8
  • error 14
  • # XFAIL: 0
  • error 15
  • # FAIL: 13
  • error 16
  • # ERROR: 0
  • error 17
  • make[3]: *** [Makefile:1456: test-suite.log] Error 1
  • error 18
  • make[2]: *** [Makefile:1564: check-TESTS] Error 2
  • error 19
  • make[1]: *** [Makefile:1997: check-am] Error 2
  • error 20
  • error: Bad exit status from /tmp/B.Iwvhat/BUILD/tmp/rpm-tmp.85468 (%build)
  • error 21
  • RPM build errors:
  • error 22
  • error: No files produced.

Content:

libtool: compile:  i686-pld-linux-gcc -DHAVE_CONFIG_H -I. -O2 -fwrapv -pipe -Wformat -Werror=format-security -gdwarf-4 -fno-debug-types-section -fvar-tracking-assignments -g2 -Wp,-D_FORTIFY_SOURCE=2 -fstack-protector-strong --param=ssp-buffer-size=4 -fomit-frame-pointer -march=i686 -fasynchronous-unwind-tables -mtune=pentium4 -gdwarf-4 -fno-debug-types-section -fvar-tracking-assignments -g2 -MT pngrutil.lo -MD -MP -MF .deps/pngrutil.Tpo -c pngrutil.c  -fPIC -DPIC -o .libs/pngrutil.o
libtool: compile:  i686-pld-linux-gcc -DHAVE_CONFIG_H -I. -O2 -fwrapv -pipe -Wformat -Werror=format-security -gdwarf-4 -fno-debug-types-section -fvar-tracking-assignments -g2 -Wp,-D_FORTIFY_SOURCE=2 -fstack-protector-strong --param=ssp-buffer-size=4 -fomit-frame-pointer -march=i686 -fasynchronous-unwind-tables -mtune=pentium4 -gdwarf-4 -fno-debug-types-section -fvar-tracking-assignments -g2 -MT pngrutil.lo -MD -MP -MF .deps/pngrutil.Tpo -c pngrutil.c -o pngrutil.o >/dev/null 2>&1
make[1]: Leaving directory '/tmp/B.Iwvhat/BUILD/libpng-1.6.36'
make[1]: Entering directory '/tmp/B.Iwvhat/BUILD/libpng-1.6.36'
depbase=`echo pngrtran.lo | sed 's|[^/]*$|.deps/&|;s|\.lo$||'`;\
/bin/sh ./libtool  --tag=CC   --mode=compile i686-pld-linux-gcc -DHAVE_CONFIG_H -I.     -O2 -fwrapv -pipe -Wformat -Werror=format-security -gdwarf-4 -fno-debug-types-section -fvar-tracking-assignments -g2 -Wp,-D_FORTIFY_SOURCE=2 -fstack-protector-strong --param=ssp-buffer-size=4 -fomit-frame-pointer -march=i686 -fasynchronous-unwind-tables -mtune=pentium4 -gdwarf-4 -fno-debug-types-section -fvar-tracking-assignments -g2  -MT pngrtran.lo -MD -MP -MF $depbase.Tpo -c -o pngrtran.lo pngrtran.c &&\
mv -f $depbase.Tpo $depbase.Plo
libtool: compile:  i686-pld-linux-gcc -DHAVE_CONFIG_H -I. -O2 -fwrapv -pipe -Wformat -Werror=format-security -gdwarf-4 -fno-debug-types-section -fvar-tracking-assignments -g2 -Wp,-D_FORTIFY_SOURCE=2 -fstack-protector-strong --param=ssp-buffer-size=4 -fomit-frame-pointer -march=i686 -fasynchronous-unwind-tables -mtune=pentium4 -gdwarf-4 -fno-debug-types-section -fvar-tracking-assignments -g2 -MT pngrtran.lo -MD -MP -MF .deps/pngrtran.Tpo -c pngrtran.c  -fPIC -DPIC -o .libs/pngrtran.o
libtool: compile:  i686-pld-linux-gcc -DHAVE_CONFIG_H -I. -O2 -fwrapv -pipe -Wformat -Werror=format-security -gdwarf-4 -fno-debug-types-section -fvar-tracking-assignments -g2 -Wp,-D_FORTIFY_SOURCE=2 -fstack-protector-strong --param=ssp-buffer-size=4 -fomit-frame-pointer -march=i686 -fasynchronous-unwind-tables -mtune=pentium4 -gdwarf-4 -fno-debug-types-section -fvar-tracking-assignments -g2 -MT pngrtran.lo -MD -MP -MF .deps/pngrtran.Tpo -c pngrtran.c -o pngrtran.o >/dev/null 2>&1
make[1]: Leaving directory '/tmp/B.Iwvhat/BUILD/libpng-1.6.36'
make[1]: Entering directory '/tmp/B.Iwvhat/BUILD/libpng-1.6.36'
/bin/sh ./libtool  --tag=CC   --mode=link i686-pld-linux-gcc  -O2 -fwrapv -pipe -Wformat -Werror=format-security -gdwarf-4 -fno-debug-types-section -fvar-tracking-assignments -g2 -Wp,-D_FORTIFY_SOURCE=2 -fstack-protector-strong --param=ssp-buffer-size=4 -fomit-frame-pointer -march=i686 -fasynchronous-unwind-tables -mtune=pentium4 -gdwarf-4 -fno-debug-types-section -fvar-tracking-assignments -g2  -no-undefined -export-dynamic -version-number 16:36:0  -Wl,--version-script=libpng.vers  -Wl,--as-needed -Wl,--no-copy-dt-needed-entries -Wl,-z,relro -Wl,-z,combreloc  -o libpng16.la -rpath /usr/lib png.lo pngerror.lo pngget.lo pngmem.lo pngpread.lo pngread.lo pngrio.lo pngrtran.lo pngrutil.lo pngset.lo pngtrans.lo pngwio.lo pngwrite.lo pngwtran.lo pngwutil.lo  mips/mips_init.lo mips/filter_msa_intrinsics.lo intel/intel_init.lo intel/filter_sse2_intrinsics.lo powerpc/powerpc_init.lo powerpc/filter_vsx_intrinsics.lo   -lm -lz -lm 
libtool: link: i686-pld-linux-gcc -shared  -fPIC -DPIC  .libs/png.o .libs/pngerror.o .libs/pngget.o .libs/pngmem.o .libs/pngpread.o .libs/pngread.o .libs/pngrio.o .libs/pngrtran.o .libs/pngrutil.o .libs/pngset.o .libs/pngtrans.o .libs/pngwio.o .libs/pngwrite.o .libs/pngwtran.o .libs/pngwutil.o mips/.libs/mips_init.o mips/.libs/filter_msa_intrinsics.o intel/.libs/intel_init.o intel/.libs/filter_sse2_intrinsics.o powerpc/.libs/powerpc_init.o powerpc/.libs/filter_vsx_intrinsics.o   -lz -lm  -O2 -gdwarf-4 -g2 -fstack-protector-strong -march=i686 -mtune=pentium4 -gdwarf-4 -g2 -Wl,--version-script=libpng.vers -Wl,--as-needed -Wl,--no-copy-dt-needed-entries -Wl,-z -Wl,relro -Wl,-z -Wl,combreloc   -Wl,-soname -Wl,libpng16.so.16 -o .libs/libpng16.so.16.36.0
libtool: link: (cd ".libs" && rm -f "libpng16.so.16" && ln -s "libpng16.so.16.36.0" "libpng16.so.16")
libtool: link: (cd ".libs" && rm -f "libpng16.so" && ln -s "libpng16.so.16.36.0" "libpng16.so")
libtool: link: ar cru .libs/libpng16.a  png.o pngerror.o pngget.o pngmem.o pngpread.o pngread.o pngrio.o pngrtran.o pngrutil.o pngset.o pngtrans.o pngwio.o pngwrite.o pngwtran.o pngwutil.o mips/mips_init.o mips/filter_msa_intrinsics.o intel/intel_init.o intel/filter_sse2_intrinsics.o powerpc/powerpc_init.o powerpc/filter_vsx_intrinsics.o
libtool: link: ranlib .libs/libpng16.a
libtool: link: ( cd ".libs" && rm -f "libpng16.la" && ln -s "../libpng16.la" "libpng16.la" )
make[1]: Leaving directory '/tmp/B.Iwvhat/BUILD/libpng-1.6.36'
make[1]: Entering directory '/tmp/B.Iwvhat/BUILD/libpng-1.6.36'
/bin/sh ./libtool  --tag=CC   --mode=link i686-pld-linux-gcc  -O2 -fwrapv -pipe -Wformat -Werror=format-security -gdwarf-4 -fno-debug-types-section -fvar-tracking-assignments -g2 -Wp,-D_FORTIFY_SOURCE=2 -fstack-protector-strong --param=ssp-buffer-size=4 -fomit-frame-pointer -march=i686 -fasynchronous-unwind-tables -mtune=pentium4 -gdwarf-4 -fno-debug-types-section -fvar-tracking-assignments -g2   -Wl,--as-needed -Wl,--no-copy-dt-needed-entries -Wl,-z,relro -Wl,-z,combreloc  -o timepng contrib/libtests/timepng.o libpng16.la -lm -lz -lm 
libtool: link: i686-pld-linux-gcc -O2 -fwrapv -pipe -Wformat -Werror=format-security -gdwarf-4 -fno-debug-types-section -fvar-tracking-assignments -g2 -Wp,-D_FORTIFY_SOURCE=2 -fstack-protector-strong --param=ssp-buffer-size=4 -fomit-frame-pointer -march=i686 -fasynchronous-unwind-tables -mtune=pentium4 -gdwarf-4 -fno-debug-types-section -fvar-tracking-assignments -g2 -Wl,--as-needed -Wl,--no-copy-dt-needed-entries -Wl,-z -Wl,relro -Wl,-z -Wl,combreloc -o .libs/timepng contrib/libtests/timepng.o  ./.libs/libpng16.so -lz -lm
make[1]: Leaving directory '/tmp/B.Iwvhat/BUILD/libpng-1.6.36'
make[1]: Entering directory '/tmp/B.Iwvhat/BUILD/libpng-1.6.36'
/bin/sh ./libtool  --tag=CC   --mode=link i686-pld-linux-gcc  -O2 -fwrapv -pipe -Wformat -Werror=format-security -gdwarf-4 -fno-debug-types-section -fvar-tracking-assignments -g2 -Wp,-D_FORTIFY_SOURCE=2 -fstack-protector-strong --param=ssp-buffer-size=4 -fomit-frame-pointer -march=i686 -fasynchronous-unwind-tables -mtune=pentium4 -gdwarf-4 -fno-debug-types-section -fvar-tracking-assignments -g2   -Wl,--as-needed -Wl,--no-copy-dt-needed-entries -Wl,-z,relro -Wl,-z,combreloc  -o pngtest pngtest.o libpng16.la -lm -lz -lm 
libtool: link: i686-pld-linux-gcc -O2 -fwrapv -pipe -Wformat -Werror=format-security -gdwarf-4 -fno-debug-types-section -fvar-tracking-assignments -g2 -Wp,-D_FORTIFY_SOURCE=2 -fstack-protector-strong --param=ssp-buffer-size=4 -fomit-frame-pointer -march=i686 -fasynchronous-unwind-tables -mtune=pentium4 -gdwarf-4 -fno-debug-types-section -fvar-tracking-assignments -g2 -Wl,--as-needed -Wl,--no-copy-dt-needed-entries -Wl,-z -Wl,relro -Wl,-z -Wl,combreloc -o .libs/pngtest pngtest.o  ./.libs/libpng16.so -lz -lm
make[1]: Leaving directory '/tmp/B.Iwvhat/BUILD/libpng-1.6.36'
make[1]: Entering directory '/tmp/B.Iwvhat/BUILD/libpng-1.6.36'
/bin/sh ./libtool  --tag=CC   --mode=link i686-pld-linux-gcc  -O2 -fwrapv -pipe -Wformat -Werror=format-security -gdwarf-4 -fno-debug-types-section -fvar-tracking-assignments -g2 -Wp,-D_FORTIFY_SOURCE=2 -fstack-protector-strong --param=ssp-buffer-size=4 -fomit-frame-pointer -march=i686 -fasynchronous-unwind-tables -mtune=pentium4 -gdwarf-4 -fno-debug-types-section -fvar-tracking-assignments -g2   -Wl,--as-needed -Wl,--no-copy-dt-needed-entries -Wl,-z,relro -Wl,-z,combreloc  -o pngunknown contrib/libtests/pngunknown.o libpng16.la -lm -lz -lm 
libtool: link: i686-pld-linux-gcc -O2 -fwrapv -pipe -Wformat -Werror=format-security -gdwarf-4 -fno-debug-types-section -fvar-tracking-assignments -g2 -Wp,-D_FORTIFY_SOURCE=2 -fstack-protector-strong --param=ssp-buffer-size=4 -fomit-frame-pointer -march=i686 -fasynchronous-unwind-tables -mtune=pentium4 -gdwarf-4 -fno-debug-types-section -fvar-tracking-assignments -g2 -Wl,--as-needed -Wl,--no-copy-dt-needed-entries -Wl,-z -Wl,relro -Wl,-z -Wl,combreloc -o .libs/pngunknown contrib/libtests/pngunknown.o  ./.libs/libpng16.so -lz -lm
make[1]: Leaving directory '/tmp/B.Iwvhat/BUILD/libpng-1.6.36'
make[1]: Entering directory '/tmp/B.Iwvhat/BUILD/libpng-1.6.36'
/bin/sh ./libtool  --tag=CC   --mode=link i686-pld-linux-gcc  -O2 -fwrapv -pipe -Wformat -Werror=format-security -gdwarf-4 -fno-debug-types-section -fvar-tracking-assignments -g2 -Wp,-D_FORTIFY_SOURCE=2 -fstack-protector-strong --param=ssp-buffer-size=4 -fomit-frame-pointer -march=i686 -fasynchronous-unwind-tables -mtune=pentium4 -gdwarf-4 -fno-debug-types-section -fvar-tracking-assignments -g2   -Wl,--as-needed -Wl,--no-copy-dt-needed-entries -Wl,-z,relro -Wl,-z,combreloc  -o pngimage contrib/libtests/pngimage.o libpng16.la -lm -lz -lm 
libtool: link: i686-pld-linux-gcc -O2 -fwrapv -pipe -Wformat -Werror=format-security -gdwarf-4 -fno-debug-types-section -fvar-tracking-assignments -g2 -Wp,-D_FORTIFY_SOURCE=2 -fstack-protector-strong --param=ssp-buffer-size=4 -fomit-frame-pointer -march=i686 -fasynchronous-unwind-tables -mtune=pentium4 -gdwarf-4 -fno-debug-types-section -fvar-tracking-assignments -g2 -Wl,--as-needed -Wl,--no-copy-dt-needed-entries -Wl,-z -Wl,relro -Wl,-z -Wl,combreloc -o .libs/pngimage contrib/libtests/pngimage.o  ./.libs/libpng16.so -lz -lm
make[1]: Leaving directory '/tmp/B.Iwvhat/BUILD/libpng-1.6.36'
make[1]: Entering directory '/tmp/B.Iwvhat/BUILD/libpng-1.6.36'
/bin/sh ./libtool  --tag=CC   --mode=link i686-pld-linux-gcc  -O2 -fwrapv -pipe -Wformat -Werror=format-security -gdwarf-4 -fno-debug-types-section -fvar-tracking-assignments -g2 -Wp,-D_FORTIFY_SOURCE=2 -fstack-protector-strong --param=ssp-buffer-size=4 -fomit-frame-pointer -march=i686 -fasynchronous-unwind-tables -mtune=pentium4 -gdwarf-4 -fno-debug-types-section -fvar-tracking-assignments -g2   -Wl,--as-needed -Wl,--no-copy-dt-needed-entries -Wl,-z,relro -Wl,-z,combreloc  -o pngcp contrib/tools/pngcp.o libpng16.la -lm -lz -lm 
libtool: link: i686-pld-linux-gcc -O2 -fwrapv -pipe -Wformat -Werror=format-security -gdwarf-4 -fno-debug-types-section -fvar-tracking-assignments -g2 -Wp,-D_FORTIFY_SOURCE=2 -fstack-protector-strong --param=ssp-buffer-size=4 -fomit-frame-pointer -march=i686 -fasynchronous-unwind-tables -mtune=pentium4 -gdwarf-4 -fno-debug-types-section -fvar-tracking-assignments -g2 -Wl,--as-needed -Wl,--no-copy-dt-needed-entries -Wl,-z -Wl,relro -Wl,-z -Wl,combreloc -o .libs/pngcp contrib/tools/pngcp.o  ./.libs/libpng16.so -lz -lm
make[1]: Leaving directory '/tmp/B.Iwvhat/BUILD/libpng-1.6.36'
make[1]: Entering directory '/tmp/B.Iwvhat/BUILD/libpng-1.6.36'
/bin/sh ./libtool  --tag=CC   --mode=link i686-pld-linux-gcc  -O2 -fwrapv -pipe -Wformat -Werror=format-security -gdwarf-4 -fno-debug-types-section -fvar-tracking-assignments -g2 -Wp,-D_FORTIFY_SOURCE=2 -fstack-protector-strong --param=ssp-buffer-size=4 -fomit-frame-pointer -march=i686 -fasynchronous-unwind-tables -mtune=pentium4 -gdwarf-4 -fno-debug-types-section -fvar-tracking-assignments -g2   -Wl,--as-needed -Wl,--no-copy-dt-needed-entries -Wl,-z,relro -Wl,-z,combreloc  -o pngstest contrib/libtests/pngstest.o libpng16.la -lm -lz -lm 
libtool: link: i686-pld-linux-gcc -O2 -fwrapv -pipe -Wformat -Werror=format-security -gdwarf-4 -fno-debug-types-section -fvar-tracking-assignments -g2 -Wp,-D_FORTIFY_SOURCE=2 -fstack-protector-strong --param=ssp-buffer-size=4 -fomit-frame-pointer -march=i686 -fasynchronous-unwind-tables -mtune=pentium4 -gdwarf-4 -fno-debug-types-section -fvar-tracking-assignments -g2 -Wl,--as-needed -Wl,--no-copy-dt-needed-entries -Wl,-z -Wl,relro -Wl,-z -Wl,combreloc -o .libs/pngstest contrib/libtests/pngstest.o  ./.libs/libpng16.so -lz -lm
make[1]: Leaving directory '/tmp/B.Iwvhat/BUILD/libpng-1.6.36'
make[1]: Entering directory '/tmp/B.Iwvhat/BUILD/libpng-1.6.36'
/bin/sh ./libtool  --tag=CC   --mode=link i686-pld-linux-gcc  -O2 -fwrapv -pipe -Wformat -Werror=format-security -gdwarf-4 -fno-debug-types-section -fvar-tracking-assignments -g2 -Wp,-D_FORTIFY_SOURCE=2 -fstack-protector-strong --param=ssp-buffer-size=4 -fomit-frame-pointer -march=i686 -fasynchronous-unwind-tables -mtune=pentium4 -gdwarf-4 -fno-debug-types-section -fvar-tracking-assignments -g2   -Wl,--as-needed -Wl,--no-copy-dt-needed-entries -Wl,-z,relro -Wl,-z,combreloc  -o pngfix contrib/tools/pngfix.o libpng16.la -lm -lz -lm 
libtool: link: i686-pld-linux-gcc -O2 -fwrapv -pipe -Wformat -Werror=format-security -gdwarf-4 -fno-debug-types-section -fvar-tracking-assignments -g2 -Wp,-D_FORTIFY_SOURCE=2 -fstack-protector-strong --param=ssp-buffer-size=4 -fomit-frame-pointer -march=i686 -fasynchronous-unwind-tables -mtune=pentium4 -gdwarf-4 -fno-debug-types-section -fvar-tracking-assignments -g2 -Wl,--as-needed -Wl,--no-copy-dt-needed-entries -Wl,-z -Wl,relro -Wl,-z -Wl,combreloc -o .libs/pngfix contrib/tools/pngfix.o  ./.libs/libpng16.so -lz -lm
make[1]: Leaving directory '/tmp/B.Iwvhat/BUILD/libpng-1.6.36'
make[1]: Entering directory '/tmp/B.Iwvhat/BUILD/libpng-1.6.36'
depbase=`echo contrib/libtests/pngvalid.o | sed 's|[^/]*$|.deps/&|;s|\.o$||'`;\
i686-pld-linux-gcc -DHAVE_CONFIG_H -I.     -O2 -fwrapv -pipe -Wformat -Werror=format-security -gdwarf-4 -fno-debug-types-section -fvar-tracking-assignments -g2 -Wp,-D_FORTIFY_SOURCE=2 -fstack-protector-strong --param=ssp-buffer-size=4 -fomit-frame-pointer -march=i686 -fasynchronous-unwind-tables -mtune=pentium4 -gdwarf-4 -fno-debug-types-section -fvar-tracking-assignments -g2  -MT contrib/libtests/pngvalid.o -MD -MP -MF $depbase.Tpo -c -o contrib/libtests/pngvalid.o contrib/libtests/pngvalid.c &&\
mv -f $depbase.Tpo $depbase.Po
In file included from /usr/include/signal.h:25,
                 from contrib/libtests/pngvalid.c:26:
/usr/include/features.h:184:3: warning: #warning "_BSD_SOURCE and _SVID_SOURCE are deprecated, use _DEFAULT_SOURCE" [-Wcpp]
 # warning "_BSD_SOURCE and _SVID_SOURCE are deprecated, use _DEFAULT_SOURCE"
   ^~~~~~~
make[1]: Leaving directory '/tmp/B.Iwvhat/BUILD/libpng-1.6.36'
make[1]: Entering directory '/tmp/B.Iwvhat/BUILD/libpng-1.6.36'
/bin/sh ./libtool  --tag=CC   --mode=link i686-pld-linux-gcc  -O2 -fwrapv -pipe -Wformat -Werror=format-security -gdwarf-4 -fno-debug-types-section -fvar-tracking-assignments -g2 -Wp,-D_FORTIFY_SOURCE=2 -fstack-protector-strong --param=ssp-buffer-size=4 -fomit-frame-pointer -march=i686 -fasynchronous-unwind-tables -mtune=pentium4 -gdwarf-4 -fno-debug-types-section -fvar-tracking-assignments -g2   -Wl,--as-needed -Wl,--no-copy-dt-needed-entries -Wl,-z,relro -Wl,-z,combreloc  -o pngvalid contrib/libtests/pngvalid.o libpng16.la -lm -lz -lm 
libtool: link: i686-pld-linux-gcc -O2 -fwrapv -pipe -Wformat -Werror=format-security -gdwarf-4 -fno-debug-types-section -fvar-tracking-assignments -g2 -Wp,-D_FORTIFY_SOURCE=2 -fstack-protector-strong --param=ssp-buffer-size=4 -fomit-frame-pointer -march=i686 -fasynchronous-unwind-tables -mtune=pentium4 -gdwarf-4 -fno-debug-types-section -fvar-tracking-assignments -g2 -Wl,--as-needed -Wl,--no-copy-dt-needed-entries -Wl,-z -Wl,relro -Wl,-z -Wl,combreloc -o .libs/pngvalid contrib/libtests/pngvalid.o  ./.libs/libpng16.so -lz -lm
make[1]: Leaving directory '/tmp/B.Iwvhat/BUILD/libpng-1.6.36'
+ /usr/bin/make -Otarget -j9 -C contrib/pngminus -f makefile.std 'LIBPATH=/usr/lib' 'CC=i686-pld-linux-gcc' 'OPT_FLAGS= -O2 -fwrapv -pipe -Wformat -Werror=format-security -gdwarf-4 -fno-debug-types-section -fvar-tracking-assignments -g2 -Wp,-D_FORTIFY_SOURCE=2 -fstack-protector-strong --param=ssp-buffer-size=4 -fomit-frame-pointer -march=i686 -fasynchronous-unwind-tables -mtune=pentium4 -gdwarf-4 -fno-debug-types-section -fvar-tracking-assignments -g2 '
make: Entering directory '/tmp/B.Iwvhat/BUILD/libpng-1.6.36/contrib/pngminus'
i686-pld-linux-gcc -c -O2 -fwrapv -pipe -Wformat -Werror=format-security -gdwarf-4 -fno-debug-types-section -fvar-tracking-assignments -g2 -Wp,-D_FORTIFY_SOURCE=2 -fstack-protector-strong --param=ssp-buffer-size=4 -fomit-frame-pointer -march=i686 -fasynchronous-unwind-tables -mtune=pentium4 -gdwarf-4 -fno-debug-types-section -fvar-tracking-assignments -g2  -I../..   png2pnm.c
make: Leaving directory '/tmp/B.Iwvhat/BUILD/libpng-1.6.36/contrib/pngminus'
make: Entering directory '/tmp/B.Iwvhat/BUILD/libpng-1.6.36/contrib/pngminus'
i686-pld-linux-gcc -c -O2 -fwrapv -pipe -Wformat -Werror=format-security -gdwarf-4 -fno-debug-types-section -fvar-tracking-assignments -g2 -Wp,-D_FORTIFY_SOURCE=2 -fstack-protector-strong --param=ssp-buffer-size=4 -fomit-frame-pointer -march=i686 -fasynchronous-unwind-tables -mtune=pentium4 -gdwarf-4 -fno-debug-types-section -fvar-tracking-assignments -g2  -I../..   pnm2png.c
make: Leaving directory '/tmp/B.Iwvhat/BUILD/libpng-1.6.36/contrib/pngminus'
make: Entering directory '/tmp/B.Iwvhat/BUILD/libpng-1.6.36/contrib/pngminus'
i686-pld-linux-gcc  -o png2pnm png2pnm.o -L../.. -L../../.libs -lpng16 -lz -lm
make: Leaving directory '/tmp/B.Iwvhat/BUILD/libpng-1.6.36/contrib/pngminus'
make: Entering directory '/tmp/B.Iwvhat/BUILD/libpng-1.6.36/contrib/pngminus'
i686-pld-linux-gcc  -o pnm2png pnm2png.o -L../.. -L../../.libs -lpng16 -lz -lm
make: Leaving directory '/tmp/B.Iwvhat/BUILD/libpng-1.6.36/contrib/pngminus'
+ /usr/bin/make -Otarget -j9 check
rm -f scripts/symbols.out scripts/symbols.tf[12]
test -d scripts || mkdir scripts || test -d scripts
i686-pld-linux-gcc -E -DHAVE_CONFIG_H -I. \
     -DPNGLIB_LIBNAME='PNG16_0' -DPNGLIB_VERSION='1.6.36' -DSYMBOL_PREFIX='' -DPNG_NO_USE_READ_MACROS -DPNG_BUILDING_SYMBOL_TABLE  scripts/symbols.c > scripts/symbols.tf1
gawk -f "./scripts/dfn.awk" out="scripts/symbols.tf2" scripts/symbols.tf1 1>&2
rm -f scripts/symbols.tf1
mv scripts/symbols.tf2 scripts/symbols.out
rm -f scripts/symbols.chk scripts/symbols.new
gawk -f ./scripts/checksym.awk ./scripts/symbols.def\
    of="scripts/symbols.new" scripts/symbols.out >&2
mv scripts/symbols.new scripts/symbols.chk
/usr/bin/make  check-am
/usr/bin/make  pngtest pngunknown pngstest pngvalid pngimage pngcp timepng
make[2]: 'pngunknown' is up to date.
make[2]: 'pngstest' is up to date.
make[2]: 'pngvalid' is up to date.
make[2]: 'pngimage' is up to date.
make[2]: 'pngcp' is up to date.
make[2]: 'timepng' is up to date.
/usr/bin/make  check-TESTS
make[3]: Entering directory '/tmp/B.Iwvhat/BUILD/libpng-1.6.36'
PASS: tests/pngtest
make[3]: Leaving directory '/tmp/B.Iwvhat/BUILD/libpng-1.6.36'
make[3]: Entering directory '/tmp/B.Iwvhat/BUILD/libpng-1.6.36'
FAIL: tests/pngvalid-gamma-sbit
make[3]: Leaving directory '/tmp/B.Iwvhat/BUILD/libpng-1.6.36'
make[3]: Entering directory '/tmp/B.Iwvhat/BUILD/libpng-1.6.36'
PASS: tests/pngtest-badpngs
make[3]: Leaving directory '/tmp/B.Iwvhat/BUILD/libpng-1.6.36'
make[3]: Entering directory '/tmp/B.Iwvhat/BUILD/libpng-1.6.36'
FAIL: tests/pngvalid-gamma-background
make[3]: Leaving directory '/tmp/B.Iwvhat/BUILD/libpng-1.6.36'
make[3]: Entering directory '/tmp/B.Iwvhat/BUILD/libpng-1.6.36'
FAIL: tests/pngvalid-gamma-expand16-transform
make[3]: Leaving directory '/tmp/B.Iwvhat/BUILD/libpng-1.6.36'
make[3]: Entering directory '/tmp/B.Iwvhat/BUILD/libpng-1.6.36'
PASS: tests/pngvalid-gamma-16-to-8
make[3]: Leaving directory '/tmp/B.Iwvhat/BUILD/libpng-1.6.36'
make[3]: Entering directory '/tmp/B.Iwvhat/BUILD/libpng-1.6.36'
FAIL: tests/pngvalid-gamma-expand16-background
make[3]: Leaving directory '/tmp/B.Iwvhat/BUILD/libpng-1.6.36'
make[3]: Entering directory '/tmp/B.Iwvhat/BUILD/libpng-1.6.36'
FAIL: tests/pngvalid-gamma-transform
make[3]: Leaving directory '/tmp/B.Iwvhat/BUILD/libpng-1.6.36'
make[3]: Entering directory '/tmp/B.Iwvhat/BUILD/libpng-1.6.36'
FAIL: tests/pngvalid-transform
make[3]: Leaving directory '/tmp/B.Iwvhat/BUILD/libpng-1.6.36'
make[3]: Entering directory '/tmp/B.Iwvhat/BUILD/libpng-1.6.36'
PASS: tests/pngvalid-gamma-threshold
make[3]: Leaving directory '/tmp/B.Iwvhat/BUILD/libpng-1.6.36'
make[3]: Entering directory '/tmp/B.Iwvhat/BUILD/libpng-1.6.36'
PASS: tests/pngvalid-progressive-interlace-standard
make[3]: Leaving directory '/tmp/B.Iwvhat/BUILD/libpng-1.6.36'
make[3]: Entering directory '/tmp/B.Iwvhat/BUILD/libpng-1.6.36'
PASS: tests/pngvalid-progressive-standard
make[3]: Leaving directory '/tmp/B.Iwvhat/BUILD/libpng-1.6.36'
make[3]: Entering directory '/tmp/B.Iwvhat/BUILD/libpng-1.6.36'
PASS: tests/pngvalid-standard
make[3]: Leaving directory '/tmp/B.Iwvhat/BUILD/libpng-1.6.36'
make[3]: Entering directory '/tmp/B.Iwvhat/BUILD/libpng-1.6.36'
PASS: tests/pngvalid-progressive-size
make[3]: Leaving directory '/tmp/B.Iwvhat/BUILD/libpng-1.6.36'
make[3]: Entering directory '/tmp/B.Iwvhat/BUILD/libpng-1.6.36'
FAIL: tests/pngvalid-gamma-expand16-alpha-mode
make[3]: Leaving directory '/tmp/B.Iwvhat/BUILD/libpng-1.6.36'
make[3]: Entering directory '/tmp/B.Iwvhat/BUILD/libpng-1.6.36'
FAIL: tests/pngstest-linear
make[3]: Leaving directory '/tmp/B.Iwvhat/BUILD/libpng-1.6.36'
make[3]: Entering directory '/tmp/B.Iwvhat/BUILD/libpng-1.6.36'
FAIL: tests/pngstest-linear-alpha
make[3]: Leaving directory '/tmp/B.Iwvhat/BUILD/libpng-1.6.36'
make[3]: Entering directory '/tmp/B.Iwvhat/BUILD/libpng-1.6.36'
PASS: tests/pngunknown-IDAT
make[3]: Leaving directory '/tmp/B.Iwvhat/BUILD/libpng-1.6.36'
make[3]: Entering directory '/tmp/B.Iwvhat/BUILD/libpng-1.6.36'
PASS: tests/pngunknown-discard
make[3]: Leaving directory '/tmp/B.Iwvhat/BUILD/libpng-1.6.36'
make[3]: Entering directory '/tmp/B.Iwvhat/BUILD/libpng-1.6.36'
FAIL: tests/pngstest-none-alpha
make[3]: Leaving directory '/tmp/B.Iwvhat/BUILD/libpng-1.6.36'
make[3]: Entering directory '/tmp/B.Iwvhat/BUILD/libpng-1.6.36'
PASS: tests/pngunknown-if-safe
make[3]: Leaving directory '/tmp/B.Iwvhat/BUILD/libpng-1.6.36'
make[3]: Entering directory '/tmp/B.Iwvhat/BUILD/libpng-1.6.36'
PASS: tests/pngunknown-save
make[3]: Leaving directory '/tmp/B.Iwvhat/BUILD/libpng-1.6.36'
make[3]: Entering directory '/tmp/B.Iwvhat/BUILD/libpng-1.6.36'
PASS: tests/pngunknown-sAPI
make[3]: Leaving directory '/tmp/B.Iwvhat/BUILD/libpng-1.6.36'
make[3]: Entering directory '/tmp/B.Iwvhat/BUILD/libpng-1.6.36'
PASS: tests/pngunknown-sTER
make[3]: Leaving directory '/tmp/B.Iwvhat/BUILD/libpng-1.6.36'
make[3]: Entering directory '/tmp/B.Iwvhat/BUILD/libpng-1.6.36'
PASS: tests/pngunknown-vpAg
make[3]: Leaving directory '/tmp/B.Iwvhat/BUILD/libpng-1.6.36'
make[3]: Entering directory '/tmp/B.Iwvhat/BUILD/libpng-1.6.36'
PASS: tests/pngimage-quick
make[3]: Leaving directory '/tmp/B.Iwvhat/BUILD/libpng-1.6.36'
make[3]: Entering directory '/tmp/B.Iwvhat/BUILD/libpng-1.6.36'
FAIL: tests/pngstest-none
make[3]: Leaving directory '/tmp/B.Iwvhat/BUILD/libpng-1.6.36'
make[3]: Entering directory '/tmp/B.Iwvhat/BUILD/libpng-1.6.36'
FAIL: tests/pngstest-1.8-alpha
make[3]: Leaving directory '/tmp/B.Iwvhat/BUILD/libpng-1.6.36'
make[3]: Entering directory '/tmp/B.Iwvhat/BUILD/libpng-1.6.36'
FAIL: tests/pngstest-1.8
make[3]: Leaving directory '/tmp/B.Iwvhat/BUILD/libpng-1.6.36'
make[3]: Entering directory '/tmp/B.Iwvhat/BUILD/libpng-1.6.36'
PASS: tests/pngvalid-gamma-alpha-mode
make[3]: Leaving directory '/tmp/B.Iwvhat/BUILD/libpng-1.6.36'
make[3]: Entering directory '/tmp/B.Iwvhat/BUILD/libpng-1.6.36'
PASS: tests/pngstest-sRGB-alpha
make[3]: Leaving directory '/tmp/B.Iwvhat/BUILD/libpng-1.6.36'
make[3]: Entering directory '/tmp/B.Iwvhat/BUILD/libpng-1.6.36'
PASS: tests/pngstest-sRGB
make[3]: Leaving directory '/tmp/B.Iwvhat/BUILD/libpng-1.6.36'
make[3]: Entering directory '/tmp/B.Iwvhat/BUILD/libpng-1.6.36'
PASS: tests/pngimage-full
make[3]: Leaving directory '/tmp/B.Iwvhat/BUILD/libpng-1.6.36'
make[3]: Entering directory '/tmp/B.Iwvhat/BUILD/libpng-1.6.36'
============================================================================
Testsuite summary for libpng 1.6.36
============================================================================
# TOTAL: 33
# PASS:  20
# SKIP:  0
# XFAIL: 0
# FAIL:  13
# XPASS: 0
# ERROR: 0
============================================================================
See ./test-suite.log
Please report to png-mng-implement@lists.sourceforge.net
============================================================================
make[3]: *** [Makefile:1456: test-suite.log] Error 1
make[3]: Leaving directory '/tmp/B.Iwvhat/BUILD/libpng-1.6.36'
make[2]: *** [Makefile:1564: check-TESTS] Error 2
make[1]: *** [Makefile:1997: check-am] Error 2
make: *** [Makefile:1999: check] Error 2
error: Bad exit status from /tmp/B.Iwvhat/BUILD/tmp/rpm-tmp.85468 (%build)


RPM build errors:
    Bad exit status from /tmp/B.Iwvhat/BUILD/tmp/rpm-tmp.85468 (%build)
ended at: Tue Dec  4 11:57:50 2018, done in 0:01:10.167589
error: No files produced.
+ chmod -R u+rwX /tmp/B.Iwvhat/BUILD
+ rm -rf /tmp/B.Iwvhat/tmp /tmp/B.Iwvhat/BUILD
+ rm -rf /tmp/B.Iwvhat
Begin-PLD-Builder-Info
Build-Time: user:155.89s sys:11.62s real:74.39s (faults io:0 non-io:1091031)

End-PLD-Builder-Info
[Back to list of logs] [View rpm -qa of builder]