FailedOk

th/SRPMS[OK]
th/x32[OK]
th/i686[OK]
th/x86_64[OK]

ac/SRPMS[OK]
ac/i386[OK]
ac/i586[OK]
ac/i686[OK]
ac/alpha[OK]
ac/amd64[OK]
ac/athlon[OK]
ac/ppc[OK]
ac/sparc[OK]
ac/sparc64[OK]

Advanced Search
main()
Powered by PLD Linux
(c) 2002-2018 PLD Team
$Revision: 1.37 $
Powered by /dev/null.
Your IP: 54.196.73.22

libprelude dce8085a-2ccc-4079-ac8f-f5ee0cb7d4e2

Status:Failed
Source URL:ftp://buildlogs.pld-linux.org/th/i686/FAIL/libprelude,dce8085a-2ccc-4079-ac8f-f5ee0cb7d4e2.bz2
text/plain URL:View!
full text:View!
rpm -qa of builder:View!
Date:2018/06/05 08:58:03
Runtime:0:02:11.646815

Toc:

  • error 1
  • make[3]: *** [Makefile:1712: tmpl-build.stamp] Error 127
  • error 2
  • make[2]: *** [Makefile:1449: all-recursive] Error 1
  • error 3
  • make[1]: *** [Makefile:1625: all-recursive] Error 1
  • error 4
  • error: Bad exit status from /tmp/B.PwJcU9/BUILD/tmp/rpm-tmp.84460 (%build)
  • error 5
  • RPM build errors:
  • error 6
  • error: No files produced.

Content:

running build_py
creating build-2
creating build-2/lib.linux-i686-2.7
copying prelude.py -> build-2/lib.linux-i686-2.7
running build_ext
building '_prelude' extension
creating build-2/temp.linux-i686-2.7
i686-pld-linux-g++ -fno-strict-aliasing -O2 -fwrapv -pipe -Wformat -Werror=format-security -gdwarf-4 -fno-debug-types-section -fvar-tracking-assignments -g2 -Wp,-D_FORTIFY_SOURCE=2 -fstack-protector-strong --param=ssp-buffer-size=4 -fomit-frame-pointer -march=i686 -fasynchronous-unwind-tables -mtune=pentium4 -gdwarf-4 -fno-debug-types-section -fvar-tracking-assignments -g2 -DNDEBUG -O2 -fwrapv -pipe -Wformat -Werror=format-security -gdwarf-4 -fno-debug-types-section -fvar-tracking-assignments -g2 -Wp,-D_FORTIFY_SOURCE=2 -fstack-protector-strong --param=ssp-buffer-size=4 -fomit-frame-pointer -march=i686 -fasynchronous-unwind-tables -mtune=pentium4 -gdwarf-4 -fno-debug-types-section -fvar-tracking-assignments -g2 -fPIC -I/usr/include/python2.7 -c _prelude.cxx -o build-2/temp.linux-i686-2.7/_prelude.o -I../.. -I../../src/include -I../../src/include -I../../src/libprelude-error -I../../bindings/c++/include
i686-pld-linux-g++ -pthread -shared -Wl,--as-needed -Wl,--no-copy-dt-needed-entries -Wl,-z,relro -Wl,-z,combreloc build-2/temp.linux-i686-2.7/_prelude.o -L../../src/.libs/ -L../../bindings/c++/.libs/ -L/usr/lib -lpython2.7 -o build-2/lib.linux-i686-2.7/_prelude.so -lpreludecpp -lprelude -lgnutls -lgcrypt -lgpg-error -ldl
CC="i686-pld-linux-g++" /usr/bin/python3 setup.py build --build-base=build-3
running build
running build_py
creating build-3
creating build-3/lib.linux-i686-3.6
copying prelude.py -> build-3/lib.linux-i686-3.6
running build_ext
building '_prelude' extension
creating build-3/temp.linux-i686-3.6
i686-pld-linux-g++ -Wno-unused-result -Wsign-compare -DNDEBUG -O2 -fwrapv -pipe -Wformat -Werror=format-security -gdwarf-4 -fno-debug-types-section -fvar-tracking-assignments -g2 -Wp,-D_FORTIFY_SOURCE=2 -fstack-protector-strong --param=ssp-buffer-size=4 -fomit-frame-pointer -march=i686 -fasynchronous-unwind-tables -mtune=pentium4 -gdwarf-4 -fno-debug-types-section -fvar-tracking-assignments -g2 -fno-caller-saves -O2 -fwrapv -pipe -Wformat -Werror=format-security -gdwarf-4 -fno-debug-types-section -fvar-tracking-assignments -g2 -Wp,-D_FORTIFY_SOURCE=2 -fstack-protector-strong --param=ssp-buffer-size=4 -fomit-frame-pointer -march=i686 -fasynchronous-unwind-tables -mtune=pentium4 -gdwarf-4 -fno-debug-types-section -fvar-tracking-assignments -g2 -fPIC -I/usr/include/python3.6m -c _prelude.cxx -o build-3/temp.linux-i686-3.6/_prelude.o -I../.. -I../../src/include -I../../src/include -I../../src/libprelude-error -I../../bindings/c++/include
_prelude.cxx: In function 'int _cb_python_write(prelude_msgbuf_t*, prelude_msg_t*)':
_prelude.cxx:4474:18: warning: comparison between signed and unsigned integer expressions [-Wsign-compare]
         if ( ret != prelude_msg_get_len(msg) )
              ~~~~^~~~~~~~~~~~~~~~~~~~~~~~~~~
i686-pld-linux-g++ -pthread -shared -Wl,--as-needed -Wl,--no-copy-dt-needed-entries -Wl,-z,relro -Wl,-z,combreloc build-3/temp.linux-i686-3.6/_prelude.o -L../../src/.libs/ -L../../bindings/c++/.libs/ -L/usr/lib -lpython3.6m -o build-3/lib.linux-i686-3.6/_prelude.cpython-36m-i386-linux-gnu.so -lpreludecpp -lprelude -lgnutls -lgcrypt -lgpg-error -ldl
make[3]: Leaving directory '/tmp/B.PwJcU9/BUILD/libprelude-3.1.0/bindings/python'
Making all in ruby
make[3]: Entering directory '/tmp/B.PwJcU9/BUILD/libprelude-3.1.0/bindings/ruby'
/usr/bin/swig -c++ -DSWIG_COMPILE_LIBPRELUDE -I../../bindings -I../../bindings/c++/include -I../../src/include -I../../src/libprelude-error -ruby -o Prelude.cxx ../../bindings/libpreludecpp.i
../../bindings/c++/include/idmef.hxx:38: Warning 503: Can't wrap 'operator >>' unless renamed to a valid identifier.
make[3]: Leaving directory '/tmp/B.PwJcU9/BUILD/libprelude-3.1.0/bindings/ruby'
make[3]: Entering directory '/tmp/B.PwJcU9/BUILD/libprelude-3.1.0/bindings/ruby'
/bin/sh ../../libtool  --tag=CXX   --mode=compile i686-pld-linux-g++ -DHAVE_CONFIG_H -I. -I../..  -I/usr/include/ruby-2.4 -O2 -fwrapv -pipe -Wformat -Werror=format-security -gdwarf-4 -fno-debug-types-section -fvar-tracking-assignments -g2 -Wp,-D_FORTIFY_SOURCE=2 -fstack-protector-strong --param=ssp-buffer-size=4 -fomit-frame-pointer -march=i686 -fasynchronous-unwind-tables -mtune=pentium4 -fno-omit-frame-pointer -gdwarf-4 -fno-debug-types-section -fvar-tracking-assignments -g2  -fPIC -I../.. -I../../src/include -I../../src/include -I../../src/libprelude-error -I../../bindings/c++/include   -O2 -fwrapv -pipe -Wformat -Werror=format-security -gdwarf-4 -fno-debug-types-section -fvar-tracking-assignments -g2 -Wp,-D_FORTIFY_SOURCE=2 -fstack-protector-strong --param=ssp-buffer-size=4 -fomit-frame-pointer -march=i686 -fasynchronous-unwind-tables -mtune=pentium4 -gdwarf-4 -fno-debug-types-section -fvar-tracking-assignments -g2  -MT Prelude_la-Prelude.lo -MD -MP -MF .deps/Prelude_la-Prelude.Tpo -c -o Prelude_la-Prelude.lo `test -f 'Prelude.cxx' || echo './'`Prelude.cxx
libtool: compile:  i686-pld-linux-g++ -DHAVE_CONFIG_H -I. -I../.. -I/usr/include/ruby-2.4 -O2 -fwrapv -pipe -Wformat -Werror=format-security -gdwarf-4 -fno-debug-types-section -fvar-tracking-assignments -g2 -Wp,-D_FORTIFY_SOURCE=2 -fstack-protector-strong --param=ssp-buffer-size=4 -fomit-frame-pointer -march=i686 -fasynchronous-unwind-tables -mtune=pentium4 -fno-omit-frame-pointer -gdwarf-4 -fno-debug-types-section -fvar-tracking-assignments -g2 -fPIC -I../.. -I../../src/include -I../../src/include -I../../src/libprelude-error -I../../bindings/c++/include -O2 -fwrapv -pipe -Wformat -Werror=format-security -gdwarf-4 -fno-debug-types-section -fvar-tracking-assignments -g2 -Wp,-D_FORTIFY_SOURCE=2 -fstack-protector-strong --param=ssp-buffer-size=4 -fomit-frame-pointer -march=i686 -fasynchronous-unwind-tables -mtune=pentium4 -gdwarf-4 -fno-debug-types-section -fvar-tracking-assignments -g2 -MT Prelude_la-Prelude.lo -MD -MP -MF .deps/Prelude_la-Prelude.Tpo -c Prelude.cxx  -fPIC -DPIC -o .libs/Prelude_la-Prelude.o
libtool: compile:  i686-pld-linux-g++ -DHAVE_CONFIG_H -I. -I../.. -I/usr/include/ruby-2.4 -O2 -fwrapv -pipe -Wformat -Werror=format-security -gdwarf-4 -fno-debug-types-section -fvar-tracking-assignments -g2 -Wp,-D_FORTIFY_SOURCE=2 -fstack-protector-strong --param=ssp-buffer-size=4 -fomit-frame-pointer -march=i686 -fasynchronous-unwind-tables -mtune=pentium4 -fno-omit-frame-pointer -gdwarf-4 -fno-debug-types-section -fvar-tracking-assignments -g2 -fPIC -I../.. -I../../src/include -I../../src/include -I../../src/libprelude-error -I../../bindings/c++/include -O2 -fwrapv -pipe -Wformat -Werror=format-security -gdwarf-4 -fno-debug-types-section -fvar-tracking-assignments -g2 -Wp,-D_FORTIFY_SOURCE=2 -fstack-protector-strong --param=ssp-buffer-size=4 -fomit-frame-pointer -march=i686 -fasynchronous-unwind-tables -mtune=pentium4 -gdwarf-4 -fno-debug-types-section -fvar-tracking-assignments -g2 -MT Prelude_la-Prelude.lo -MD -MP -MF .deps/Prelude_la-Prelude.Tpo -c Prelude.cxx -o Prelude_la-Prelude.o >/dev/null 2>&1
mv -f .deps/Prelude_la-Prelude.Tpo .deps/Prelude_la-Prelude.Plo
make[3]: Leaving directory '/tmp/B.PwJcU9/BUILD/libprelude-3.1.0/bindings/ruby'
make[3]: Entering directory '/tmp/B.PwJcU9/BUILD/libprelude-3.1.0/bindings/ruby'
/bin/sh ../../libtool  --tag=CXX   --mode=link i686-pld-linux-g++  -O2 -fwrapv -pipe -Wformat -Werror=format-security -gdwarf-4 -fno-debug-types-section -fvar-tracking-assignments -g2 -Wp,-D_FORTIFY_SOURCE=2 -fstack-protector-strong --param=ssp-buffer-size=4 -fomit-frame-pointer -march=i686 -fasynchronous-unwind-tables -mtune=pentium4 -gdwarf-4 -fno-debug-types-section -fvar-tracking-assignments -g2  -module -avoid-version -Wl,--as-needed -Wl,--no-copy-dt-needed-entries -Wl,-z,relro -Wl,-z,combreloc  -z relro -z now -o Prelude.la -rpath /usr/lib/ruby/vendor_ruby/2.4 Prelude_la-Prelude.lo ../../bindings/c++/.libs/libpreludecpp.la -L/usr/lib/ruby/2.4 -lruby 
libtool: warning: '/usr/lib/gcc/i686-pld-linux/7.3.0/../../../libstdc++.la' seems to be moved
libtool: link: i686-pld-linux-g++  -fPIC -DPIC -shared -nostdlib  -O2 -gdwarf-4 -g2 -fstack-protector-strong -march=i686 -mtune=pentium4 -gdwarf-4 -g2 -Wl,--as-needed -Wl,--no-copy-dt-needed-entries -Wl,-z -Wl,relro -Wl,-z -Wl,combreloc   -pthread /usr/lib/gcc/i686-pld-linux/7.3.0/../../../crti.o /usr/lib/gcc/i686-pld-linux/7.3.0/crtbeginS.o  .libs/Prelude_la-Prelude.o   -Wl,-rpath -Wl,/tmp/B.PwJcU9/BUILD/libprelude-3.1.0/bindings/c++/.libs -Wl,-rpath -Wl,/tmp/B.PwJcU9/BUILD/libprelude-3.1.0/src/.libs -L/tmp/B.PwJcU9/BUILD/libprelude-3.1.0/src/.libs/.libs ../../bindings/c++/.libs/libpreludecpp.so -L/usr/lib -L/usr/lib/gcc/i686-pld-linux/7.3.0/../../.. /tmp/B.PwJcU9/BUILD/libprelude-3.1.0/src/.libs/libprelude.so /usr/lib/libgnutls.so -lz -lp11-kit /usr/lib/libidn2.so /usr/lib/libunistring.so /usr/lib/libtasn1.so -lnettle -lhogweed /usr/lib/libgmp.so /usr/lib/libgcrypt.so /usr/lib/libgpg-error.so /usr/lib/libltdl.so -ldl -L/usr/lib/ruby/2.4 -lruby -L/usr/lib/gcc/i686-pld-linux/7.3.0 /usr/lib/libstdc++.so -lm -lc -lgcc_s /usr/lib/gcc/i686-pld-linux/7.3.0/crtendS.o /usr/lib/gcc/i686-pld-linux/7.3.0/../../../crtn.o -Wl,-soname -Wl,Prelude.so -o .libs/Prelude.so
libtool: link: ar cru .libs/Prelude.a  Prelude_la-Prelude.o
libtool: link: ranlib .libs/Prelude.a
libtool: link: ( cd ".libs" && rm -f "Prelude.la" && ln -s "../Prelude.la" "Prelude.la" )
make[3]: Leaving directory '/tmp/B.PwJcU9/BUILD/libprelude-3.1.0/bindings/ruby'
make[3]: Entering directory '/tmp/B.PwJcU9/BUILD/libprelude-3.1.0/bindings'
cd perl && LANG="" DESTDIR= LIBDIR=/usr/lib /usr/bin/perl Makefile.PL INSTALLDIRS=vendor CC="i686-pld-linux-g++"
Warning: -L../../src/.libs changed to -L/tmp/B.PwJcU9/BUILD/libprelude-3.1.0/bindings/perl/../../src/.libs
Warning: -L../../bindings/c++/.libs changed to -L/tmp/B.PwJcU9/BUILD/libprelude-3.1.0/bindings/perl/../../bindings/c++/.libs
Generating a Unix-style Makefile
Writing Makefile for Prelude
Writing MYMETA.yml and MYMETA.json
make[3]: Leaving directory '/tmp/B.PwJcU9/BUILD/libprelude-3.1.0/bindings'
cd perl && /usr/bin/make LD_RUN_PATH="" CC="i686-pld-linux-g++"
make[4]: Entering directory '/tmp/B.PwJcU9/BUILD/libprelude-3.1.0/bindings/perl'
Running Mkbootstrap for Prelude ()
chmod 644 "Prelude.bs"
make[4]: Leaving directory '/tmp/B.PwJcU9/BUILD/libprelude-3.1.0/bindings/perl'
make[4]: Entering directory '/tmp/B.PwJcU9/BUILD/libprelude-3.1.0/bindings/perl'
"/usr/bin/perl5.26.2" -MExtUtils::Command::MM -e 'cp_nonempty' -- Prelude.bs blib/arch/auto/Prelude/Prelude.bs 644
make[4]: Leaving directory '/tmp/B.PwJcU9/BUILD/libprelude-3.1.0/bindings/perl'
make[4]: Entering directory '/tmp/B.PwJcU9/BUILD/libprelude-3.1.0/bindings/perl'
cp Prelude.pm blib/lib/Prelude.pm
make[4]: Leaving directory '/tmp/B.PwJcU9/BUILD/libprelude-3.1.0/bindings/perl'
make[4]: Entering directory '/tmp/B.PwJcU9/BUILD/libprelude-3.1.0/bindings/perl'
i686-pld-linux-g++ -c  -I../.. -I../../src/include -I../../src/include -I../../src/libprelude-error -I../../bindings/c++/include -D_REENTRANT -D_GNU_SOURCE -fwrapv -fno-strict-aliasing -pipe -fstack-protector-strong -I/usr/local/include -D_LARGEFILE_SOURCE -D_FILE_OFFSET_BITS=64 -O2 -fwrapv -pipe -Wformat -Werror=format-security -gdwarf-4 -fno-debug-types-section -fvar-tracking-assignments -g2 -Wp,-D_FORTIFY_SOURCE=2 -fstack-protector-strong --param=ssp-buffer-size=4 -fomit-frame-pointer -march=i686 -fasynchronous-unwind-tables -mtune=pentium4 -gdwarf-4 -fno-debug-types-section -fvar-tracking-assignments -g2   -DVERSION=\"\" -DXS_VERSION=\"\" -fPIC "-I/usr/lib/perl5/5.26.2/i686-pld-linux-thread-multi/CORE"   Prelude.cxx
In file included from Prelude.cxx:11:0:
../../config.h:1981:0: warning: "VERSION" redefined
 #define VERSION "3.1.0"
 
<command-line>:0:0: note: this is the location of the previous definition
make[4]: Leaving directory '/tmp/B.PwJcU9/BUILD/libprelude-3.1.0/bindings/perl'
make[4]: Entering directory '/tmp/B.PwJcU9/BUILD/libprelude-3.1.0/bindings/perl'
rm -f blib/arch/auto/Prelude/Prelude.so
LD_RUN_PATH="" i686-pld-linux-gcc  -L../../src/.libs -shared   -Wl,--no-copy-dt-needed-entries -Wl,-z,relro -Wl,-z,combreloc  -L/usr/local/lib -fstack-protector-strong -Wl,--as-needed -Wl,--no-copy-dt-needed-entries -Wl,-z,relro -Wl,-z,combreloc  -z relro -z now,-rpath Prelude.o  -o blib/arch/auto/Prelude/Prelude.so  \
   -L/tmp/B.PwJcU9/BUILD/libprelude-3.1.0/bindings/perl/../../src/.libs -lprelude -L/tmp/B.PwJcU9/BUILD/libprelude-3.1.0/bindings/perl/../../bindings/c++/.libs -lpreludecpp   \
  
/usr/bin/ld: warning: -z now,-rpath ignored.
chmod 755 blib/arch/auto/Prelude/Prelude.so
make[4]: Leaving directory '/tmp/B.PwJcU9/BUILD/libprelude-3.1.0/bindings/perl'
Making all in docs
Making all in api
make[3]: Entering directory '/tmp/B.PwJcU9/BUILD/libprelude-3.1.0/docs/api'
gtk-doc: Scanning header files
cd . && \
  gtkdoc-scan --module=libprelude --source-dir=../../src --ignore-headers="config-engine.h libmissing.h idmef-tree-data.h ntp.h tls-auth.h tls-util.h code-from-errno.h code-to-errno.h err-codes-sym.h err-codes.h err-sources-sym.h err-sources.h errnos-sym.h gettext.h mkerrcodes.h idmef-criteria-string.yac.h idmef-tree.h prelude-extract.h prelude-message-id.h idmef-message-id.h idmef-class.h idmef-value-type.h daemonize.h common.h variable.h" --deprecated-guards="PRELUDE_DISABLE_DEPRECATED" 
if grep -l '^..*$' ./libprelude.types > /dev/null 2>&1 ; then \
    CC="/bin/sh ../../libtool --mode=compile i686-pld-linux-gcc     -O2 -fwrapv -pipe -Wformat -Werror=format-security -gdwarf-4 -fno-debug-types-section -fvar-tracking-assignments -g2 -Wp,-D_FORTIFY_SOURCE=2 -fstack-protector-strong --param=ssp-buffer-size=4 -fomit-frame-pointer -march=i686 -fasynchronous-unwind-tables -mtune=pentium4 -gdwarf-4 -fno-debug-types-section -fvar-tracking-assignments -g2 " LD="/bin/sh ../../libtool --mode=link i686-pld-linux-gcc  -O2 -fwrapv -pipe -Wformat -Werror=format-security -gdwarf-4 -fno-debug-types-section -fvar-tracking-assignments -g2 -Wp,-D_FORTIFY_SOURCE=2 -fstack-protector-strong --param=ssp-buffer-size=4 -fomit-frame-pointer -march=i686 -fasynchronous-unwind-tables -mtune=pentium4 -gdwarf-4 -fno-debug-types-section -fvar-tracking-assignments -g2   -Wl,--as-needed -Wl,--no-copy-dt-needed-entries -Wl,-z,relro -Wl,-z,combreloc  -z relro -z now" RUN="/bin/sh ../../libtool --mode=execute" CFLAGS=" -O2 -fwrapv -pipe -Wformat -Werror=format-security -gdwarf-4 -fno-debug-types-section -fvar-tracking-assignments -g2 -Wp,-D_FORTIFY_SOURCE=2 -fstack-protector-strong --param=ssp-buffer-size=4 -fomit-frame-pointer -march=i686 -fasynchronous-unwind-tables -mtune=pentium4 -gdwarf-4 -fno-debug-types-section -fvar-tracking-assignments -g2 " LDFLAGS=" -Wl,--as-needed -Wl,--no-copy-dt-needed-entries -Wl,-z,relro -Wl,-z,combreloc  -z relro -z now" gtkdoc-scangobj  --module=libprelude --output-dir=. ; \
else \
    cd . ; \
    for i in libprelude.args libprelude.hierarchy libprelude.interfaces libprelude.prerequisites libprelude.signals ; do \
               test -f $i || touch $i ; \
    done \
fi
touch scan-build.stamp
make[3]: Leaving directory '/tmp/B.PwJcU9/BUILD/libprelude-3.1.0/docs/api'
make[3]: Entering directory '/tmp/B.PwJcU9/BUILD/libprelude-3.1.0/docs/api'
gtk-doc: Rebuilding template files
cd . && gtkdoc-mktmpl --module=libprelude 
/bin/sh: gtkdoc-mktmpl: not found
make[3]: *** [Makefile:1712: tmpl-build.stamp] Error 127
make[3]: Leaving directory '/tmp/B.PwJcU9/BUILD/libprelude-3.1.0/docs/api'
make[2]: *** [Makefile:1449: all-recursive] Error 1
make[1]: *** [Makefile:1625: all-recursive] Error 1
make: *** [Makefile:1491: all] Error 2
error: Bad exit status from /tmp/B.PwJcU9/BUILD/tmp/rpm-tmp.84460 (%build)


RPM build errors:
    Bad exit status from /tmp/B.PwJcU9/BUILD/tmp/rpm-tmp.84460 (%build)
ended at: Tue Jun  5 08:58:02 2018, done in 0:02:11.646815
error: No files produced.
+ chmod -R u+rwX /tmp/B.PwJcU9/BUILD
+ rm -rf /tmp/B.PwJcU9/tmp /tmp/B.PwJcU9/BUILD
+ rm -rf /tmp/B.PwJcU9
Begin-PLD-Builder-Info
Build-Time: user:149.78s sys:12.83s real:136.28s (faults io:0 non-io:6324473)

End-PLD-Builder-Info
[Back to list of logs] [View rpm -qa of builder]