FailedOk

th/SRPMS[OK]
th/x32[OK]
th/i686[OK]
th/x86_64[OK]

ac/SRPMS[OK]
ac/i386[OK]
ac/i586[OK]
ac/i686[OK]
ac/alpha[OK]
ac/amd64[OK]
ac/athlon[OK]
ac/ppc[OK]
ac/sparc[OK]
ac/sparc64[OK]

Advanced Search
main()
Powered by PLD Linux
(c) 2002-2018 PLD Team
$Revision: 1.37 $
Powered by bogon.
Your IP: 54.82.93.116

libsolv 82122e37-82ac-45d9-8dc7-c3fe97c480c7

Status:Failed
Source URL:ftp://buildlogs.pld-linux.org/th/i686/FAIL/libsolv,82122e37-82ac-45d9-8dc7-c3fe97c480c7.bz2
text/plain URL:View!
rpm -qa of builder:View!
Date:2018/09/14 20:31:39
Runtime:0:00:12.326198

Toc:

  • prep
  • Executing(%prep): /bin/sh -e /tmp/B.GcEWCU/BUILD/tmp/rpm-tmp.20344
  • build
  • Executing(%build): /bin/sh -e /tmp/B.GcEWCU/BUILD/tmp/rpm-tmp.20344
  • error 1
  • /usr/include/rpm/rpmio.h:28:9: error: unknown type name 'off64_t'
  • error 2
  • make[2]: *** [ext/CMakeFiles/libsolvext_static.dir/build.make:118: ext/CMakeFiles/libsolvext_static.dir/repo_pubkey.o] Error 1
  • error 3
  • /usr/include/rpm/rpmio.h:28:9: error: unknown type name 'off64_t'
  • error 4
  • make[2]: *** [ext/CMakeFiles/libsolvext_static.dir/build.make:105: ext/CMakeFiles/libsolvext_static.dir/repo_rpmdb.o] Error 1
  • error 5
  • make[1]: *** [CMakeFiles/Makefile2:249: ext/CMakeFiles/libsolvext_static.dir/all] Error 2
  • error 6
  • error: Bad exit status from /tmp/B.GcEWCU/BUILD/tmp/rpm-tmp.20344 (%build)
  • error 7
  • RPM build errors:
  • error 8
  • error: No files produced.

Content:

request from: arekm
checking if we should skip the build
started at: Fri Sep 14 20:31:16 2018
killing old processes on a builder
sending signal 9 to pid -1
Killed
cleaning up /tmp
fetching https://srcbuilder.pld-linux.org/th//srpms/82122e37-82ac-45d9-8dc7-c3fe97c480c7/libsolv-0.6.34-5.src.rpm
fetched 658263 bytes, 1106.9 K/s
installing srpm: libsolv-0.6.34-5.src.rpm
+ install -d /tmp/B.GcEWCU/BUILD /tmp/B.GcEWCU/RPMS
+ LC_ALL=en_US.UTF-8
+ rpm -qp --changelog libsolv-0.6.34-5.src.rpm
* Fri Sep 14 2018 PLD Linux Team <feedback@pld-linux.org>
- For complete changelog see: http://git.pld-linux.org/?p=packages/libsolv.git;a=log;h=master
* Fri Sep 14 2018 Arkadiusz Miśkiewicz <arekm@maven.pl> c82e0de
- release 5 (by relup.sh) * Tue Jul 03 2018 Arkadiusz Miśkiewicz <arekm@maven.pl> 9f357c4
- release 4 (by relup.sh) * Sun Jun 03 2018 Jan Rękorajski <baggins@pld-linux.org> 5f4886a
- rebuild with ruby 2.4 - release 3 (by relup.sh) * Sun May 27 2018 Jakub Bogusz <qboosh@pld-linux.org> f5a13d2
- enable COMPLEX_DEPS (required for libdnf); release 2 * Fri May 11 2018 Jakub Bogusz <qboosh@pld-linux.org> 8163445
- updated to 0.6.34 - added rpm5 patch, but new librpm options require more APIs from rpm.org 4.6+ * Sun Nov 19 2017 Jakub Bogusz <qboosh@pld-linux.org> 0fad2d1
- updated to 0.6.30 * Wed Oct 25 2017 Jan Rękorajski <baggins@pld-linux.org> 75a198e
- rebuild with ruby 2.3 - release 2 (by relup.sh) + rpm -Uhv --nodeps --define '_topdir /tmp/B.GcEWCU' --define '_specdir %{_topdir}' --define '_sourcedir %{_specdir}' --define '_rpmdir %{_topdir}/RPMS' --define '_builddir %{_topdir}/BUILD' libsolv-0.6.34-5.src.rpm Preparing... ################################################## libsolv ################################################## + rm -f libsolv-0.6.34-5.src.rpm + install -m 700 -d /tmp/B.GcEWCU/BUILD/tmp + TMPDIR=/tmp/B.GcEWCU/BUILD/tmp + exec nice -n 0 rpmbuild -bp --short-circuit --nodeps --define '_topdir /tmp/B.GcEWCU' --define '_specdir %{_topdir}' --define '_sourcedir %{_specdir}' --define '_rpmdir %{_topdir}/RPMS' --define '_builddir %{_topdir}/BUILD' --target i686-pld-linux --define 'prep exit 0' /tmp/B.GcEWCU/libsolv.spec Building target platforms: i686-pld-linux checking BuildConflict-ing packages no BuildConflicts found checking BR rpm: Building target platforms: i686-pld-linux no BR needed building RPM using: set -ex; : build-id: 82122e37-82ac-45d9-8dc7-c3fe97c480c7; TMPDIR=/tmp/B.GcEWCU/BUILD/tmp exec nice -n 0 rpmbuild -bb --define '_smp_mflags -j9' --define '_make_opts -Otarget' --define '_pld_builder 1' --define '_topdir /tmp/B.GcEWCU' --define '_specdir %{_topdir}' --define '_sourcedir %{_specdir}' --define '_rpmdir %{_topdir}/RPMS' --define '_builddir %{_topdir}/BUILD' --target i686-pld-linux /tmp/B.GcEWCU/libsolv.spec + : build-id: 82122e37-82ac-45d9-8dc7-c3fe97c480c7 + TMPDIR=/tmp/B.GcEWCU/BUILD/tmp + exec nice -n 0 rpmbuild -bb --define '_smp_mflags -j9' --define '_make_opts -Otarget' --define '_pld_builder 1' --define '_topdir /tmp/B.GcEWCU' --define '_specdir %{_topdir}' --define '_sourcedir %{_specdir}' --define '_rpmdir %{_topdir}/RPMS' --define '_builddir %{_topdir}/BUILD' --target i686-pld-linux /tmp/B.GcEWCU/libsolv.spec Building target platforms: i686-pld-linux Executing(%prep): /bin/sh -e /tmp/B.GcEWCU/BUILD/tmp/rpm-tmp.20344 + umask 022 + cd /tmp/B.GcEWCU/BUILD + cd /tmp/B.GcEWCU/BUILD + rm -rf libsolv-0.6.34 + /usr/bin/gzip -dc /tmp/B.GcEWCU/libsolv-0.6.34.tar.gz + /bin/tar -xf - + STATUS=0 + '[' 0 -ne 0 ']' + cd libsolv-0.6.34 + /bin/id -u + '[' 1001 '=' 0 ']' + /bin/id -u + '[' 1001 '=' 0 ']' + /bin/chmod -Rf a+rX,u+w,g-w,o-w . + echo 'Patch #0 (ruby.patch):' Patch #0 (ruby.patch): + '[' -f /tmp/B.GcEWCU/ruby.patch ']' + /bin/cat /tmp/B.GcEWCU/ruby.patch + /usr/bin/patch -s -p1 + echo 'Patch #1 (libsolv-python.patch):' Patch #1 (libsolv-python.patch): + '[' -f /tmp/B.GcEWCU/libsolv-python.patch ']' + /bin/cat /tmp/B.GcEWCU/libsolv-python.patch + /usr/bin/patch -s -p1 + echo 'Patch #2 (libsolv-rpm5.patch):' Patch #2 (libsolv-rpm5.patch): + '[' -f /tmp/B.GcEWCU/libsolv-rpm5.patch ']' + /bin/cat /tmp/B.GcEWCU/libsolv-rpm5.patch + /usr/bin/patch -s -p1 + /bin/rm '--interactive=never' cmake/modules/FindRuby.cmake + exit 0 Executing(%build): /bin/sh -e /tmp/B.GcEWCU/BUILD/tmp/rpm-tmp.20344 TMP=/home/users/builder/tmp HOME=/home/users/builder PATH=/usr/local/bin:/usr/bin:/bin:/home/users/builder/bin TMPDIR=/tmp/B.GcEWCU/BUILD/tmp + umask 022 + cd /tmp/B.GcEWCU/BUILD + cd libsolv-0.6.34 + install -d build build-py3 + cd build + CC=i686-pld-linux-gcc CXX=i686-pld-linux-g++ CPPFLAGS= /usr/bin/cmake '-DCMAKE_VERBOSE_MAKEFILE=ON' '-DCMAKE_BUILD_TYPE=PLD' '-DCMAKE_INSTALL_BINDIR:PATH=/usr/bin' '-DCMAKE_INSTALL_SBINDIR:PATH=/usr/sbin' '-DCMAKE_INSTALL_LIBEXECDIR:PATH=/usr/libexec' '-DCMAKE_INSTALL_SYSCONFDIR:PATH=/etc' '-DCMAKE_INSTALL_SHAREDSTATEDIRPATH:PATH=/var/lib' '-DCMAKE_INSTALL_LOCALSTATEDIRPATH:PATH=/var' '-DCMAKE_INSTALL_LIBDIR:PATH=/usr/lib' '-DCMAKE_INSTALL_INCLUDEDIR:PATH=/usr/include' '-DCMAKE_INSTALL_OLDINCLUDEDIR:PATH=/usr/include' '-DCMAKE_INSTALL_DATAROOTDIR:PATH=/usr/share' '-DCMAKE_INSTALL_DATADIR:PATH=/usr/share' '-DCMAKE_INSTALL_INFODIR:PATH=/usr/share/info' '-DCMAKE_INSTALL_LOCALEDIR:PATH=/usr/share/locale' '-DCMAKE_INSTALL_MANDIR:PATH=/usr/share/man' '-DCMAKE_INSTALL_DOCDIR:PATH=/usr/share/doc' '-DCMAKE_INSTALL_PREFIX:PATH=/usr' '-DSYSCONF_INSTALL_DIR:PATH=/etc' '-DCMAKE_CXX_FLAGS_PLD=-O2 -fwrapv -pipe -Wformat -Werror=format-security -gdwarf-4 -fno-debug-types-section -fvar-tracking-assignments -g2 -Wp,-D_FORTIFY_SOURCE=2 -fstack-protector-strong --param=ssp-buffer-size=4 -fomit-frame-pointer -march=i686 -fasynchronous-unwind-tables -mtune=pentium4 -gdwarf-4 -fno-debug-types-section -fvar-tracking-assignments -g2 -DNDEBUG -DQT_NO_DEBUG' '-DCMAKE_C_FLAGS_PLD=-O2 -fwrapv -pipe -Wformat -Werror=format-security -gdwarf-4 -fno-debug-types-section -fvar-tracking-assignments -g2 -Wp,-D_FORTIFY_SOURCE=2 -fstack-protector-strong --param=ssp-buffer-size=4 -fomit-frame-pointer -march=i686 -fasynchronous-unwind-tables -mtune=pentium4 -gdwarf-4 -fno-debug-types-section -fvar-tracking-assignments -g2 -DNDEBUG -DQT_NO_DEBUG' '-DCMAKE_Fortran_FLAGS_PLD=-O2 -fwrapv -pipe -Wformat -Werror=format-security -gdwarf-4 -fno-debug-types-section -fvar-tracking-assignments -g2 -Wp,-D_FORTIFY_SOURCE=2 -fstack-protector-strong --param=ssp-buffer-size=4 -fomit-frame-pointer -march=i686 -fasynchronous-unwind-tables -mtune=pentium4 -gdwarf-4 -fno-debug-types-section -fvar-tracking-assignments -g2 -DNDEBUG -DQT_NO_DEBUG' '-DCMAKE_EXE_LINKER_FLAGS_PLD=-Wl,--as-needed -Wl,--no-copy-dt-needed-entries -Wl,-z,relro -Wl,-z,combreloc ' '-DCMAKE_SHARED_LINKER_FLAGS_PLD=-Wl,--as-needed -Wl,--no-copy-dt-needed-entries -Wl,-z,relro -Wl,-z,combreloc ' '-DCMAKE_MODULE_LINKER_FLAGS_PLD=-Wl,--as-needed -Wl,--no-copy-dt-needed-entries -Wl,-z,relro -Wl,-z,combreloc ' '-DBUILD_SHARED_LIBS:BOOL=ON' .. '-DENABLE_APPDATA=ON' '-DENABLE_BZIP2_COMPRESSION=ON' '-DENABLE_COMPLEX_DEPS=ON' '-DENABLE_HELIXREPO=ON' '-DENABLE_LZMA_COMPRESSION=ON' '-DENABLE_PUBKEY=ON' '-DENABLE_RPMDB=ON' '-DENABLE_RPMDB_BYRPMHEADER=ON' '-DENABLE_RPMMD=ON' '-DENABLE_STATIC=ON' '-DRPM5=ON' '-DENABLE_PERL=ON' '-DENABLE_PYTHON=ON' '-DENABLE_RUBY=ON' '-DENABLE_TCL=ON' '-DPythonLibs_FIND_VERSION=2' '-DPythonLibs_FIND_VERSION_MAJOR=2' '-DUSE_VENDORDIRS=ON' -- The C compiler identification is GNU 8.2.0 -- The CXX compiler identification is GNU 8.2.0 -- Check for working C compiler: /usr/bin/i686-pld-linux-gcc -- Check for working C compiler: /usr/bin/i686-pld-linux-gcc -- works -- Detecting C compiler ABI info -- Detecting C compiler ABI info - done -- Detecting C compile features -- Detecting C compile features - done -- Check for working CXX compiler: /usr/bin/i686-pld-linux-g++ -- Check for working CXX compiler: /usr/bin/i686-pld-linux-g++ -- works -- Detecting CXX compiler ABI info -- Detecting CXX compiler ABI info - done -- Detecting CXX compile features -- Detecting CXX compile features - done CMake Deprecation Warning at CMakeLists.txt:44 (CMAKE_POLICY): The OLD behavior for policy CMP0005 will be removed from a future version of CMake. The cmake-policies(7) manual explains that the OLD behaviors of all policies are deprecated and that a policy should be set to OLD only under specific short-term circumstances. Projects should be ported to the NEW behavior and not rely on setting a policy to OLD. -- Libraries will be installed in /usr/lib -- Header files will be installed in /usr/include -- Man pages will be installed in /usr/share/man -- Building for no system -- Found ZLIB: /usr/lib/libz.so (found version "1.2.11") -- Found LZMA: /usr/lib/liblzma.so -- Found BZip2: /usr/lib/libbz2.so (found version "1.0.6") -- Looking for BZ2_bzCompressInit -- Looking for BZ2_bzCompressInit - found -- Enabling RPM 5 support -- Found PkgConfig: /usr/bin/pkg-config (found version "0.29.2") -- Checking for module 'rpm' -- Found rpm, version 5.4.15 -- Looking for rpm/db.h -- Looking for rpm/db.h - not found -- Looking for pgpDigGetParams in rpmio -- Looking for pgpDigGetParams in rpmio - not found -- Looking for strchrnul -- Looking for strchrnul - found -- Looking for fopencookie -- Looking for fopencookie - found -- Looking for funopen -- Looking for funopen - not found -- Check if the system is big endian -- Searching 16 bit integer -- Looking for sys/types.h -- Looking for sys/types.h - found -- Looking for stdint.h -- Looking for stdint.h - found -- Looking for stddef.h -- Looking for stddef.h - found -- Check size of unsigned short -- Check size of unsigned short - done -- Using unsigned short -- Check if the system is big endian - little endian -- Performing Test HAVE_LINKER_AS_NEEDED -- Performing Test HAVE_LINKER_AS_NEEDED - Success -- Performing Test HAVE_LINKER_VERSION_SCRIPT -- Performing Test HAVE_LINKER_VERSION_SCRIPT - Success -- Looking for modules in /tmp/B.GcEWCU/BUILD/libsolv-0.6.34/cmake/modules -- Looking for qsort_r -- Looking for qsort_r - found -- Looking for __qsort_r -- Looking for __qsort_r - not found -- Found SWIG: /usr/bin/swig (found version "3.0.12") -- Found SWIG version 3.0.12 -- Found PythonLibs: /usr/lib/libpython2.7.so (found suitable version "2.7.15", minimum required is "2") -- Found PythonInterp: /usr/bin/python2.7 (found suitable version "2.7.15", minimum required is "2.7.15") -- Python executable: /usr/bin/python2.7 -- Python installation dir: /usr/lib/python2.7/site-packages -- Python include path: /usr/include/python2.7 -- Found Perl: /usr/bin/perl (found version "5.28.0") -- Perl executable: /usr/bin/perl -- Perl installation dir: /usr/lib/perl5/vendor_perl/5.28.0/i686-pld-linux-thread-multi -- Found Ruby: /usr/bin/ruby (found version "2.4.4") -e:1:in `<main>': uninitialized constant Config (NameError) -- Ruby executable: /usr/bin/ruby -- Ruby installation dir: /usr/lib/ruby/vendor_ruby/2.4 -- Ruby include dir: /usr/include/ruby-2.4;/usr/include/ruby-2.4/ -- Found Tclsh: /usr/bin/tclsh (found version "8.6") -- Found TCL: /usr/lib/libtcl.so -- Found TCLTK: /usr/lib/libtcl.so -- Found TK: /usr/lib/libtk.so -- Tclsh executable: /usr/bin/tclsh -- Tcl installation dir: /usr/lib/tcl8/8.6 -- Version: 0.6.34 -- Writing spec file... -- Writing pkg-config files... -- Configuring done -- Generating done CMake Warning: Manually-specified variables were not used by the project: CMAKE_Fortran_FLAGS_PLD CMAKE_INSTALL_BINDIR CMAKE_INSTALL_DATADIR CMAKE_INSTALL_DATAROOTDIR CMAKE_INSTALL_DOCDIR CMAKE_INSTALL_INCLUDEDIR CMAKE_INSTALL_INFODIR CMAKE_INSTALL_LIBDIR CMAKE_INSTALL_LIBEXECDIR CMAKE_INSTALL_LOCALEDIR CMAKE_INSTALL_LOCALSTATEDIRPATH CMAKE_INSTALL_MANDIR CMAKE_INSTALL_OLDINCLUDEDIR CMAKE_INSTALL_SBINDIR CMAKE_INSTALL_SHAREDSTATEDIRPATH CMAKE_INSTALL_SYSCONFDIR SYSCONF_INSTALL_DIR -- Build files have been written to: /tmp/B.GcEWCU/BUILD/libsolv-0.6.34/build + /usr/bin/make -Otarget -j9 /usr/bin/cmake -H/tmp/B.GcEWCU/BUILD/libsolv-0.6.34 -B/tmp/B.GcEWCU/BUILD/libsolv-0.6.34/build --check-build-system CMakeFiles/Makefile.cmake 0 /usr/bin/cmake -E cmake_progress_start /tmp/B.GcEWCU/BUILD/libsolv-0.6.34/build/CMakeFiles /tmp/B.GcEWCU/BUILD/libsolv-0.6.34/build/CMakeFiles/progress.marks /usr/bin/make -f CMakeFiles/Makefile2 all /usr/bin/make -f src/CMakeFiles/libsolv_static.dir/build.make src/CMakeFiles/libsolv_static.dir/depend /usr/bin/make -f src/CMakeFiles/libsolv.dir/build.make src/CMakeFiles/libsolv.dir/depend /usr/bin/make -f ext/CMakeFiles/libsolvext_static.dir/build.make ext/CMakeFiles/libsolvext_static.dir/depend /usr/bin/make -f tools/CMakeFiles/toolstuff.dir/build.make tools/CMakeFiles/toolstuff.dir/depend /usr/bin/make -f bindings/tcl/CMakeFiles/solv_tm.dir/build.make bindings/tcl/CMakeFiles/solv_tm.dir/depend make[2]: Entering directory '/tmp/B.GcEWCU/BUILD/libsolv-0.6.34/build' cd /tmp/B.GcEWCU/BUILD/libsolv-0.6.34/build && /usr/bin/cmake -E cmake_depends "Unix Makefiles" /tmp/B.GcEWCU/BUILD/libsolv-0.6.34 /tmp/B.GcEWCU/BUILD/libsolv-0.6.34/bindings/tcl /tmp/B.GcEWCU/BUILD/libsolv-0.6.34/build /tmp/B.GcEWCU/BUILD/libsolv-0.6.34/build/bindings/tcl /tmp/B.GcEWCU/BUILD/libsolv-0.6.34/build/bindings/tcl/CMakeFiles/solv_tm.dir/DependInfo.cmake --color= Scanning dependencies of target solv_tm make[2]: Leaving directory '/tmp/B.GcEWCU/BUILD/libsolv-0.6.34/build' /usr/bin/make -f bindings/tcl/CMakeFiles/solv_tm.dir/build.make bindings/tcl/CMakeFiles/solv_tm.dir/build make[2]: Entering directory '/tmp/B.GcEWCU/BUILD/libsolv-0.6.34/build' cd /tmp/B.GcEWCU/BUILD/libsolv-0.6.34/build && /usr/bin/cmake -E cmake_depends "Unix Makefiles" /tmp/B.GcEWCU/BUILD/libsolv-0.6.34 /tmp/B.GcEWCU/BUILD/libsolv-0.6.34/tools /tmp/B.GcEWCU/BUILD/libsolv-0.6.34/build /tmp/B.GcEWCU/BUILD/libsolv-0.6.34/build/tools /tmp/B.GcEWCU/BUILD/libsolv-0.6.34/build/tools/CMakeFiles/toolstuff.dir/DependInfo.cmake --color= Scanning dependencies of target toolstuff make[2]: Leaving directory '/tmp/B.GcEWCU/BUILD/libsolv-0.6.34/build' /usr/bin/make -f tools/CMakeFiles/toolstuff.dir/build.make tools/CMakeFiles/toolstuff.dir/build make[2]: Entering directory '/tmp/B.GcEWCU/BUILD/libsolv-0.6.34/build' cd /tmp/B.GcEWCU/BUILD/libsolv-0.6.34/build && /usr/bin/cmake -E cmake_depends "Unix Makefiles" /tmp/B.GcEWCU/BUILD/libsolv-0.6.34 /tmp/B.GcEWCU/BUILD/libsolv-0.6.34/ext /tmp/B.GcEWCU/BUILD/libsolv-0.6.34/build /tmp/B.GcEWCU/BUILD/libsolv-0.6.34/build/ext /tmp/B.GcEWCU/BUILD/libsolv-0.6.34/build/ext/CMakeFiles/libsolvext_static.dir/DependInfo.cmake --color= Scanning dependencies of target libsolvext_static make[2]: Leaving directory '/tmp/B.GcEWCU/BUILD/libsolv-0.6.34/build' /usr/bin/make -f ext/CMakeFiles/libsolvext_static.dir/build.make ext/CMakeFiles/libsolvext_static.dir/build make[2]: Entering directory '/tmp/B.GcEWCU/BUILD/libsolv-0.6.34/build' [ 0%] Creating Tcl module to load libsolv cd /tmp/B.GcEWCU/BUILD/libsolv-0.6.34/build/bindings/tcl && sed -e s/__VERSION__/0.6.34/ /tmp/B.GcEWCU/BUILD/libsolv-0.6.34/bindings/tcl/solv.tm.in >/tmp/B.GcEWCU/BUILD/libsolv-0.6.34/build/bindings/tcl/solv.tm make[2]: Leaving directory '/tmp/B.GcEWCU/BUILD/libsolv-0.6.34/build' make[1]: Entering directory '/tmp/B.GcEWCU/BUILD/libsolv-0.6.34/build' [ 0%] Built target solv_tm make[1]: Leaving directory '/tmp/B.GcEWCU/BUILD/libsolv-0.6.34/build' make[2]: Entering directory '/tmp/B.GcEWCU/BUILD/libsolv-0.6.34/build' cd /tmp/B.GcEWCU/BUILD/libsolv-0.6.34/build && /usr/bin/cmake -E cmake_depends "Unix Makefiles" /tmp/B.GcEWCU/BUILD/libsolv-0.6.34 /tmp/B.GcEWCU/BUILD/libsolv-0.6.34/src /tmp/B.GcEWCU/BUILD/libsolv-0.6.34/build /tmp/B.GcEWCU/BUILD/libsolv-0.6.34/build/src /tmp/B.GcEWCU/BUILD/libsolv-0.6.34/build/src/CMakeFiles/libsolv.dir/DependInfo.cmake --color= Scanning dependencies of target libsolv make[2]: Leaving directory '/tmp/B.GcEWCU/BUILD/libsolv-0.6.34/build' /usr/bin/make -f src/CMakeFiles/libsolv.dir/build.make src/CMakeFiles/libsolv.dir/build make[2]: Entering directory '/tmp/B.GcEWCU/BUILD/libsolv-0.6.34/build' cd /tmp/B.GcEWCU/BUILD/libsolv-0.6.34/build && /usr/bin/cmake -E cmake_depends "Unix Makefiles" /tmp/B.GcEWCU/BUILD/libsolv-0.6.34 /tmp/B.GcEWCU/BUILD/libsolv-0.6.34/src /tmp/B.GcEWCU/BUILD/libsolv-0.6.34/build /tmp/B.GcEWCU/BUILD/libsolv-0.6.34/build/src /tmp/B.GcEWCU/BUILD/libsolv-0.6.34/build/src/CMakeFiles/libsolv_static.dir/DependInfo.cmake --color= Scanning dependencies of target libsolv_static make[2]: Leaving directory '/tmp/B.GcEWCU/BUILD/libsolv-0.6.34/build' /usr/bin/make -f src/CMakeFiles/libsolv_static.dir/build.make src/CMakeFiles/libsolv_static.dir/build make[2]: Entering directory '/tmp/B.GcEWCU/BUILD/libsolv-0.6.34/build' [ 3%] Building C object ext/CMakeFiles/libsolvext_static.dir/repo_pubkey.o cd /tmp/B.GcEWCU/BUILD/libsolv-0.6.34/build/ext && /usr/bin/i686-pld-linux-gcc -DENABLE_APPDATA=1 -DENABLE_BZIP2_COMPRESSION=1 -DENABLE_COMPLEX_DEPS=1 -DENABLE_HELIXREPO=1 -DENABLE_LZMA_COMPRESSION=1 -DENABLE_PGPVRFY=1 -DENABLE_PUBKEY=1 -DENABLE_RPMDB=1 -DENABLE_RPMDB_BYRPMHEADER=1 -DENABLE_RPMMD=1 -DENABLE_RPMPKG=1 -DENABLE_ZLIB_COMPRESSION=1 -DHAVE_FOPENCOOKIE=1 -DHAVE_STRCHRNUL=1 -DRPM5 -D_FILE_OFFSET_BITS=64 -I/usr/include/rpm -I/tmp/B.GcEWCU/BUILD/libsolv-0.6.34 -I/tmp/B.GcEWCU/BUILD/libsolv-0.6.34/src -I/tmp/B.GcEWCU/BUILD/libsolv-0.6.34/ext -I/tmp/B.GcEWCU/BUILD/libsolv-0.6.34/build -I/tmp/B.GcEWCU/BUILD/libsolv-0.6.34/build/src -Wall -fPIC -O2 -fwrapv -pipe -Wformat -Werror=format-security -gdwarf-4 -fno-debug-types-section -fvar-tracking-assignments -g2 -Wp,-D_FORTIFY_SOURCE=2 -fstack-protector-strong --param=ssp-buffer-size=4 -fomit-frame-pointer -march=i686 -fasynchronous-unwind-tables -mtune=pentium4 -gdwarf-4 -fno-debug-types-section -fvar-tracking-assignments -g2 -DNDEBUG -DQT_NO_DEBUG -DVERSION=\"0.6.34\" -o CMakeFiles/libsolvext_static.dir/repo_pubkey.o -c /tmp/B.GcEWCU/BUILD/libsolv-0.6.34/ext/repo_pubkey.c In file included from /tmp/B.GcEWCU/BUILD/libsolv-0.6.34/ext/repo_pubkey.c:26: /usr/include/rpm/rpmio.h:28:9: error: unknown type name 'off64_t' typedef off64_t _libio_off_t; ^~~~~~~ make[2]: *** [ext/CMakeFiles/libsolvext_static.dir/build.make:118: ext/CMakeFiles/libsolvext_static.dir/repo_pubkey.o] Error 1 make[2]: Leaving directory '/tmp/B.GcEWCU/BUILD/libsolv-0.6.34/build' make[2]: Entering directory '/tmp/B.GcEWCU/BUILD/libsolv-0.6.34/build' [ 5%] Building C object src/CMakeFiles/libsolv_static.dir/bitmap.o cd /tmp/B.GcEWCU/BUILD/libsolv-0.6.34/build/src && /usr/bin/i686-pld-linux-gcc -DENABLE_APPDATA=1 -DENABLE_BZIP2_COMPRESSION=1 -DENABLE_COMPLEX_DEPS=1 -DENABLE_HELIXREPO=1 -DENABLE_LZMA_COMPRESSION=1 -DENABLE_PGPVRFY=1 -DENABLE_PUBKEY=1 -DENABLE_RPMDB=1 -DENABLE_RPMDB_BYRPMHEADER=1 -DENABLE_RPMMD=1 -DENABLE_RPMPKG=1 -DENABLE_ZLIB_COMPRESSION=1 -DHAVE_FOPENCOOKIE=1 -DHAVE_QSORT_R=1 -DHAVE_STRCHRNUL=1 -DLIBSOLV_INTERNAL=1 -DRPM5 -D_FILE_OFFSET_BITS=64 -I/usr/include/rpm -I/tmp/B.GcEWCU/BUILD/libsolv-0.6.34 -I/tmp/B.GcEWCU/BUILD/libsolv-0.6.34/src -I/tmp/B.GcEWCU/BUILD/libsolv-0.6.34/ext -I/tmp/B.GcEWCU/BUILD/libsolv-0.6.34/build -I/tmp/B.GcEWCU/BUILD/libsolv-0.6.34/build/src -Wall -fPIC -O2 -fwrapv -pipe -Wformat -Werror=format-security -gdwarf-4 -fno-debug-types-section -fvar-tracking-assignments -g2 -Wp,-D_FORTIFY_SOURCE=2 -fstack-protector-strong --param=ssp-buffer-size=4 -fomit-frame-pointer -march=i686 -fasynchronous-unwind-tables -mtune=pentium4 -gdwarf-4 -fno-debug-types-section -fvar-tracking-assignments -g2 -DNDEBUG -DQT_NO_DEBUG -DVERSION=\"0.6.34\" -o CMakeFiles/libsolv_static.dir/bitmap.o -c /tmp/B.GcEWCU/BUILD/libsolv-0.6.34/src/bitmap.c make[2]: Leaving directory '/tmp/B.GcEWCU/BUILD/libsolv-0.6.34/build' make[2]: *** Waiting for unfinished jobs.... make[2]: Entering directory '/tmp/B.GcEWCU/BUILD/libsolv-0.6.34/build' [ 5%] Building C object src/CMakeFiles/libsolv.dir/bitmap.o cd /tmp/B.GcEWCU/BUILD/libsolv-0.6.34/build/src && /usr/bin/i686-pld-linux-gcc -DENABLE_APPDATA=1 -DENABLE_BZIP2_COMPRESSION=1 -DENABLE_COMPLEX_DEPS=1 -DENABLE_HELIXREPO=1 -DENABLE_LZMA_COMPRESSION=1 -DENABLE_PGPVRFY=1 -DENABLE_PUBKEY=1 -DENABLE_RPMDB=1 -DENABLE_RPMDB_BYRPMHEADER=1 -DENABLE_RPMMD=1 -DENABLE_RPMPKG=1 -DENABLE_ZLIB_COMPRESSION=1 -DHAVE_FOPENCOOKIE=1 -DHAVE_QSORT_R=1 -DHAVE_STRCHRNUL=1 -DLIBSOLV_INTERNAL=1 -DRPM5 -D_FILE_OFFSET_BITS=64 -Dlibsolv_EXPORTS -I/usr/include/rpm -I/tmp/B.GcEWCU/BUILD/libsolv-0.6.34 -I/tmp/B.GcEWCU/BUILD/libsolv-0.6.34/src -I/tmp/B.GcEWCU/BUILD/libsolv-0.6.34/ext -I/tmp/B.GcEWCU/BUILD/libsolv-0.6.34/build -I/tmp/B.GcEWCU/BUILD/libsolv-0.6.34/build/src -Wall -fPIC -O2 -fwrapv -pipe -Wformat -Werror=format-security -gdwarf-4 -fno-debug-types-section -fvar-tracking-assignments -g2 -Wp,-D_FORTIFY_SOURCE=2 -fstack-protector-strong --param=ssp-buffer-size=4 -fomit-frame-pointer -march=i686 -fasynchronous-unwind-tables -mtune=pentium4 -gdwarf-4 -fno-debug-types-section -fvar-tracking-assignments -g2 -DNDEBUG -DQT_NO_DEBUG -fPIC -DVERSION=\"0.6.34\" -o CMakeFiles/libsolv.dir/bitmap.o -c /tmp/B.GcEWCU/BUILD/libsolv-0.6.34/src/bitmap.c make[2]: Leaving directory '/tmp/B.GcEWCU/BUILD/libsolv-0.6.34/build' make[2]: Entering directory '/tmp/B.GcEWCU/BUILD/libsolv-0.6.34/build' [ 0%] Building C object tools/CMakeFiles/toolstuff.dir/common_write.o cd /tmp/B.GcEWCU/BUILD/libsolv-0.6.34/build/tools && /usr/bin/i686-pld-linux-gcc -DENABLE_APPDATA=1 -DENABLE_BZIP2_COMPRESSION=1 -DENABLE_COMPLEX_DEPS=1 -DENABLE_HELIXREPO=1 -DENABLE_LZMA_COMPRESSION=1 -DENABLE_PGPVRFY=1 -DENABLE_PUBKEY=1 -DENABLE_RPMDB=1 -DENABLE_RPMDB_BYRPMHEADER=1 -DENABLE_RPMMD=1 -DENABLE_RPMPKG=1 -DENABLE_ZLIB_COMPRESSION=1 -DHAVE_FOPENCOOKIE=1 -DHAVE_STRCHRNUL=1 -DRPM5 -D_FILE_OFFSET_BITS=64 -I/usr/include/rpm -I/tmp/B.GcEWCU/BUILD/libsolv-0.6.34 -I/tmp/B.GcEWCU/BUILD/libsolv-0.6.34/src -I/tmp/B.GcEWCU/BUILD/libsolv-0.6.34/ext -I/tmp/B.GcEWCU/BUILD/libsolv-0.6.34/build -I/tmp/B.GcEWCU/BUILD/libsolv-0.6.34/build/src -Wall -O2 -fwrapv -pipe -Wformat -Werror=format-security -gdwarf-4 -fno-debug-types-section -fvar-tracking-assignments -g2 -Wp,-D_FORTIFY_SOURCE=2 -fstack-protector-strong --param=ssp-buffer-size=4 -fomit-frame-pointer -march=i686 -fasynchronous-unwind-tables -mtune=pentium4 -gdwarf-4 -fno-debug-types-section -fvar-tracking-assignments -g2 -DNDEBUG -DQT_NO_DEBUG -DVERSION=\"0.6.34\" -o CMakeFiles/toolstuff.dir/common_write.o -c /tmp/B.GcEWCU/BUILD/libsolv-0.6.34/tools/common_write.c make[2]: Leaving directory '/tmp/B.GcEWCU/BUILD/libsolv-0.6.34/build' make[2]: Entering directory '/tmp/B.GcEWCU/BUILD/libsolv-0.6.34/build' [ 4%] Building C object ext/CMakeFiles/libsolvext_static.dir/repo_rpmdb.o cd /tmp/B.GcEWCU/BUILD/libsolv-0.6.34/build/ext && /usr/bin/i686-pld-linux-gcc -DENABLE_APPDATA=1 -DENABLE_BZIP2_COMPRESSION=1 -DENABLE_COMPLEX_DEPS=1 -DENABLE_HELIXREPO=1 -DENABLE_LZMA_COMPRESSION=1 -DENABLE_PGPVRFY=1 -DENABLE_PUBKEY=1 -DENABLE_RPMDB=1 -DENABLE_RPMDB_BYRPMHEADER=1 -DENABLE_RPMMD=1 -DENABLE_RPMPKG=1 -DENABLE_ZLIB_COMPRESSION=1 -DHAVE_FOPENCOOKIE=1 -DHAVE_STRCHRNUL=1 -DRPM5 -D_FILE_OFFSET_BITS=64 -I/usr/include/rpm -I/tmp/B.GcEWCU/BUILD/libsolv-0.6.34 -I/tmp/B.GcEWCU/BUILD/libsolv-0.6.34/src -I/tmp/B.GcEWCU/BUILD/libsolv-0.6.34/ext -I/tmp/B.GcEWCU/BUILD/libsolv-0.6.34/build -I/tmp/B.GcEWCU/BUILD/libsolv-0.6.34/build/src -Wall -fPIC -O2 -fwrapv -pipe -Wformat -Werror=format-security -gdwarf-4 -fno-debug-types-section -fvar-tracking-assignments -g2 -Wp,-D_FORTIFY_SOURCE=2 -fstack-protector-strong --param=ssp-buffer-size=4 -fomit-frame-pointer -march=i686 -fasynchronous-unwind-tables -mtune=pentium4 -gdwarf-4 -fno-debug-types-section -fvar-tracking-assignments -g2 -DNDEBUG -DQT_NO_DEBUG -DVERSION=\"0.6.34\" -o CMakeFiles/libsolvext_static.dir/repo_rpmdb.o -c /tmp/B.GcEWCU/BUILD/libsolv-0.6.34/ext/repo_rpmdb.c In file included from /tmp/B.GcEWCU/BUILD/libsolv-0.6.34/ext/repo_rpmdb.c:29: /usr/include/rpm/rpmio.h:28:9: error: unknown type name 'off64_t' typedef off64_t _libio_off_t; ^~~~~~~ make[2]: *** [ext/CMakeFiles/libsolvext_static.dir/build.make:105: ext/CMakeFiles/libsolvext_static.dir/repo_rpmdb.o] Error 1 make[2]: Leaving directory '/tmp/B.GcEWCU/BUILD/libsolv-0.6.34/build' make[2]: Entering directory '/tmp/B.GcEWCU/BUILD/libsolv-0.6.34/build' [ 6%] Building C object src/CMakeFiles/libsolv_static.dir/poolarch.o cd /tmp/B.GcEWCU/BUILD/libsolv-0.6.34/build/src && /usr/bin/i686-pld-linux-gcc -DENABLE_APPDATA=1 -DENABLE_BZIP2_COMPRESSION=1 -DENABLE_COMPLEX_DEPS=1 -DENABLE_HELIXREPO=1 -DENABLE_LZMA_COMPRESSION=1 -DENABLE_PGPVRFY=1 -DENABLE_PUBKEY=1 -DENABLE_RPMDB=1 -DENABLE_RPMDB_BYRPMHEADER=1 -DENABLE_RPMMD=1 -DENABLE_RPMPKG=1 -DENABLE_ZLIB_COMPRESSION=1 -DHAVE_FOPENCOOKIE=1 -DHAVE_QSORT_R=1 -DHAVE_STRCHRNUL=1 -DLIBSOLV_INTERNAL=1 -DRPM5 -D_FILE_OFFSET_BITS=64 -I/usr/include/rpm -I/tmp/B.GcEWCU/BUILD/libsolv-0.6.34 -I/tmp/B.GcEWCU/BUILD/libsolv-0.6.34/src -I/tmp/B.GcEWCU/BUILD/libsolv-0.6.34/ext -I/tmp/B.GcEWCU/BUILD/libsolv-0.6.34/build -I/tmp/B.GcEWCU/BUILD/libsolv-0.6.34/build/src -Wall -fPIC -O2 -fwrapv -pipe -Wformat -Werror=format-security -gdwarf-4 -fno-debug-types-section -fvar-tracking-assignments -g2 -Wp,-D_FORTIFY_SOURCE=2 -fstack-protector-strong --param=ssp-buffer-size=4 -fomit-frame-pointer -march=i686 -fasynchronous-unwind-tables -mtune=pentium4 -gdwarf-4 -fno-debug-types-section -fvar-tracking-assignments -g2 -DNDEBUG -DQT_NO_DEBUG -DVERSION=\"0.6.34\" -o CMakeFiles/libsolv_static.dir/poolarch.o -c /tmp/B.GcEWCU/BUILD/libsolv-0.6.34/src/poolarch.c make[2]: Leaving directory '/tmp/B.GcEWCU/BUILD/libsolv-0.6.34/build' make[2]: Entering directory '/tmp/B.GcEWCU/BUILD/libsolv-0.6.34/build' [ 8%] Linking C static library libtoolstuff.a cd /tmp/B.GcEWCU/BUILD/libsolv-0.6.34/build/tools && /usr/bin/cmake -P CMakeFiles/toolstuff.dir/cmake_clean_target.cmake cd /tmp/B.GcEWCU/BUILD/libsolv-0.6.34/build/tools && /usr/bin/cmake -E cmake_link_script CMakeFiles/toolstuff.dir/link.txt --verbose=1 /usr/bin/ar qc libtoolstuff.a CMakeFiles/toolstuff.dir/common_write.o /usr/bin/ranlib libtoolstuff.a make[2]: Leaving directory '/tmp/B.GcEWCU/BUILD/libsolv-0.6.34/build' make[2]: Entering directory '/tmp/B.GcEWCU/BUILD/libsolv-0.6.34/build' [ 1%] Building C object ext/CMakeFiles/libsolvext_static.dir/solv_xfopen.o cd /tmp/B.GcEWCU/BUILD/libsolv-0.6.34/build/ext && /usr/bin/i686-pld-linux-gcc -DENABLE_APPDATA=1 -DENABLE_BZIP2_COMPRESSION=1 -DENABLE_COMPLEX_DEPS=1 -DENABLE_HELIXREPO=1 -DENABLE_LZMA_COMPRESSION=1 -DENABLE_PGPVRFY=1 -DENABLE_PUBKEY=1 -DENABLE_RPMDB=1 -DENABLE_RPMDB_BYRPMHEADER=1 -DENABLE_RPMMD=1 -DENABLE_RPMPKG=1 -DENABLE_ZLIB_COMPRESSION=1 -DHAVE_FOPENCOOKIE=1 -DHAVE_STRCHRNUL=1 -DRPM5 -D_FILE_OFFSET_BITS=64 -I/usr/include/rpm -I/tmp/B.GcEWCU/BUILD/libsolv-0.6.34 -I/tmp/B.GcEWCU/BUILD/libsolv-0.6.34/src -I/tmp/B.GcEWCU/BUILD/libsolv-0.6.34/ext -I/tmp/B.GcEWCU/BUILD/libsolv-0.6.34/build -I/tmp/B.GcEWCU/BUILD/libsolv-0.6.34/build/src -Wall -fPIC -O2 -fwrapv -pipe -Wformat -Werror=format-security -gdwarf-4 -fno-debug-types-section -fvar-tracking-assignments -g2 -Wp,-D_FORTIFY_SOURCE=2 -fstack-protector-strong --param=ssp-buffer-size=4 -fomit-frame-pointer -march=i686 -fasynchronous-unwind-tables -mtune=pentium4 -gdwarf-4 -fno-debug-types-section -fvar-tracking-assignments -g2 -DNDEBUG -DQT_NO_DEBUG -DVERSION=\"0.6.34\" -o CMakeFiles/libsolvext_static.dir/solv_xfopen.o -c /tmp/B.GcEWCU/BUILD/libsolv-0.6.34/ext/solv_xfopen.c make[2]: Leaving directory '/tmp/B.GcEWCU/BUILD/libsolv-0.6.34/build' make[2]: Entering directory '/tmp/B.GcEWCU/BUILD/libsolv-0.6.34/build' [ 6%] Building C object src/CMakeFiles/libsolv.dir/poolarch.o cd /tmp/B.GcEWCU/BUILD/libsolv-0.6.34/build/src && /usr/bin/i686-pld-linux-gcc -DENABLE_APPDATA=1 -DENABLE_BZIP2_COMPRESSION=1 -DENABLE_COMPLEX_DEPS=1 -DENABLE_HELIXREPO=1 -DENABLE_LZMA_COMPRESSION=1 -DENABLE_PGPVRFY=1 -DENABLE_PUBKEY=1 -DENABLE_RPMDB=1 -DENABLE_RPMDB_BYRPMHEADER=1 -DENABLE_RPMMD=1 -DENABLE_RPMPKG=1 -DENABLE_ZLIB_COMPRESSION=1 -DHAVE_FOPENCOOKIE=1 -DHAVE_QSORT_R=1 -DHAVE_STRCHRNUL=1 -DLIBSOLV_INTERNAL=1 -DRPM5 -D_FILE_OFFSET_BITS=64 -Dlibsolv_EXPORTS -I/usr/include/rpm -I/tmp/B.GcEWCU/BUILD/libsolv-0.6.34 -I/tmp/B.GcEWCU/BUILD/libsolv-0.6.34/src -I/tmp/B.GcEWCU/BUILD/libsolv-0.6.34/ext -I/tmp/B.GcEWCU/BUILD/libsolv-0.6.34/build -I/tmp/B.GcEWCU/BUILD/libsolv-0.6.34/build/src -Wall -fPIC -O2 -fwrapv -pipe -Wformat -Werror=format-security -gdwarf-4 -fno-debug-types-section -fvar-tracking-assignments -g2 -Wp,-D_FORTIFY_SOURCE=2 -fstack-protector-strong --param=ssp-buffer-size=4 -fomit-frame-pointer -march=i686 -fasynchronous-unwind-tables -mtune=pentium4 -gdwarf-4 -fno-debug-types-section -fvar-tracking-assignments -g2 -DNDEBUG -DQT_NO_DEBUG -fPIC -DVERSION=\"0.6.34\" -o CMakeFiles/libsolv.dir/poolarch.o -c /tmp/B.GcEWCU/BUILD/libsolv-0.6.34/src/poolarch.c make[2]: Leaving directory '/tmp/B.GcEWCU/BUILD/libsolv-0.6.34/build' make[1]: Entering directory '/tmp/B.GcEWCU/BUILD/libsolv-0.6.34/build' [ 11%] Built target toolstuff make[1]: Leaving directory '/tmp/B.GcEWCU/BUILD/libsolv-0.6.34/build' make[2]: Entering directory '/tmp/B.GcEWCU/BUILD/libsolv-0.6.34/build' [ 7%] Building C object src/CMakeFiles/libsolv.dir/poolvendor.o cd /tmp/B.GcEWCU/BUILD/libsolv-0.6.34/build/src && /usr/bin/i686-pld-linux-gcc -DENABLE_APPDATA=1 -DENABLE_BZIP2_COMPRESSION=1 -DENABLE_COMPLEX_DEPS=1 -DENABLE_HELIXREPO=1 -DENABLE_LZMA_COMPRESSION=1 -DENABLE_PGPVRFY=1 -DENABLE_PUBKEY=1 -DENABLE_RPMDB=1 -DENABLE_RPMDB_BYRPMHEADER=1 -DENABLE_RPMMD=1 -DENABLE_RPMPKG=1 -DENABLE_ZLIB_COMPRESSION=1 -DHAVE_FOPENCOOKIE=1 -DHAVE_QSORT_R=1 -DHAVE_STRCHRNUL=1 -DLIBSOLV_INTERNAL=1 -DRPM5 -D_FILE_OFFSET_BITS=64 -Dlibsolv_EXPORTS -I/usr/include/rpm -I/tmp/B.GcEWCU/BUILD/libsolv-0.6.34 -I/tmp/B.GcEWCU/BUILD/libsolv-0.6.34/src -I/tmp/B.GcEWCU/BUILD/libsolv-0.6.34/ext -I/tmp/B.GcEWCU/BUILD/libsolv-0.6.34/build -I/tmp/B.GcEWCU/BUILD/libsolv-0.6.34/build/src -Wall -fPIC -O2 -fwrapv -pipe -Wformat -Werror=format-security -gdwarf-4 -fno-debug-types-section -fvar-tracking-assignments -g2 -Wp,-D_FORTIFY_SOURCE=2 -fstack-protector-strong --param=ssp-buffer-size=4 -fomit-frame-pointer -march=i686 -fasynchronous-unwind-tables -mtune=pentium4 -gdwarf-4 -fno-debug-types-section -fvar-tracking-assignments -g2 -DNDEBUG -DQT_NO_DEBUG -fPIC -DVERSION=\"0.6.34\" -o CMakeFiles/libsolv.dir/poolvendor.o -c /tmp/B.GcEWCU/BUILD/libsolv-0.6.34/src/poolvendor.c make[2]: Leaving directory '/tmp/B.GcEWCU/BUILD/libsolv-0.6.34/build' make[2]: Entering directory '/tmp/B.GcEWCU/BUILD/libsolv-0.6.34/build' [ 2%] Building C object ext/CMakeFiles/libsolvext_static.dir/solv_pgpvrfy.o cd /tmp/B.GcEWCU/BUILD/libsolv-0.6.34/build/ext && /usr/bin/i686-pld-linux-gcc -DENABLE_APPDATA=1 -DENABLE_BZIP2_COMPRESSION=1 -DENABLE_COMPLEX_DEPS=1 -DENABLE_HELIXREPO=1 -DENABLE_LZMA_COMPRESSION=1 -DENABLE_PGPVRFY=1 -DENABLE_PUBKEY=1 -DENABLE_RPMDB=1 -DENABLE_RPMDB_BYRPMHEADER=1 -DENABLE_RPMMD=1 -DENABLE_RPMPKG=1 -DENABLE_ZLIB_COMPRESSION=1 -DHAVE_FOPENCOOKIE=1 -DHAVE_STRCHRNUL=1 -DRPM5 -D_FILE_OFFSET_BITS=64 -I/usr/include/rpm -I/tmp/B.GcEWCU/BUILD/libsolv-0.6.34 -I/tmp/B.GcEWCU/BUILD/libsolv-0.6.34/src -I/tmp/B.GcEWCU/BUILD/libsolv-0.6.34/ext -I/tmp/B.GcEWCU/BUILD/libsolv-0.6.34/build -I/tmp/B.GcEWCU/BUILD/libsolv-0.6.34/build/src -Wall -fPIC -O2 -fwrapv -pipe -Wformat -Werror=format-security -gdwarf-4 -fno-debug-types-section -fvar-tracking-assignments -g2 -Wp,-D_FORTIFY_SOURCE=2 -fstack-protector-strong --param=ssp-buffer-size=4 -fomit-frame-pointer -march=i686 -fasynchronous-unwind-tables -mtune=pentium4 -gdwarf-4 -fno-debug-types-section -fvar-tracking-assignments -g2 -DNDEBUG -DQT_NO_DEBUG -DVERSION=\"0.6.34\" -o CMakeFiles/libsolvext_static.dir/solv_pgpvrfy.o -c /tmp/B.GcEWCU/BUILD/libsolv-0.6.34/ext/solv_pgpvrfy.c make[2]: Leaving directory '/tmp/B.GcEWCU/BUILD/libsolv-0.6.34/build' make[2]: Entering directory '/tmp/B.GcEWCU/BUILD/libsolv-0.6.34/build' [ 11%] Building C object src/CMakeFiles/libsolv.dir/strpool.o cd /tmp/B.GcEWCU/BUILD/libsolv-0.6.34/build/src && /usr/bin/i686-pld-linux-gcc -DENABLE_APPDATA=1 -DENABLE_BZIP2_COMPRESSION=1 -DENABLE_COMPLEX_DEPS=1 -DENABLE_HELIXREPO=1 -DENABLE_LZMA_COMPRESSION=1 -DENABLE_PGPVRFY=1 -DENABLE_PUBKEY=1 -DENABLE_RPMDB=1 -DENABLE_RPMDB_BYRPMHEADER=1 -DENABLE_RPMMD=1 -DENABLE_RPMPKG=1 -DENABLE_ZLIB_COMPRESSION=1 -DHAVE_FOPENCOOKIE=1 -DHAVE_QSORT_R=1 -DHAVE_STRCHRNUL=1 -DLIBSOLV_INTERNAL=1 -DRPM5 -D_FILE_OFFSET_BITS=64 -Dlibsolv_EXPORTS -I/usr/include/rpm -I/tmp/B.GcEWCU/BUILD/libsolv-0.6.34 -I/tmp/B.GcEWCU/BUILD/libsolv-0.6.34/src -I/tmp/B.GcEWCU/BUILD/libsolv-0.6.34/ext -I/tmp/B.GcEWCU/BUILD/libsolv-0.6.34/build -I/tmp/B.GcEWCU/BUILD/libsolv-0.6.34/build/src -Wall -fPIC -O2 -fwrapv -pipe -Wformat -Werror=format-security -gdwarf-4 -fno-debug-types-section -fvar-tracking-assignments -g2 -Wp,-D_FORTIFY_SOURCE=2 -fstack-protector-strong --param=ssp-buffer-size=4 -fomit-frame-pointer -march=i686 -fasynchronous-unwind-tables -mtune=pentium4 -gdwarf-4 -fno-debug-types-section -fvar-tracking-assignments -g2 -DNDEBUG -DQT_NO_DEBUG -fPIC -DVERSION=\"0.6.34\" -o CMakeFiles/libsolv.dir/strpool.o -c /tmp/B.GcEWCU/BUILD/libsolv-0.6.34/src/strpool.c make[2]: Leaving directory '/tmp/B.GcEWCU/BUILD/libsolv-0.6.34/build' make[2]: Entering directory '/tmp/B.GcEWCU/BUILD/libsolv-0.6.34/build' [ 9%] Building C object src/CMakeFiles/libsolv.dir/poolid.o cd /tmp/B.GcEWCU/BUILD/libsolv-0.6.34/build/src && /usr/bin/i686-pld-linux-gcc -DENABLE_APPDATA=1 -DENABLE_BZIP2_COMPRESSION=1 -DENABLE_COMPLEX_DEPS=1 -DENABLE_HELIXREPO=1 -DENABLE_LZMA_COMPRESSION=1 -DENABLE_PGPVRFY=1 -DENABLE_PUBKEY=1 -DENABLE_RPMDB=1 -DENABLE_RPMDB_BYRPMHEADER=1 -DENABLE_RPMMD=1 -DENABLE_RPMPKG=1 -DENABLE_ZLIB_COMPRESSION=1 -DHAVE_FOPENCOOKIE=1 -DHAVE_QSORT_R=1 -DHAVE_STRCHRNUL=1 -DLIBSOLV_INTERNAL=1 -DRPM5 -D_FILE_OFFSET_BITS=64 -Dlibsolv_EXPORTS -I/usr/include/rpm -I/tmp/B.GcEWCU/BUILD/libsolv-0.6.34 -I/tmp/B.GcEWCU/BUILD/libsolv-0.6.34/src -I/tmp/B.GcEWCU/BUILD/libsolv-0.6.34/ext -I/tmp/B.GcEWCU/BUILD/libsolv-0.6.34/build -I/tmp/B.GcEWCU/BUILD/libsolv-0.6.34/build/src -Wall -fPIC -O2 -fwrapv -pipe -Wformat -Werror=format-security -gdwarf-4 -fno-debug-types-section -fvar-tracking-assignments -g2 -Wp,-D_FORTIFY_SOURCE=2 -fstack-protector-strong --param=ssp-buffer-size=4 -fomit-frame-pointer -march=i686 -fasynchronous-unwind-tables -mtune=pentium4 -gdwarf-4 -fno-debug-types-section -fvar-tracking-assignments -g2 -DNDEBUG -DQT_NO_DEBUG -fPIC -DVERSION=\"0.6.34\" -o CMakeFiles/libsolv.dir/poolid.o -c /tmp/B.GcEWCU/BUILD/libsolv-0.6.34/src/poolid.c make[2]: Leaving directory '/tmp/B.GcEWCU/BUILD/libsolv-0.6.34/build' make[2]: Entering directory '/tmp/B.GcEWCU/BUILD/libsolv-0.6.34/build' [ 12%] Building C object src/CMakeFiles/libsolv.dir/dirpool.o cd /tmp/B.GcEWCU/BUILD/libsolv-0.6.34/build/src && /usr/bin/i686-pld-linux-gcc -DENABLE_APPDATA=1 -DENABLE_BZIP2_COMPRESSION=1 -DENABLE_COMPLEX_DEPS=1 -DENABLE_HELIXREPO=1 -DENABLE_LZMA_COMPRESSION=1 -DENABLE_PGPVRFY=1 -DENABLE_PUBKEY=1 -DENABLE_RPMDB=1 -DENABLE_RPMDB_BYRPMHEADER=1 -DENABLE_RPMMD=1 -DENABLE_RPMPKG=1 -DENABLE_ZLIB_COMPRESSION=1 -DHAVE_FOPENCOOKIE=1 -DHAVE_QSORT_R=1 -DHAVE_STRCHRNUL=1 -DLIBSOLV_INTERNAL=1 -DRPM5 -D_FILE_OFFSET_BITS=64 -Dlibsolv_EXPORTS -I/usr/include/rpm -I/tmp/B.GcEWCU/BUILD/libsolv-0.6.34 -I/tmp/B.GcEWCU/BUILD/libsolv-0.6.34/src -I/tmp/B.GcEWCU/BUILD/libsolv-0.6.34/ext -I/tmp/B.GcEWCU/BUILD/libsolv-0.6.34/build -I/tmp/B.GcEWCU/BUILD/libsolv-0.6.34/build/src -Wall -fPIC -O2 -fwrapv -pipe -Wformat -Werror=format-security -gdwarf-4 -fno-debug-types-section -fvar-tracking-assignments -g2 -Wp,-D_FORTIFY_SOURCE=2 -fstack-protector-strong --param=ssp-buffer-size=4 -fomit-frame-pointer -march=i686 -fasynchronous-unwind-tables -mtune=pentium4 -gdwarf-4 -fno-debug-types-section -fvar-tracking-assignments -g2 -DNDEBUG -DQT_NO_DEBUG -fPIC -DVERSION=\"0.6.34\" -o CMakeFiles/libsolv.dir/dirpool.o -c /tmp/B.GcEWCU/BUILD/libsolv-0.6.34/src/dirpool.c make[2]: Leaving directory '/tmp/B.GcEWCU/BUILD/libsolv-0.6.34/build' make[2]: Entering directory '/tmp/B.GcEWCU/BUILD/libsolv-0.6.34/build' [ 15%] Building C object src/CMakeFiles/libsolv.dir/evr.o cd /tmp/B.GcEWCU/BUILD/libsolv-0.6.34/build/src && /usr/bin/i686-pld-linux-gcc -DENABLE_APPDATA=1 -DENABLE_BZIP2_COMPRESSION=1 -DENABLE_COMPLEX_DEPS=1 -DENABLE_HELIXREPO=1 -DENABLE_LZMA_COMPRESSION=1 -DENABLE_PGPVRFY=1 -DENABLE_PUBKEY=1 -DENABLE_RPMDB=1 -DENABLE_RPMDB_BYRPMHEADER=1 -DENABLE_RPMMD=1 -DENABLE_RPMPKG=1 -DENABLE_ZLIB_COMPRESSION=1 -DHAVE_FOPENCOOKIE=1 -DHAVE_QSORT_R=1 -DHAVE_STRCHRNUL=1 -DLIBSOLV_INTERNAL=1 -DRPM5 -D_FILE_OFFSET_BITS=64 -Dlibsolv_EXPORTS -I/usr/include/rpm -I/tmp/B.GcEWCU/BUILD/libsolv-0.6.34 -I/tmp/B.GcEWCU/BUILD/libsolv-0.6.34/src -I/tmp/B.GcEWCU/BUILD/libsolv-0.6.34/ext -I/tmp/B.GcEWCU/BUILD/libsolv-0.6.34/build -I/tmp/B.GcEWCU/BUILD/libsolv-0.6.34/build/src -Wall -fPIC -O2 -fwrapv -pipe -Wformat -Werror=format-security -gdwarf-4 -fno-debug-types-section -fvar-tracking-assignments -g2 -Wp,-D_FORTIFY_SOURCE=2 -fstack-protector-strong --param=ssp-buffer-size=4 -fomit-frame-pointer -march=i686 -fasynchronous-unwind-tables -mtune=pentium4 -gdwarf-4 -fno-debug-types-section -fvar-tracking-assignments -g2 -DNDEBUG -DQT_NO_DEBUG -fPIC -DVERSION=\"0.6.34\" -o CMakeFiles/libsolv.dir/evr.o -c /tmp/B.GcEWCU/BUILD/libsolv-0.6.34/src/evr.c make[2]: Leaving directory '/tmp/B.GcEWCU/BUILD/libsolv-0.6.34/build' make[2]: Entering directory '/tmp/B.GcEWCU/BUILD/libsolv-0.6.34/build' [ 13%] Building C object src/CMakeFiles/libsolv.dir/solverdebug.o cd /tmp/B.GcEWCU/BUILD/libsolv-0.6.34/build/src && /usr/bin/i686-pld-linux-gcc -DENABLE_APPDATA=1 -DENABLE_BZIP2_COMPRESSION=1 -DENABLE_COMPLEX_DEPS=1 -DENABLE_HELIXREPO=1 -DENABLE_LZMA_COMPRESSION=1 -DENABLE_PGPVRFY=1 -DENABLE_PUBKEY=1 -DENABLE_RPMDB=1 -DENABLE_RPMDB_BYRPMHEADER=1 -DENABLE_RPMMD=1 -DENABLE_RPMPKG=1 -DENABLE_ZLIB_COMPRESSION=1 -DHAVE_FOPENCOOKIE=1 -DHAVE_QSORT_R=1 -DHAVE_STRCHRNUL=1 -DLIBSOLV_INTERNAL=1 -DRPM5 -D_FILE_OFFSET_BITS=64 -Dlibsolv_EXPORTS -I/usr/include/rpm -I/tmp/B.GcEWCU/BUILD/libsolv-0.6.34 -I/tmp/B.GcEWCU/BUILD/libsolv-0.6.34/src -I/tmp/B.GcEWCU/BUILD/libsolv-0.6.34/ext -I/tmp/B.GcEWCU/BUILD/libsolv-0.6.34/build -I/tmp/B.GcEWCU/BUILD/libsolv-0.6.34/build/src -Wall -fPIC -O2 -fwrapv -pipe -Wformat -Werror=format-security -gdwarf-4 -fno-debug-types-section -fvar-tracking-assignments -g2 -Wp,-D_FORTIFY_SOURCE=2 -fstack-protector-strong --param=ssp-buffer-size=4 -fomit-frame-pointer -march=i686 -fasynchronous-unwind-tables -mtune=pentium4 -gdwarf-4 -fno-debug-types-section -fvar-tracking-assignments -g2 -DNDEBUG -DQT_NO_DEBUG -fPIC -DVERSION=\"0.6.34\" -o CMakeFiles/libsolv.dir/solverdebug.o -c /tmp/B.GcEWCU/BUILD/libsolv-0.6.34/src/solverdebug.c make[2]: Leaving directory '/tmp/B.GcEWCU/BUILD/libsolv-0.6.34/build' make[2]: Entering directory '/tmp/B.GcEWCU/BUILD/libsolv-0.6.34/build' [ 2%] Building C object ext/CMakeFiles/libsolvext_static.dir/pool_fileconflicts.o cd /tmp/B.GcEWCU/BUILD/libsolv-0.6.34/build/ext && /usr/bin/i686-pld-linux-gcc -DENABLE_APPDATA=1 -DENABLE_BZIP2_COMPRESSION=1 -DENABLE_COMPLEX_DEPS=1 -DENABLE_HELIXREPO=1 -DENABLE_LZMA_COMPRESSION=1 -DENABLE_PGPVRFY=1 -DENABLE_PUBKEY=1 -DENABLE_RPMDB=1 -DENABLE_RPMDB_BYRPMHEADER=1 -DENABLE_RPMMD=1 -DENABLE_RPMPKG=1 -DENABLE_ZLIB_COMPRESSION=1 -DHAVE_FOPENCOOKIE=1 -DHAVE_STRCHRNUL=1 -DRPM5 -D_FILE_OFFSET_BITS=64 -I/usr/include/rpm -I/tmp/B.GcEWCU/BUILD/libsolv-0.6.34 -I/tmp/B.GcEWCU/BUILD/libsolv-0.6.34/src -I/tmp/B.GcEWCU/BUILD/libsolv-0.6.34/ext -I/tmp/B.GcEWCU/BUILD/libsolv-0.6.34/build -I/tmp/B.GcEWCU/BUILD/libsolv-0.6.34/build/src -Wall -fPIC -O2 -fwrapv -pipe -Wformat -Werror=format-security -gdwarf-4 -fno-debug-types-section -fvar-tracking-assignments -g2 -Wp,-D_FORTIFY_SOURCE=2 -fstack-protector-strong --param=ssp-buffer-size=4 -fomit-frame-pointer -march=i686 -fasynchronous-unwind-tables -mtune=pentium4 -gdwarf-4 -fno-debug-types-section -fvar-tracking-assignments -g2 -DNDEBUG -DQT_NO_DEBUG -DVERSION=\"0.6.34\" -o CMakeFiles/libsolvext_static.dir/pool_fileconflicts.o -c /tmp/B.GcEWCU/BUILD/libsolv-0.6.34/ext/pool_fileconflicts.c make[2]: Leaving directory '/tmp/B.GcEWCU/BUILD/libsolv-0.6.34/build' make[2]: Entering directory '/tmp/B.GcEWCU/BUILD/libsolv-0.6.34/build' [ 9%] Building C object src/CMakeFiles/libsolv_static.dir/poolvendor.o cd /tmp/B.GcEWCU/BUILD/libsolv-0.6.34/build/src && /usr/bin/i686-pld-linux-gcc -DENABLE_APPDATA=1 -DENABLE_BZIP2_COMPRESSION=1 -DENABLE_COMPLEX_DEPS=1 -DENABLE_HELIXREPO=1 -DENABLE_LZMA_COMPRESSION=1 -DENABLE_PGPVRFY=1 -DENABLE_PUBKEY=1 -DENABLE_RPMDB=1 -DENABLE_RPMDB_BYRPMHEADER=1 -DENABLE_RPMMD=1 -DENABLE_RPMPKG=1 -DENABLE_ZLIB_COMPRESSION=1 -DHAVE_FOPENCOOKIE=1 -DHAVE_QSORT_R=1 -DHAVE_STRCHRNUL=1 -DLIBSOLV_INTERNAL=1 -DRPM5 -D_FILE_OFFSET_BITS=64 -I/usr/include/rpm -I/tmp/B.GcEWCU/BUILD/libsolv-0.6.34 -I/tmp/B.GcEWCU/BUILD/libsolv-0.6.34/src -I/tmp/B.GcEWCU/BUILD/libsolv-0.6.34/ext -I/tmp/B.GcEWCU/BUILD/libsolv-0.6.34/build -I/tmp/B.GcEWCU/BUILD/libsolv-0.6.34/build/src -Wall -fPIC -O2 -fwrapv -pipe -Wformat -Werror=format-security -gdwarf-4 -fno-debug-types-section -fvar-tracking-assignments -g2 -Wp,-D_FORTIFY_SOURCE=2 -fstack-protector-strong --param=ssp-buffer-size=4 -fomit-frame-pointer -march=i686 -fasynchronous-unwind-tables -mtune=pentium4 -gdwarf-4 -fno-debug-types-section -fvar-tracking-assignments -g2 -DNDEBUG -DQT_NO_DEBUG -DVERSION=\"0.6.34\" -o CMakeFiles/libsolv_static.dir/poolvendor.o -c /tmp/B.GcEWCU/BUILD/libsolv-0.6.34/src/poolvendor.c make[2]: Leaving directory '/tmp/B.GcEWCU/BUILD/libsolv-0.6.34/build' make[2]: Entering directory '/tmp/B.GcEWCU/BUILD/libsolv-0.6.34/build' [ 10%] Building C object src/CMakeFiles/libsolv_static.dir/poolid.o cd /tmp/B.GcEWCU/BUILD/libsolv-0.6.34/build/src && /usr/bin/i686-pld-linux-gcc -DENABLE_APPDATA=1 -DENABLE_BZIP2_COMPRESSION=1 -DENABLE_COMPLEX_DEPS=1 -DENABLE_HELIXREPO=1 -DENABLE_LZMA_COMPRESSION=1 -DENABLE_PGPVRFY=1 -DENABLE_PUBKEY=1 -DENABLE_RPMDB=1 -DENABLE_RPMDB_BYRPMHEADER=1 -DENABLE_RPMMD=1 -DENABLE_RPMPKG=1 -DENABLE_ZLIB_COMPRESSION=1 -DHAVE_FOPENCOOKIE=1 -DHAVE_QSORT_R=1 -DHAVE_STRCHRNUL=1 -DLIBSOLV_INTERNAL=1 -DRPM5 -D_FILE_OFFSET_BITS=64 -I/usr/include/rpm -I/tmp/B.GcEWCU/BUILD/libsolv-0.6.34 -I/tmp/B.GcEWCU/BUILD/libsolv-0.6.34/src -I/tmp/B.GcEWCU/BUILD/libsolv-0.6.34/ext -I/tmp/B.GcEWCU/BUILD/libsolv-0.6.34/build -I/tmp/B.GcEWCU/BUILD/libsolv-0.6.34/build/src -Wall -fPIC -O2 -fwrapv -pipe -Wformat -Werror=format-security -gdwarf-4 -fno-debug-types-section -fvar-tracking-assignments -g2 -Wp,-D_FORTIFY_SOURCE=2 -fstack-protector-strong --param=ssp-buffer-size=4 -fomit-frame-pointer -march=i686 -fasynchronous-unwind-tables -mtune=pentium4 -gdwarf-4 -fno-debug-types-section -fvar-tracking-assignments -g2 -DNDEBUG -DQT_NO_DEBUG -DVERSION=\"0.6.34\" -o CMakeFiles/libsolv_static.dir/poolid.o -c /tmp/B.GcEWCU/BUILD/libsolv-0.6.34/src/poolid.c make[2]: Leaving directory '/tmp/B.GcEWCU/BUILD/libsolv-0.6.34/build' make[2]: Entering directory '/tmp/B.GcEWCU/BUILD/libsolv-0.6.34/build' [ 16%] Building C object src/CMakeFiles/libsolv.dir/queue.o cd /tmp/B.GcEWCU/BUILD/libsolv-0.6.34/build/src && /usr/bin/i686-pld-linux-gcc -DENABLE_APPDATA=1 -DENABLE_BZIP2_COMPRESSION=1 -DENABLE_COMPLEX_DEPS=1 -DENABLE_HELIXREPO=1 -DENABLE_LZMA_COMPRESSION=1 -DENABLE_PGPVRFY=1 -DENABLE_PUBKEY=1 -DENABLE_RPMDB=1 -DENABLE_RPMDB_BYRPMHEADER=1 -DENABLE_RPMMD=1 -DENABLE_RPMPKG=1 -DENABLE_ZLIB_COMPRESSION=1 -DHAVE_FOPENCOOKIE=1 -DHAVE_QSORT_R=1 -DHAVE_STRCHRNUL=1 -DLIBSOLV_INTERNAL=1 -DRPM5 -D_FILE_OFFSET_BITS=64 -Dlibsolv_EXPORTS -I/usr/include/rpm -I/tmp/B.GcEWCU/BUILD/libsolv-0.6.34 -I/tmp/B.GcEWCU/BUILD/libsolv-0.6.34/src -I/tmp/B.GcEWCU/BUILD/libsolv-0.6.34/ext -I/tmp/B.GcEWCU/BUILD/libsolv-0.6.34/build -I/tmp/B.GcEWCU/BUILD/libsolv-0.6.34/build/src -Wall -fPIC -O2 -fwrapv -pipe -Wformat -Werror=format-security -gdwarf-4 -fno-debug-types-section -fvar-tracking-assignments -g2 -Wp,-D_FORTIFY_SOURCE=2 -fstack-protector-strong --param=ssp-buffer-size=4 -fomit-frame-pointer -march=i686 -fasynchronous-unwind-tables -mtune=pentium4 -gdwarf-4 -fno-debug-types-section -fvar-tracking-assignments -g2 -DNDEBUG -DQT_NO_DEBUG -fPIC -DVERSION=\"0.6.34\" -o CMakeFiles/libsolv.dir/queue.o -c /tmp/B.GcEWCU/BUILD/libsolv-0.6.34/src/queue.c make[2]: Leaving directory '/tmp/B.GcEWCU/BUILD/libsolv-0.6.34/build' make[2]: Entering directory '/tmp/B.GcEWCU/BUILD/libsolv-0.6.34/build' [ 17%] Building C object src/CMakeFiles/libsolv_static.dir/dirpool.o cd /tmp/B.GcEWCU/BUILD/libsolv-0.6.34/build/src && /usr/bin/i686-pld-linux-gcc -DENABLE_APPDATA=1 -DENABLE_BZIP2_COMPRESSION=1 -DENABLE_COMPLEX_DEPS=1 -DENABLE_HELIXREPO=1 -DENABLE_LZMA_COMPRESSION=1 -DENABLE_PGPVRFY=1 -DENABLE_PUBKEY=1 -DENABLE_RPMDB=1 -DENABLE_RPMDB_BYRPMHEADER=1 -DENABLE_RPMMD=1 -DENABLE_RPMPKG=1 -DENABLE_ZLIB_COMPRESSION=1 -DHAVE_FOPENCOOKIE=1 -DHAVE_QSORT_R=1 -DHAVE_STRCHRNUL=1 -DLIBSOLV_INTERNAL=1 -DRPM5 -D_FILE_OFFSET_BITS=64 -I/usr/include/rpm -I/tmp/B.GcEWCU/BUILD/libsolv-0.6.34 -I/tmp/B.GcEWCU/BUILD/libsolv-0.6.34/src -I/tmp/B.GcEWCU/BUILD/libsolv-0.6.34/ext -I/tmp/B.GcEWCU/BUILD/libsolv-0.6.34/build -I/tmp/B.GcEWCU/BUILD/libsolv-0.6.34/build/src -Wall -fPIC -O2 -fwrapv -pipe -Wformat -Werror=format-security -gdwarf-4 -fno-debug-types-section -fvar-tracking-assignments -g2 -Wp,-D_FORTIFY_SOURCE=2 -fstack-protector-strong --param=ssp-buffer-size=4 -fomit-frame-pointer -march=i686 -fasynchronous-unwind-tables -mtune=pentium4 -gdwarf-4 -fno-debug-types-section -fvar-tracking-assignments -g2 -DNDEBUG -DQT_NO_DEBUG -DVERSION=\"0.6.34\" -o CMakeFiles/libsolv_static.dir/dirpool.o -c /tmp/B.GcEWCU/BUILD/libsolv-0.6.34/src/dirpool.c make[2]: Leaving directory '/tmp/B.GcEWCU/BUILD/libsolv-0.6.34/build' make[2]: Entering directory '/tmp/B.GcEWCU/BUILD/libsolv-0.6.34/build' [ 17%] Building C object src/CMakeFiles/libsolv_static.dir/strpool.o cd /tmp/B.GcEWCU/BUILD/libsolv-0.6.34/build/src && /usr/bin/i686-pld-linux-gcc -DENABLE_APPDATA=1 -DENABLE_BZIP2_COMPRESSION=1 -DENABLE_COMPLEX_DEPS=1 -DENABLE_HELIXREPO=1 -DENABLE_LZMA_COMPRESSION=1 -DENABLE_PGPVRFY=1 -DENABLE_PUBKEY=1 -DENABLE_RPMDB=1 -DENABLE_RPMDB_BYRPMHEADER=1 -DENABLE_RPMMD=1 -DENABLE_RPMPKG=1 -DENABLE_ZLIB_COMPRESSION=1 -DHAVE_FOPENCOOKIE=1 -DHAVE_QSORT_R=1 -DHAVE_STRCHRNUL=1 -DLIBSOLV_INTERNAL=1 -DRPM5 -D_FILE_OFFSET_BITS=64 -I/usr/include/rpm -I/tmp/B.GcEWCU/BUILD/libsolv-0.6.34 -I/tmp/B.GcEWCU/BUILD/libsolv-0.6.34/src -I/tmp/B.GcEWCU/BUILD/libsolv-0.6.34/ext -I/tmp/B.GcEWCU/BUILD/libsolv-0.6.34/build -I/tmp/B.GcEWCU/BUILD/libsolv-0.6.34/build/src -Wall -fPIC -O2 -fwrapv -pipe -Wformat -Werror=format-security -gdwarf-4 -fno-debug-types-section -fvar-tracking-assignments -g2 -Wp,-D_FORTIFY_SOURCE=2 -fstack-protector-strong --param=ssp-buffer-size=4 -fomit-frame-pointer -march=i686 -fasynchronous-unwind-tables -mtune=pentium4 -gdwarf-4 -fno-debug-types-section -fvar-tracking-assignments -g2 -DNDEBUG -DQT_NO_DEBUG -DVERSION=\"0.6.34\" -o CMakeFiles/libsolv_static.dir/strpool.o -c /tmp/B.GcEWCU/BUILD/libsolv-0.6.34/src/strpool.c make[2]: Leaving directory '/tmp/B.GcEWCU/BUILD/libsolv-0.6.34/build' make[2]: Entering directory '/tmp/B.GcEWCU/BUILD/libsolv-0.6.34/build' [ 20%] Building C object src/CMakeFiles/libsolv_static.dir/solverdebug.o cd /tmp/B.GcEWCU/BUILD/libsolv-0.6.34/build/src && /usr/bin/i686-pld-linux-gcc -DENABLE_APPDATA=1 -DENABLE_BZIP2_COMPRESSION=1 -DENABLE_COMPLEX_DEPS=1 -DENABLE_HELIXREPO=1 -DENABLE_LZMA_COMPRESSION=1 -DENABLE_PGPVRFY=1 -DENABLE_PUBKEY=1 -DENABLE_RPMDB=1 -DENABLE_RPMDB_BYRPMHEADER=1 -DENABLE_RPMMD=1 -DENABLE_RPMPKG=1 -DENABLE_ZLIB_COMPRESSION=1 -DHAVE_FOPENCOOKIE=1 -DHAVE_QSORT_R=1 -DHAVE_STRCHRNUL=1 -DLIBSOLV_INTERNAL=1 -DRPM5 -D_FILE_OFFSET_BITS=64 -I/usr/include/rpm -I/tmp/B.GcEWCU/BUILD/libsolv-0.6.34 -I/tmp/B.GcEWCU/BUILD/libsolv-0.6.34/src -I/tmp/B.GcEWCU/BUILD/libsolv-0.6.34/ext -I/tmp/B.GcEWCU/BUILD/libsolv-0.6.34/build -I/tmp/B.GcEWCU/BUILD/libsolv-0.6.34/build/src -Wall -fPIC -O2 -fwrapv -pipe -Wformat -Werror=format-security -gdwarf-4 -fno-debug-types-section -fvar-tracking-assignments -g2 -Wp,-D_FORTIFY_SOURCE=2 -fstack-protector-strong --param=ssp-buffer-size=4 -fomit-frame-pointer -march=i686 -fasynchronous-unwind-tables -mtune=pentium4 -gdwarf-4 -fno-debug-types-section -fvar-tracking-assignments -g2 -DNDEBUG -DQT_NO_DEBUG -DVERSION=\"0.6.34\" -o CMakeFiles/libsolv_static.dir/solverdebug.o -c /tmp/B.GcEWCU/BUILD/libsolv-0.6.34/src/solverdebug.c make[2]: Leaving directory '/tmp/B.GcEWCU/BUILD/libsolv-0.6.34/build' make[2]: Entering directory '/tmp/B.GcEWCU/BUILD/libsolv-0.6.34/build' [ 14%] Building C object src/CMakeFiles/libsolv.dir/repo_solv.o cd /tmp/B.GcEWCU/BUILD/libsolv-0.6.34/build/src && /usr/bin/i686-pld-linux-gcc -DENABLE_APPDATA=1 -DENABLE_BZIP2_COMPRESSION=1 -DENABLE_COMPLEX_DEPS=1 -DENABLE_HELIXREPO=1 -DENABLE_LZMA_COMPRESSION=1 -DENABLE_PGPVRFY=1 -DENABLE_PUBKEY=1 -DENABLE_RPMDB=1 -DENABLE_RPMDB_BYRPMHEADER=1 -DENABLE_RPMMD=1 -DENABLE_RPMPKG=1 -DENABLE_ZLIB_COMPRESSION=1 -DHAVE_FOPENCOOKIE=1 -DHAVE_QSORT_R=1 -DHAVE_STRCHRNUL=1 -DLIBSOLV_INTERNAL=1 -DRPM5 -D_FILE_OFFSET_BITS=64 -Dlibsolv_EXPORTS -I/usr/include/rpm -I/tmp/B.GcEWCU/BUILD/libsolv-0.6.34 -I/tmp/B.GcEWCU/BUILD/libsolv-0.6.34/src -I/tmp/B.GcEWCU/BUILD/libsolv-0.6.34/ext -I/tmp/B.GcEWCU/BUILD/libsolv-0.6.34/build -I/tmp/B.GcEWCU/BUILD/libsolv-0.6.34/build/src -Wall -fPIC -O2 -fwrapv -pipe -Wformat -Werror=format-security -gdwarf-4 -fno-debug-types-section -fvar-tracking-assignments -g2 -Wp,-D_FORTIFY_SOURCE=2 -fstack-protector-strong --param=ssp-buffer-size=4 -fomit-frame-pointer -march=i686 -fasynchronous-unwind-tables -mtune=pentium4 -gdwarf-4 -fno-debug-types-section -fvar-tracking-assignments -g2 -DNDEBUG -DQT_NO_DEBUG -fPIC -DVERSION=\"0.6.34\" -o CMakeFiles/libsolv.dir/repo_solv.o -c /tmp/B.GcEWCU/BUILD/libsolv-0.6.34/src/repo_solv.c make[2]: Leaving directory '/tmp/B.GcEWCU/BUILD/libsolv-0.6.34/build' make[2]: Entering directory '/tmp/B.GcEWCU/BUILD/libsolv-0.6.34/build' [ 2%] Building C object ext/CMakeFiles/libsolvext_static.dir/testcase.o cd /tmp/B.GcEWCU/BUILD/libsolv-0.6.34/build/ext && /usr/bin/i686-pld-linux-gcc -DENABLE_APPDATA=1 -DENABLE_BZIP2_COMPRESSION=1 -DENABLE_COMPLEX_DEPS=1 -DENABLE_HELIXREPO=1 -DENABLE_LZMA_COMPRESSION=1 -DENABLE_PGPVRFY=1 -DENABLE_PUBKEY=1 -DENABLE_RPMDB=1 -DENABLE_RPMDB_BYRPMHEADER=1 -DENABLE_RPMMD=1 -DENABLE_RPMPKG=1 -DENABLE_ZLIB_COMPRESSION=1 -DHAVE_FOPENCOOKIE=1 -DHAVE_STRCHRNUL=1 -DRPM5 -D_FILE_OFFSET_BITS=64 -I/usr/include/rpm -I/tmp/B.GcEWCU/BUILD/libsolv-0.6.34 -I/tmp/B.GcEWCU/BUILD/libsolv-0.6.34/src -I/tmp/B.GcEWCU/BUILD/libsolv-0.6.34/ext -I/tmp/B.GcEWCU/BUILD/libsolv-0.6.34/build -I/tmp/B.GcEWCU/BUILD/libsolv-0.6.34/build/src -Wall -fPIC -O2 -fwrapv -pipe -Wformat -Werror=format-security -gdwarf-4 -fno-debug-types-section -fvar-tracking-assignments -g2 -Wp,-D_FORTIFY_SOURCE=2 -fstack-protector-strong --param=ssp-buffer-size=4 -fomit-frame-pointer -march=i686 -fasynchronous-unwind-tables -mtune=pentium4 -gdwarf-4 -fno-debug-types-section -fvar-tracking-assignments -g2 -DNDEBUG -DQT_NO_DEBUG -DVERSION=\"0.6.34\" -o CMakeFiles/libsolvext_static.dir/testcase.o -c /tmp/B.GcEWCU/BUILD/libsolv-0.6.34/ext/testcase.c make[2]: Leaving directory '/tmp/B.GcEWCU/BUILD/libsolv-0.6.34/build' make[1]: *** [CMakeFiles/Makefile2:249: ext/CMakeFiles/libsolvext_static.dir/all] Error 2 make[1]: *** Waiting for unfinished jobs.... make[2]: Entering directory '/tmp/B.GcEWCU/BUILD/libsolv-0.6.34/build' [ 18%] Building C object src/CMakeFiles/libsolv.dir/repo.o cd /tmp/B.GcEWCU/BUILD/libsolv-0.6.34/build/src && /usr/bin/i686-pld-linux-gcc -DENABLE_APPDATA=1 -DENABLE_BZIP2_COMPRESSION=1 -DENABLE_COMPLEX_DEPS=1 -DENABLE_HELIXREPO=1 -DENABLE_LZMA_COMPRESSION=1 -DENABLE_PGPVRFY=1 -DENABLE_PUBKEY=1 -DENABLE_RPMDB=1 -DENABLE_RPMDB_BYRPMHEADER=1 -DENABLE_RPMMD=1 -DENABLE_RPMPKG=1 -DENABLE_ZLIB_COMPRESSION=1 -DHAVE_FOPENCOOKIE=1 -DHAVE_QSORT_R=1 -DHAVE_STRCHRNUL=1 -DLIBSOLV_INTERNAL=1 -DRPM5 -D_FILE_OFFSET_BITS=64 -Dlibsolv_EXPORTS -I/usr/include/rpm -I/tmp/B.GcEWCU/BUILD/libsolv-0.6.34 -I/tmp/B.GcEWCU/BUILD/libsolv-0.6.34/src -I/tmp/B.GcEWCU/BUILD/libsolv-0.6.34/ext -I/tmp/B.GcEWCU/BUILD/libsolv-0.6.34/build -I/tmp/B.GcEWCU/BUILD/libsolv-0.6.34/build/src -Wall -fPIC -O2 -fwrapv -pipe -Wformat -Werror=format-security -gdwarf-4 -fno-debug-types-section -fvar-tracking-assignments -g2 -Wp,-D_FORTIFY_SOURCE=2 -fstack-protector-strong --param=ssp-buffer-size=4 -fomit-frame-pointer -march=i686 -fasynchronous-unwind-tables -mtune=pentium4 -gdwarf-4 -fno-debug-types-section -fvar-tracking-assignments -g2 -DNDEBUG -DQT_NO_DEBUG -fPIC -DVERSION=\"0.6.34\" -o CMakeFiles/libsolv.dir/repo.o -c /tmp/B.GcEWCU/BUILD/libsolv-0.6.34/src/repo.c make[2]: Leaving directory '/tmp/B.GcEWCU/BUILD/libsolv-0.6.34/build' make[2]: Entering directory '/tmp/B.GcEWCU/BUILD/libsolv-0.6.34/build' [ 14%] Building C object src/CMakeFiles/libsolv.dir/repo_write.o cd /tmp/B.GcEWCU/BUILD/libsolv-0.6.34/build/src && /usr/bin/i686-pld-linux-gcc -DENABLE_APPDATA=1 -DENABLE_BZIP2_COMPRESSION=1 -DENABLE_COMPLEX_DEPS=1 -DENABLE_HELIXREPO=1 -DENABLE_LZMA_COMPRESSION=1 -DENABLE_PGPVRFY=1 -DENABLE_PUBKEY=1 -DENABLE_RPMDB=1 -DENABLE_RPMDB_BYRPMHEADER=1 -DENABLE_RPMMD=1 -DENABLE_RPMPKG=1 -DENABLE_ZLIB_COMPRESSION=1 -DHAVE_FOPENCOOKIE=1 -DHAVE_QSORT_R=1 -DHAVE_STRCHRNUL=1 -DLIBSOLV_INTERNAL=1 -DRPM5 -D_FILE_OFFSET_BITS=64 -Dlibsolv_EXPORTS -I/usr/include/rpm -I/tmp/B.GcEWCU/BUILD/libsolv-0.6.34 -I/tmp/B.GcEWCU/BUILD/libsolv-0.6.34/src -I/tmp/B.GcEWCU/BUILD/libsolv-0.6.34/ext -I/tmp/B.GcEWCU/BUILD/libsolv-0.6.34/build -I/tmp/B.GcEWCU/BUILD/libsolv-0.6.34/build/src -Wall -fPIC -O2 -fwrapv -pipe -Wformat -Werror=format-security -gdwarf-4 -fno-debug-types-section -fvar-tracking-assignments -g2 -Wp,-D_FORTIFY_SOURCE=2 -fstack-protector-strong --param=ssp-buffer-size=4 -fomit-frame-pointer -march=i686 -fasynchronous-unwind-tables -mtune=pentium4 -gdwarf-4 -fno-debug-types-section -fvar-tracking-assignments -g2 -DNDEBUG -DQT_NO_DEBUG -fPIC -DVERSION=\"0.6.34\" -o CMakeFiles/libsolv.dir/repo_write.o -c /tmp/B.GcEWCU/BUILD/libsolv-0.6.34/src/repo_write.c make[2]: Leaving directory '/tmp/B.GcEWCU/BUILD/libsolv-0.6.34/build' make[2]: Entering directory '/tmp/B.GcEWCU/BUILD/libsolv-0.6.34/build' [ 16%] Building C object src/CMakeFiles/libsolv.dir/pool.o cd /tmp/B.GcEWCU/BUILD/libsolv-0.6.34/build/src && /usr/bin/i686-pld-linux-gcc -DENABLE_APPDATA=1 -DENABLE_BZIP2_COMPRESSION=1 -DENABLE_COMPLEX_DEPS=1 -DENABLE_HELIXREPO=1 -DENABLE_LZMA_COMPRESSION=1 -DENABLE_PGPVRFY=1 -DENABLE_PUBKEY=1 -DENABLE_RPMDB=1 -DENABLE_RPMDB_BYRPMHEADER=1 -DENABLE_RPMMD=1 -DENABLE_RPMPKG=1 -DENABLE_ZLIB_COMPRESSION=1 -DHAVE_FOPENCOOKIE=1 -DHAVE_QSORT_R=1 -DHAVE_STRCHRNUL=1 -DLIBSOLV_INTERNAL=1 -DRPM5 -D_FILE_OFFSET_BITS=64 -Dlibsolv_EXPORTS -I/usr/include/rpm -I/tmp/B.GcEWCU/BUILD/libsolv-0.6.34 -I/tmp/B.GcEWCU/BUILD/libsolv-0.6.34/src -I/tmp/B.GcEWCU/BUILD/libsolv-0.6.34/ext -I/tmp/B.GcEWCU/BUILD/libsolv-0.6.34/build -I/tmp/B.GcEWCU/BUILD/libsolv-0.6.34/build/src -Wall -fPIC -O2 -fwrapv -pipe -Wformat -Werror=format-security -gdwarf-4 -fno-debug-types-section -fvar-tracking-assignments -g2 -Wp,-D_FORTIFY_SOURCE=2 -fstack-protector-strong --param=ssp-buffer-size=4 -fomit-frame-pointer -march=i686 -fasynchronous-unwind-tables -mtune=pentium4 -gdwarf-4 -fno-debug-types-section -fvar-tracking-assignments -g2 -DNDEBUG -DQT_NO_DEBUG -fPIC -DVERSION=\"0.6.34\" -o CMakeFiles/libsolv.dir/pool.o -c /tmp/B.GcEWCU/BUILD/libsolv-0.6.34/src/pool.c make[2]: Leaving directory '/tmp/B.GcEWCU/BUILD/libsolv-0.6.34/build' make[2]: Entering directory '/tmp/B.GcEWCU/BUILD/libsolv-0.6.34/build' [ 21%] Building C object src/CMakeFiles/libsolv.dir/util.o cd /tmp/B.GcEWCU/BUILD/libsolv-0.6.34/build/src && /usr/bin/i686-pld-linux-gcc -DENABLE_APPDATA=1 -DENABLE_BZIP2_COMPRESSION=1 -DENABLE_COMPLEX_DEPS=1 -DENABLE_HELIXREPO=1 -DENABLE_LZMA_COMPRESSION=1 -DENABLE_PGPVRFY=1 -DENABLE_PUBKEY=1 -DENABLE_RPMDB=1 -DENABLE_RPMDB_BYRPMHEADER=1 -DENABLE_RPMMD=1 -DENABLE_RPMPKG=1 -DENABLE_ZLIB_COMPRESSION=1 -DHAVE_FOPENCOOKIE=1 -DHAVE_QSORT_R=1 -DHAVE_STRCHRNUL=1 -DLIBSOLV_INTERNAL=1 -DRPM5 -D_FILE_OFFSET_BITS=64 -Dlibsolv_EXPORTS -I/usr/include/rpm -I/tmp/B.GcEWCU/BUILD/libsolv-0.6.34 -I/tmp/B.GcEWCU/BUILD/libsolv-0.6.34/src -I/tmp/B.GcEWCU/BUILD/libsolv-0.6.34/ext -I/tmp/B.GcEWCU/BUILD/libsolv-0.6.34/build -I/tmp/B.GcEWCU/BUILD/libsolv-0.6.34/build/src -Wall -fPIC -O2 -fwrapv -pipe -Wformat -Werror=format-security -gdwarf-4 -fno-debug-types-section -fvar-tracking-assignments -g2 -Wp,-D_FORTIFY_SOURCE=2 -fstack-protector-strong --param=ssp-buffer-size=4 -fomit-frame-pointer -march=i686 -fasynchronous-unwind-tables -mtune=pentium4 -gdwarf-4 -fno-debug-types-section -fvar-tracking-assignments -g2 -DNDEBUG -DQT_NO_DEBUG -fPIC -DVERSION=\"0.6.34\" -o CMakeFiles/libsolv.dir/util.o -c /tmp/B.GcEWCU/BUILD/libsolv-0.6.34/src/util.c make[2]: Leaving directory '/tmp/B.GcEWCU/BUILD/libsolv-0.6.34/build' make[2]: Entering directory '/tmp/B.GcEWCU/BUILD/libsolv-0.6.34/build' [ 20%] Building C object src/CMakeFiles/libsolv.dir/repopage.o cd /tmp/B.GcEWCU/BUILD/libsolv-0.6.34/build/src && /usr/bin/i686-pld-linux-gcc -DENABLE_APPDATA=1 -DENABLE_BZIP2_COMPRESSION=1 -DENABLE_COMPLEX_DEPS=1 -DENABLE_HELIXREPO=1 -DENABLE_LZMA_COMPRESSION=1 -DENABLE_PGPVRFY=1 -DENABLE_PUBKEY=1 -DENABLE_RPMDB=1 -DENABLE_RPMDB_BYRPMHEADER=1 -DENABLE_RPMMD=1 -DENABLE_RPMPKG=1 -DENABLE_ZLIB_COMPRESSION=1 -DHAVE_FOPENCOOKIE=1 -DHAVE_QSORT_R=1 -DHAVE_STRCHRNUL=1 -DLIBSOLV_INTERNAL=1 -DRPM5 -D_FILE_OFFSET_BITS=64 -Dlibsolv_EXPORTS -I/usr/include/rpm -I/tmp/B.GcEWCU/BUILD/libsolv-0.6.34 -I/tmp/B.GcEWCU/BUILD/libsolv-0.6.34/src -I/tmp/B.GcEWCU/BUILD/libsolv-0.6.34/ext -I/tmp/B.GcEWCU/BUILD/libsolv-0.6.34/build -I/tmp/B.GcEWCU/BUILD/libsolv-0.6.34/build/src -Wall -fPIC -O2 -fwrapv -pipe -Wformat -Werror=format-security -gdwarf-4 -fno-debug-types-section -fvar-tracking-assignments -g2 -Wp,-D_FORTIFY_SOURCE=2 -fstack-protector-strong --param=ssp-buffer-size=4 -fomit-frame-pointer -march=i686 -fasynchronous-unwind-tables -mtune=pentium4 -gdwarf-4 -fno-debug-types-section -fvar-tracking-assignments -g2 -DNDEBUG -DQT_NO_DEBUG -fPIC -DVERSION=\"0.6.34\" -o CMakeFiles/libsolv.dir/repopage.o -c /tmp/B.GcEWCU/BUILD/libsolv-0.6.34/src/repopage.c make[2]: Leaving directory '/tmp/B.GcEWCU/BUILD/libsolv-0.6.34/build' make[2]: Entering directory '/tmp/B.GcEWCU/BUILD/libsolv-0.6.34/build' [ 22%] Building C object src/CMakeFiles/libsolv.dir/solvable.o cd /tmp/B.GcEWCU/BUILD/libsolv-0.6.34/build/src && /usr/bin/i686-pld-linux-gcc -DENABLE_APPDATA=1 -DENABLE_BZIP2_COMPRESSION=1 -DENABLE_COMPLEX_DEPS=1 -DENABLE_HELIXREPO=1 -DENABLE_LZMA_COMPRESSION=1 -DENABLE_PGPVRFY=1 -DENABLE_PUBKEY=1 -DENABLE_RPMDB=1 -DENABLE_RPMDB_BYRPMHEADER=1 -DENABLE_RPMMD=1 -DENABLE_RPMPKG=1 -DENABLE_ZLIB_COMPRESSION=1 -DHAVE_FOPENCOOKIE=1 -DHAVE_QSORT_R=1 -DHAVE_STRCHRNUL=1 -DLIBSOLV_INTERNAL=1 -DRPM5 -D_FILE_OFFSET_BITS=64 -Dlibsolv_EXPORTS -I/usr/include/rpm -I/tmp/B.GcEWCU/BUILD/libsolv-0.6.34 -I/tmp/B.GcEWCU/BUILD/libsolv-0.6.34/src -I/tmp/B.GcEWCU/BUILD/libsolv-0.6.34/ext -I/tmp/B.GcEWCU/BUILD/libsolv-0.6.34/build -I/tmp/B.GcEWCU/BUILD/libsolv-0.6.34/build/src -Wall -fPIC -O2 -fwrapv -pipe -Wformat -Werror=format-security -gdwarf-4 -fno-debug-types-section -fvar-tracking-assignments -g2 -Wp,-D_FORTIFY_SOURCE=2 -fstack-protector-strong --param=ssp-buffer-size=4 -fomit-frame-pointer -march=i686 -fasynchronous-unwind-tables -mtune=pentium4 -gdwarf-4 -fno-debug-types-section -fvar-tracking-assignments -g2 -DNDEBUG -DQT_NO_DEBUG -fPIC -DVERSION=\"0.6.34\" -o CMakeFiles/libsolv.dir/solvable.o -c /tmp/B.GcEWCU/BUILD/libsolv-0.6.34/src/solvable.c make[2]: Leaving directory '/tmp/B.GcEWCU/BUILD/libsolv-0.6.34/build' make[2]: Entering directory '/tmp/B.GcEWCU/BUILD/libsolv-0.6.34/build' [ 26%] Building C object src/CMakeFiles/libsolv.dir/linkedpkg.o cd /tmp/B.GcEWCU/BUILD/libsolv-0.6.34/build/src && /usr/bin/i686-pld-linux-gcc -DENABLE_APPDATA=1 -DENABLE_BZIP2_COMPRESSION=1 -DENABLE_COMPLEX_DEPS=1 -DENABLE_HELIXREPO=1 -DENABLE_LZMA_COMPRESSION=1 -DENABLE_PGPVRFY=1 -DENABLE_PUBKEY=1 -DENABLE_RPMDB=1 -DENABLE_RPMDB_BYRPMHEADER=1 -DENABLE_RPMMD=1 -DENABLE_RPMPKG=1 -DENABLE_ZLIB_COMPRESSION=1 -DHAVE_FOPENCOOKIE=1 -DHAVE_QSORT_R=1 -DHAVE_STRCHRNUL=1 -DLIBSOLV_INTERNAL=1 -DRPM5 -D_FILE_OFFSET_BITS=64 -Dlibsolv_EXPORTS -I/usr/include/rpm -I/tmp/B.GcEWCU/BUILD/libsolv-0.6.34 -I/tmp/B.GcEWCU/BUILD/libsolv-0.6.34/src -I/tmp/B.GcEWCU/BUILD/libsolv-0.6.34/ext -I/tmp/B.GcEWCU/BUILD/libsolv-0.6.34/build -I/tmp/B.GcEWCU/BUILD/libsolv-0.6.34/build/src -Wall -fPIC -O2 -fwrapv -pipe -Wformat -Werror=format-security -gdwarf-4 -fno-debug-types-section -fvar-tracking-assignments -g2 -Wp,-D_FORTIFY_SOURCE=2 -fstack-protector-strong --param=ssp-buffer-size=4 -fomit-frame-pointer -march=i686 -fasynchronous-unwind-tables -mtune=pentium4 -gdwarf-4 -fno-debug-types-section -fvar-tracking-assignments -g2 -DNDEBUG -DQT_NO_DEBUG -fPIC -DVERSION=\"0.6.34\" -o CMakeFiles/libsolv.dir/linkedpkg.o -c /tmp/B.GcEWCU/BUILD/libsolv-0.6.34/src/linkedpkg.c make[2]: Leaving directory '/tmp/B.GcEWCU/BUILD/libsolv-0.6.34/build' make[2]: Entering directory '/tmp/B.GcEWCU/BUILD/libsolv-0.6.34/build' [ 23%] Building C object src/CMakeFiles/libsolv.dir/transaction.o cd /tmp/B.GcEWCU/BUILD/libsolv-0.6.34/build/src && /usr/bin/i686-pld-linux-gcc -DENABLE_APPDATA=1 -DENABLE_BZIP2_COMPRESSION=1 -DENABLE_COMPLEX_DEPS=1 -DENABLE_HELIXREPO=1 -DENABLE_LZMA_COMPRESSION=1 -DENABLE_PGPVRFY=1 -DENABLE_PUBKEY=1 -DENABLE_RPMDB=1 -DENABLE_RPMDB_BYRPMHEADER=1 -DENABLE_RPMMD=1 -DENABLE_RPMPKG=1 -DENABLE_ZLIB_COMPRESSION=1 -DHAVE_FOPENCOOKIE=1 -DHAVE_QSORT_R=1 -DHAVE_STRCHRNUL=1 -DLIBSOLV_INTERNAL=1 -DRPM5 -D_FILE_OFFSET_BITS=64 -Dlibsolv_EXPORTS -I/usr/include/rpm -I/tmp/B.GcEWCU/BUILD/libsolv-0.6.34 -I/tmp/B.GcEWCU/BUILD/libsolv-0.6.34/src -I/tmp/B.GcEWCU/BUILD/libsolv-0.6.34/ext -I/tmp/B.GcEWCU/BUILD/libsolv-0.6.34/build -I/tmp/B.GcEWCU/BUILD/libsolv-0.6.34/build/src -Wall -fPIC -O2 -fwrapv -pipe -Wformat -Werror=format-security -gdwarf-4 -fno-debug-types-section -fvar-tracking-assignments -g2 -Wp,-D_FORTIFY_SOURCE=2 -fstack-protector-strong --param=ssp-buffer-size=4 -fomit-frame-pointer -march=i686 -fasynchronous-unwind-tables -mtune=pentium4 -gdwarf-4 -fno-debug-types-section -fvar-tracking-assignments -g2 -DNDEBUG -DQT_NO_DEBUG -fPIC -DVERSION=\"0.6.34\" -o CMakeFiles/libsolv.dir/transaction.o -c /tmp/B.GcEWCU/BUILD/libsolv-0.6.34/src/transaction.c make[2]: Leaving directory '/tmp/B.GcEWCU/BUILD/libsolv-0.6.34/build' make[2]: Entering directory '/tmp/B.GcEWCU/BUILD/libsolv-0.6.34/build' [ 26%] Building C object src/CMakeFiles/libsolv.dir/cplxdeps.o cd /tmp/B.GcEWCU/BUILD/libsolv-0.6.34/build/src && /usr/bin/i686-pld-linux-gcc -DENABLE_APPDATA=1 -DENABLE_BZIP2_COMPRESSION=1 -DENABLE_COMPLEX_DEPS=1 -DENABLE_HELIXREPO=1 -DENABLE_LZMA_COMPRESSION=1 -DENABLE_PGPVRFY=1 -DENABLE_PUBKEY=1 -DENABLE_RPMDB=1 -DENABLE_RPMDB_BYRPMHEADER=1 -DENABLE_RPMMD=1 -DENABLE_RPMPKG=1 -DENABLE_ZLIB_COMPRESSION=1 -DHAVE_FOPENCOOKIE=1 -DHAVE_QSORT_R=1 -DHAVE_STRCHRNUL=1 -DLIBSOLV_INTERNAL=1 -DRPM5 -D_FILE_OFFSET_BITS=64 -Dlibsolv_EXPORTS -I/usr/include/rpm -I/tmp/B.GcEWCU/BUILD/libsolv-0.6.34 -I/tmp/B.GcEWCU/BUILD/libsolv-0.6.34/src -I/tmp/B.GcEWCU/BUILD/libsolv-0.6.34/ext -I/tmp/B.GcEWCU/BUILD/libsolv-0.6.34/build -I/tmp/B.GcEWCU/BUILD/libsolv-0.6.34/build/src -Wall -fPIC -O2 -fwrapv -pipe -Wformat -Werror=format-security -gdwarf-4 -fno-debug-types-section -fvar-tracking-assignments -g2 -Wp,-D_FORTIFY_SOURCE=2 -fstack-protector-strong --param=ssp-buffer-size=4 -fomit-frame-pointer -march=i686 -fasynchronous-unwind-tables -mtune=pentium4 -gdwarf-4 -fno-debug-types-section -fvar-tracking-assignments -g2 -DNDEBUG -DQT_NO_DEBUG -fPIC -DVERSION=\"0.6.34\" -o CMakeFiles/libsolv.dir/cplxdeps.o -c /tmp/B.GcEWCU/BUILD/libsolv-0.6.34/src/cplxdeps.c make[2]: Leaving directory '/tmp/B.GcEWCU/BUILD/libsolv-0.6.34/build' make[2]: Entering directory '/tmp/B.GcEWCU/BUILD/libsolv-0.6.34/build' [ 27%] Building C object src/CMakeFiles/libsolv.dir/chksum.o cd /tmp/B.GcEWCU/BUILD/libsolv-0.6.34/build/src && /usr/bin/i686-pld-linux-gcc -DENABLE_APPDATA=1 -DENABLE_BZIP2_COMPRESSION=1 -DENABLE_COMPLEX_DEPS=1 -DENABLE_HELIXREPO=1 -DENABLE_LZMA_COMPRESSION=1 -DENABLE_PGPVRFY=1 -DENABLE_PUBKEY=1 -DENABLE_RPMDB=1 -DENABLE_RPMDB_BYRPMHEADER=1 -DENABLE_RPMMD=1 -DENABLE_RPMPKG=1 -DENABLE_ZLIB_COMPRESSION=1 -DHAVE_FOPENCOOKIE=1 -DHAVE_QSORT_R=1 -DHAVE_STRCHRNUL=1 -DLIBSOLV_INTERNAL=1 -DRPM5 -D_FILE_OFFSET_BITS=64 -Dlibsolv_EXPORTS -I/usr/include/rpm -I/tmp/B.GcEWCU/BUILD/libsolv-0.6.34 -I/tmp/B.GcEWCU/BUILD/libsolv-0.6.34/src -I/tmp/B.GcEWCU/BUILD/libsolv-0.6.34/ext -I/tmp/B.GcEWCU/BUILD/libsolv-0.6.34/build -I/tmp/B.GcEWCU/BUILD/libsolv-0.6.34/build/src -Wall -fPIC -O2 -fwrapv -pipe -Wformat -Werror=format-security -gdwarf-4 -fno-debug-types-section -fvar-tracking-assignments -g2 -Wp,-D_FORTIFY_SOURCE=2 -fstack-protector-strong --param=ssp-buffer-size=4 -fomit-frame-pointer -march=i686 -fasynchronous-unwind-tables -mtune=pentium4 -gdwarf-4 -fno-debug-types-section -fvar-tracking-assignments -g2 -DNDEBUG -DQT_NO_DEBUG -fPIC -DVERSION=\"0.6.34\" -o CMakeFiles/libsolv.dir/chksum.o -c /tmp/B.GcEWCU/BUILD/libsolv-0.6.34/src/chksum.c make[2]: Leaving directory '/tmp/B.GcEWCU/BUILD/libsolv-0.6.34/build' make[2]: Entering directory '/tmp/B.GcEWCU/BUILD/libsolv-0.6.34/build' [ 22%] Building C object src/CMakeFiles/libsolv.dir/policy.o cd /tmp/B.GcEWCU/BUILD/libsolv-0.6.34/build/src && /usr/bin/i686-pld-linux-gcc -DENABLE_APPDATA=1 -DENABLE_BZIP2_COMPRESSION=1 -DENABLE_COMPLEX_DEPS=1 -DENABLE_HELIXREPO=1 -DENABLE_LZMA_COMPRESSION=1 -DENABLE_PGPVRFY=1 -DENABLE_PUBKEY=1 -DENABLE_RPMDB=1 -DENABLE_RPMDB_BYRPMHEADER=1 -DENABLE_RPMMD=1 -DENABLE_RPMPKG=1 -DENABLE_ZLIB_COMPRESSION=1 -DHAVE_FOPENCOOKIE=1 -DHAVE_QSORT_R=1 -DHAVE_STRCHRNUL=1 -DLIBSOLV_INTERNAL=1 -DRPM5 -D_FILE_OFFSET_BITS=64 -Dlibsolv_EXPORTS -I/usr/include/rpm -I/tmp/B.GcEWCU/BUILD/libsolv-0.6.34 -I/tmp/B.GcEWCU/BUILD/libsolv-0.6.34/src -I/tmp/B.GcEWCU/BUILD/libsolv-0.6.34/ext -I/tmp/B.GcEWCU/BUILD/libsolv-0.6.34/build -I/tmp/B.GcEWCU/BUILD/libsolv-0.6.34/build/src -Wall -fPIC -O2 -fwrapv -pipe -Wformat -Werror=format-security -gdwarf-4 -fno-debug-types-section -fvar-tracking-assignments -g2 -Wp,-D_FORTIFY_SOURCE=2 -fstack-protector-strong --param=ssp-buffer-size=4 -fomit-frame-pointer -march=i686 -fasynchronous-unwind-tables -mtune=pentium4 -gdwarf-4 -fno-debug-types-section -fvar-tracking-assignments -g2 -DNDEBUG -DQT_NO_DEBUG -fPIC -DVERSION=\"0.6.34\" -o CMakeFiles/libsolv.dir/policy.o -c /tmp/B.GcEWCU/BUILD/libsolv-0.6.34/src/policy.c In file included from /usr/include/string.h:494, from /tmp/B.GcEWCU/BUILD/libsolv-0.6.34/src/policy.c:16: In function 'memcpy', inlined from 'urpm_reorder.isra.17' at /tmp/B.GcEWCU/BUILD/libsolv-0.6.34/src/policy.c:1241:9: /usr/include/bits/string_fortified.h:34:10: warning: '__builtin_memcpy' forming offset 8 is out of the bounds [0, 7] [-Warray-bounds] return __builtin___memcpy_chk (__dest, __src, __len, __bos0 (__dest)); ^~~~~~~~~~~~~~~~~~~~~~~~~~~~~~~~~~~~~~~~~~~~~~~~~~~~~~~~~~~~~~ make[2]: Leaving directory '/tmp/B.GcEWCU/BUILD/libsolv-0.6.34/build' make[2]: Entering directory '/tmp/B.GcEWCU/BUILD/libsolv-0.6.34/build' [ 28%] Building C object src/CMakeFiles/libsolv.dir/md5.o cd /tmp/B.GcEWCU/BUILD/libsolv-0.6.34/build/src && /usr/bin/i686-pld-linux-gcc -DENABLE_APPDATA=1 -DENABLE_BZIP2_COMPRESSION=1 -DENABLE_COMPLEX_DEPS=1 -DENABLE_HELIXREPO=1 -DENABLE_LZMA_COMPRESSION=1 -DENABLE_PGPVRFY=1 -DENABLE_PUBKEY=1 -DENABLE_RPMDB=1 -DENABLE_RPMDB_BYRPMHEADER=1 -DENABLE_RPMMD=1 -DENABLE_RPMPKG=1 -DENABLE_ZLIB_COMPRESSION=1 -DHAVE_FOPENCOOKIE=1 -DHAVE_QSORT_R=1 -DHAVE_STRCHRNUL=1 -DLIBSOLV_INTERNAL=1 -DRPM5 -D_FILE_OFFSET_BITS=64 -Dlibsolv_EXPORTS -I/usr/include/rpm -I/tmp/B.GcEWCU/BUILD/libsolv-0.6.34 -I/tmp/B.GcEWCU/BUILD/libsolv-0.6.34/src -I/tmp/B.GcEWCU/BUILD/libsolv-0.6.34/ext -I/tmp/B.GcEWCU/BUILD/libsolv-0.6.34/build -I/tmp/B.GcEWCU/BUILD/libsolv-0.6.34/build/src -Wall -fPIC -O2 -fwrapv -pipe -Wformat -Werror=format-security -gdwarf-4 -fno-debug-types-section -fvar-tracking-assignments -g2 -Wp,-D_FORTIFY_SOURCE=2 -fstack-protector-strong --param=ssp-buffer-size=4 -fomit-frame-pointer -march=i686 -fasynchronous-unwind-tables -mtune=pentium4 -gdwarf-4 -fno-debug-types-section -fvar-tracking-assignments -g2 -DNDEBUG -DQT_NO_DEBUG -fPIC -DVERSION=\"0.6.34\" -o CMakeFiles/libsolv.dir/md5.o -c /tmp/B.GcEWCU/BUILD/libsolv-0.6.34/src/md5.c make[2]: Leaving directory '/tmp/B.GcEWCU/BUILD/libsolv-0.6.34/build' make[2]: Entering directory '/tmp/B.GcEWCU/BUILD/libsolv-0.6.34/build' [ 30%] Building C object src/CMakeFiles/libsolv.dir/solvversion.o cd /tmp/B.GcEWCU/BUILD/libsolv-0.6.34/build/src && /usr/bin/i686-pld-linux-gcc -DENABLE_APPDATA=1 -DENABLE_BZIP2_COMPRESSION=1 -DENABLE_COMPLEX_DEPS=1 -DENABLE_HELIXREPO=1 -DENABLE_LZMA_COMPRESSION=1 -DENABLE_PGPVRFY=1 -DENABLE_PUBKEY=1 -DENABLE_RPMDB=1 -DENABLE_RPMDB_BYRPMHEADER=1 -DENABLE_RPMMD=1 -DENABLE_RPMPKG=1 -DENABLE_ZLIB_COMPRESSION=1 -DHAVE_FOPENCOOKIE=1 -DHAVE_QSORT_R=1 -DHAVE_STRCHRNUL=1 -DLIBSOLV_INTERNAL=1 -DRPM5 -D_FILE_OFFSET_BITS=64 -Dlibsolv_EXPORTS -I/usr/include/rpm -I/tmp/B.GcEWCU/BUILD/libsolv-0.6.34 -I/tmp/B.GcEWCU/BUILD/libsolv-0.6.34/src -I/tmp/B.GcEWCU/BUILD/libsolv-0.6.34/ext -I/tmp/B.GcEWCU/BUILD/libsolv-0.6.34/build -I/tmp/B.GcEWCU/BUILD/libsolv-0.6.34/build/src -Wall -fPIC -O2 -fwrapv -pipe -Wformat -Werror=format-security -gdwarf-4 -fno-debug-types-section -fvar-tracking-assignments -g2 -Wp,-D_FORTIFY_SOURCE=2 -fstack-protector-strong --param=ssp-buffer-size=4 -fomit-frame-pointer -march=i686 -fasynchronous-unwind-tables -mtune=pentium4 -gdwarf-4 -fno-debug-types-section -fvar-tracking-assignments -g2 -DNDEBUG -DQT_NO_DEBUG -fPIC -DVERSION=\"0.6.34\" -o CMakeFiles/libsolv.dir/solvversion.o -c /tmp/B.GcEWCU/BUILD/libsolv-0.6.34/src/solvversion.c make[2]: Leaving directory '/tmp/B.GcEWCU/BUILD/libsolv-0.6.34/build' make[2]: Entering directory '/tmp/B.GcEWCU/BUILD/libsolv-0.6.34/build' [ 24%] Building C object src/CMakeFiles/libsolv.dir/order.o cd /tmp/B.GcEWCU/BUILD/libsolv-0.6.34/build/src && /usr/bin/i686-pld-linux-gcc -DENABLE_APPDATA=1 -DENABLE_BZIP2_COMPRESSION=1 -DENABLE_COMPLEX_DEPS=1 -DENABLE_HELIXREPO=1 -DENABLE_LZMA_COMPRESSION=1 -DENABLE_PGPVRFY=1 -DENABLE_PUBKEY=1 -DENABLE_RPMDB=1 -DENABLE_RPMDB_BYRPMHEADER=1 -DENABLE_RPMMD=1 -DENABLE_RPMPKG=1 -DENABLE_ZLIB_COMPRESSION=1 -DHAVE_FOPENCOOKIE=1 -DHAVE_QSORT_R=1 -DHAVE_STRCHRNUL=1 -DLIBSOLV_INTERNAL=1 -DRPM5 -D_FILE_OFFSET_BITS=64 -Dlibsolv_EXPORTS -I/usr/include/rpm -I/tmp/B.GcEWCU/BUILD/libsolv-0.6.34 -I/tmp/B.GcEWCU/BUILD/libsolv-0.6.34/src -I/tmp/B.GcEWCU/BUILD/libsolv-0.6.34/ext -I/tmp/B.GcEWCU/BUILD/libsolv-0.6.34/build -I/tmp/B.GcEWCU/BUILD/libsolv-0.6.34/build/src -Wall -fPIC -O2 -fwrapv -pipe -Wformat -Werror=format-security -gdwarf-4 -fno-debug-types-section -fvar-tracking-assignments -g2 -Wp,-D_FORTIFY_SOURCE=2 -fstack-protector-strong --param=ssp-buffer-size=4 -fomit-frame-pointer -march=i686 -fasynchronous-unwind-tables -mtune=pentium4 -gdwarf-4 -fno-debug-types-section -fvar-tracking-assignments -g2 -DNDEBUG -DQT_NO_DEBUG -fPIC -DVERSION=\"0.6.34\" -o CMakeFiles/libsolv.dir/order.o -c /tmp/B.GcEWCU/BUILD/libsolv-0.6.34/src/order.c /tmp/B.GcEWCU/BUILD/libsolv-0.6.34/src/order.c: In function 'transaction_order': /tmp/B.GcEWCU/BUILD/libsolv-0.6.34/src/order.c:787:7: warning: variable 'oldcount' set but not used [-Wunused-but-set-variable] int oldcount; ^~~~~~~~ make[2]: Leaving directory '/tmp/B.GcEWCU/BUILD/libsolv-0.6.34/build' make[2]: Entering directory '/tmp/B.GcEWCU/BUILD/libsolv-0.6.34/build' [ 28%] Building C object src/CMakeFiles/libsolv.dir/sha1.o cd /tmp/B.GcEWCU/BUILD/libsolv-0.6.34/build/src && /usr/bin/i686-pld-linux-gcc -DENABLE_APPDATA=1 -DENABLE_BZIP2_COMPRESSION=1 -DENABLE_COMPLEX_DEPS=1 -DENABLE_HELIXREPO=1 -DENABLE_LZMA_COMPRESSION=1 -DENABLE_PGPVRFY=1 -DENABLE_PUBKEY=1 -DENABLE_RPMDB=1 -DENABLE_RPMDB_BYRPMHEADER=1 -DENABLE_RPMMD=1 -DENABLE_RPMPKG=1 -DENABLE_ZLIB_COMPRESSION=1 -DHAVE_FOPENCOOKIE=1 -DHAVE_QSORT_R=1 -DHAVE_STRCHRNUL=1 -DLIBSOLV_INTERNAL=1 -DRPM5 -D_FILE_OFFSET_BITS=64 -Dlibsolv_EXPORTS -I/usr/include/rpm -I/tmp/B.GcEWCU/BUILD/libsolv-0.6.34 -I/tmp/B.GcEWCU/BUILD/libsolv-0.6.34/src -I/tmp/B.GcEWCU/BUILD/libsolv-0.6.34/ext -I/tmp/B.GcEWCU/BUILD/libsolv-0.6.34/build -I/tmp/B.GcEWCU/BUILD/libsolv-0.6.34/build/src -Wall -fPIC -O2 -fwrapv -pipe -Wformat -Werror=format-security -gdwarf-4 -fno-debug-types-section -fvar-tracking-assignments -g2 -Wp,-D_FORTIFY_SOURCE=2 -fstack-protector-strong --param=ssp-buffer-size=4 -fomit-frame-pointer -march=i686 -fasynchronous-unwind-tables -mtune=pentium4 -gdwarf-4 -fno-debug-types-section -fvar-tracking-assignments -g2 -DNDEBUG -DQT_NO_DEBUG -fPIC -DVERSION=\"0.6.34\" -o CMakeFiles/libsolv.dir/sha1.o -c /tmp/B.GcEWCU/BUILD/libsolv-0.6.34/src/sha1.c make[2]: Leaving directory '/tmp/B.GcEWCU/BUILD/libsolv-0.6.34/build' make[2]: Entering directory '/tmp/B.GcEWCU/BUILD/libsolv-0.6.34/build' [ 25%] Building C object src/CMakeFiles/libsolv.dir/problems.o cd /tmp/B.GcEWCU/BUILD/libsolv-0.6.34/build/src && /usr/bin/i686-pld-linux-gcc -DENABLE_APPDATA=1 -DENABLE_BZIP2_COMPRESSION=1 -DENABLE_COMPLEX_DEPS=1 -DENABLE_HELIXREPO=1 -DENABLE_LZMA_COMPRESSION=1 -DENABLE_PGPVRFY=1 -DENABLE_PUBKEY=1 -DENABLE_RPMDB=1 -DENABLE_RPMDB_BYRPMHEADER=1 -DENABLE_RPMMD=1 -DENABLE_RPMPKG=1 -DENABLE_ZLIB_COMPRESSION=1 -DHAVE_FOPENCOOKIE=1 -DHAVE_QSORT_R=1 -DHAVE_STRCHRNUL=1 -DLIBSOLV_INTERNAL=1 -DRPM5 -D_FILE_OFFSET_BITS=64 -Dlibsolv_EXPORTS -I/usr/include/rpm -I/tmp/B.GcEWCU/BUILD/libsolv-0.6.34 -I/tmp/B.GcEWCU/BUILD/libsolv-0.6.34/src -I/tmp/B.GcEWCU/BUILD/libsolv-0.6.34/ext -I/tmp/B.GcEWCU/BUILD/libsolv-0.6.34/build -I/tmp/B.GcEWCU/BUILD/libsolv-0.6.34/build/src -Wall -fPIC -O2 -fwrapv -pipe -Wformat -Werror=format-security -gdwarf-4 -fno-debug-types-section -fvar-tracking-assignments -g2 -Wp,-D_FORTIFY_SOURCE=2 -fstack-protector-strong --param=ssp-buffer-size=4 -fomit-frame-pointer -march=i686 -fasynchronous-unwind-tables -mtune=pentium4 -gdwarf-4 -fno-debug-types-section -fvar-tracking-assignments -g2 -DNDEBUG -DQT_NO_DEBUG -fPIC -DVERSION=\"0.6.34\" -o CMakeFiles/libsolv.dir/problems.o -c /tmp/B.GcEWCU/BUILD/libsolv-0.6.34/src/problems.c make[2]: Leaving directory '/tmp/B.GcEWCU/BUILD/libsolv-0.6.34/build' make[2]: Entering directory '/tmp/B.GcEWCU/BUILD/libsolv-0.6.34/build' [ 31%] Building C object src/CMakeFiles/libsolv.dir/fileprovides.o cd /tmp/B.GcEWCU/BUILD/libsolv-0.6.34/build/src && /usr/bin/i686-pld-linux-gcc -DENABLE_APPDATA=1 -DENABLE_BZIP2_COMPRESSION=1 -DENABLE_COMPLEX_DEPS=1 -DENABLE_HELIXREPO=1 -DENABLE_LZMA_COMPRESSION=1 -DENABLE_PGPVRFY=1 -DENABLE_PUBKEY=1 -DENABLE_RPMDB=1 -DENABLE_RPMDB_BYRPMHEADER=1 -DENABLE_RPMMD=1 -DENABLE_RPMPKG=1 -DENABLE_ZLIB_COMPRESSION=1 -DHAVE_FOPENCOOKIE=1 -DHAVE_QSORT_R=1 -DHAVE_STRCHRNUL=1 -DLIBSOLV_INTERNAL=1 -DRPM5 -D_FILE_OFFSET_BITS=64 -Dlibsolv_EXPORTS -I/usr/include/rpm -I/tmp/B.GcEWCU/BUILD/libsolv-0.6.34 -I/tmp/B.GcEWCU/BUILD/libsolv-0.6.34/src -I/tmp/B.GcEWCU/BUILD/libsolv-0.6.34/ext -I/tmp/B.GcEWCU/BUILD/libsolv-0.6.34/build -I/tmp/B.GcEWCU/BUILD/libsolv-0.6.34/build/src -Wall -fPIC -O2 -fwrapv -pipe -Wformat -Werror=format-security -gdwarf-4 -fno-debug-types-section -fvar-tracking-assignments -g2 -Wp,-D_FORTIFY_SOURCE=2 -fstack-protector-strong --param=ssp-buffer-size=4 -fomit-frame-pointer -march=i686 -fasynchronous-unwind-tables -mtune=pentium4 -gdwarf-4 -fno-debug-types-section -fvar-tracking-assignments -g2 -DNDEBUG -DQT_NO_DEBUG -fPIC -DVERSION=\"0.6.34\" -o CMakeFiles/libsolv.dir/fileprovides.o -c /tmp/B.GcEWCU/BUILD/libsolv-0.6.34/src/fileprovides.c make[2]: Leaving directory '/tmp/B.GcEWCU/BUILD/libsolv-0.6.34/build' make[2]: Entering directory '/tmp/B.GcEWCU/BUILD/libsolv-0.6.34/build' [ 32%] Building C object src/CMakeFiles/libsolv.dir/diskusage.o cd /tmp/B.GcEWCU/BUILD/libsolv-0.6.34/build/src && /usr/bin/i686-pld-linux-gcc -DENABLE_APPDATA=1 -DENABLE_BZIP2_COMPRESSION=1 -DENABLE_COMPLEX_DEPS=1 -DENABLE_HELIXREPO=1 -DENABLE_LZMA_COMPRESSION=1 -DENABLE_PGPVRFY=1 -DENABLE_PUBKEY=1 -DENABLE_RPMDB=1 -DENABLE_RPMDB_BYRPMHEADER=1 -DENABLE_RPMMD=1 -DENABLE_RPMPKG=1 -DENABLE_ZLIB_COMPRESSION=1 -DHAVE_FOPENCOOKIE=1 -DHAVE_QSORT_R=1 -DHAVE_STRCHRNUL=1 -DLIBSOLV_INTERNAL=1 -DRPM5 -D_FILE_OFFSET_BITS=64 -Dlibsolv_EXPORTS -I/usr/include/rpm -I/tmp/B.GcEWCU/BUILD/libsolv-0.6.34 -I/tmp/B.GcEWCU/BUILD/libsolv-0.6.34/src -I/tmp/B.GcEWCU/BUILD/libsolv-0.6.34/ext -I/tmp/B.GcEWCU/BUILD/libsolv-0.6.34/build -I/tmp/B.GcEWCU/BUILD/libsolv-0.6.34/build/src -Wall -fPIC -O2 -fwrapv -pipe -Wformat -Werror=format-security -gdwarf-4 -fno-debug-types-section -fvar-tracking-assignments -g2 -Wp,-D_FORTIFY_SOURCE=2 -fstack-protector-strong --param=ssp-buffer-size=4 -fomit-frame-pointer -march=i686 -fasynchronous-unwind-tables -mtune=pentium4 -gdwarf-4 -fno-debug-types-section -fvar-tracking-assignments -g2 -DNDEBUG -DQT_NO_DEBUG -fPIC -DVERSION=\"0.6.34\" -o CMakeFiles/libsolv.dir/diskusage.o -c /tmp/B.GcEWCU/BUILD/libsolv-0.6.34/src/diskusage.c make[2]: Leaving directory '/tmp/B.GcEWCU/BUILD/libsolv-0.6.34/build' make[2]: Entering directory '/tmp/B.GcEWCU/BUILD/libsolv-0.6.34/build' [ 19%] Building C object src/CMakeFiles/libsolv.dir/repodata.o cd /tmp/B.GcEWCU/BUILD/libsolv-0.6.34/build/src && /usr/bin/i686-pld-linux-gcc -DENABLE_APPDATA=1 -DENABLE_BZIP2_COMPRESSION=1 -DENABLE_COMPLEX_DEPS=1 -DENABLE_HELIXREPO=1 -DENABLE_LZMA_COMPRESSION=1 -DENABLE_PGPVRFY=1 -DENABLE_PUBKEY=1 -DENABLE_RPMDB=1 -DENABLE_RPMDB_BYRPMHEADER=1 -DENABLE_RPMMD=1 -DENABLE_RPMPKG=1 -DENABLE_ZLIB_COMPRESSION=1 -DHAVE_FOPENCOOKIE=1 -DHAVE_QSORT_R=1 -DHAVE_STRCHRNUL=1 -DLIBSOLV_INTERNAL=1 -DRPM5 -D_FILE_OFFSET_BITS=64 -Dlibsolv_EXPORTS -I/usr/include/rpm -I/tmp/B.GcEWCU/BUILD/libsolv-0.6.34 -I/tmp/B.GcEWCU/BUILD/libsolv-0.6.34/src -I/tmp/B.GcEWCU/BUILD/libsolv-0.6.34/ext -I/tmp/B.GcEWCU/BUILD/libsolv-0.6.34/build -I/tmp/B.GcEWCU/BUILD/libsolv-0.6.34/build/src -Wall -fPIC -O2 -fwrapv -pipe -Wformat -Werror=format-security -gdwarf-4 -fno-debug-types-section -fvar-tracking-assignments -g2 -Wp,-D_FORTIFY_SOURCE=2 -fstack-protector-strong --param=ssp-buffer-size=4 -fomit-frame-pointer -march=i686 -fasynchronous-unwind-tables -mtune=pentium4 -gdwarf-4 -fno-debug-types-section -fvar-tracking-assignments -g2 -DNDEBUG -DQT_NO_DEBUG -fPIC -DVERSION=\"0.6.34\" -o CMakeFiles/libsolv.dir/repodata.o -c /tmp/B.GcEWCU/BUILD/libsolv-0.6.34/src/repodata.c make[2]: Leaving directory '/tmp/B.GcEWCU/BUILD/libsolv-0.6.34/build' make[2]: Entering directory '/tmp/B.GcEWCU/BUILD/libsolv-0.6.34/build' [ 29%] Building C object src/CMakeFiles/libsolv.dir/sha2.o cd /tmp/B.GcEWCU/BUILD/libsolv-0.6.34/build/src && /usr/bin/i686-pld-linux-gcc -DENABLE_APPDATA=1 -DENABLE_BZIP2_COMPRESSION=1 -DENABLE_COMPLEX_DEPS=1 -DENABLE_HELIXREPO=1 -DENABLE_LZMA_COMPRESSION=1 -DENABLE_PGPVRFY=1 -DENABLE_PUBKEY=1 -DENABLE_RPMDB=1 -DENABLE_RPMDB_BYRPMHEADER=1 -DENABLE_RPMMD=1 -DENABLE_RPMPKG=1 -DENABLE_ZLIB_COMPRESSION=1 -DHAVE_FOPENCOOKIE=1 -DHAVE_QSORT_R=1 -DHAVE_STRCHRNUL=1 -DLIBSOLV_INTERNAL=1 -DRPM5 -D_FILE_OFFSET_BITS=64 -Dlibsolv_EXPORTS -I/usr/include/rpm -I/tmp/B.GcEWCU/BUILD/libsolv-0.6.34 -I/tmp/B.GcEWCU/BUILD/libsolv-0.6.34/src -I/tmp/B.GcEWCU/BUILD/libsolv-0.6.34/ext -I/tmp/B.GcEWCU/BUILD/libsolv-0.6.34/build -I/tmp/B.GcEWCU/BUILD/libsolv-0.6.34/build/src -Wall -fPIC -O2 -fwrapv -pipe -Wformat -Werror=format-security -gdwarf-4 -fno-debug-types-section -fvar-tracking-assignments -g2 -Wp,-D_FORTIFY_SOURCE=2 -fstack-protector-strong --param=ssp-buffer-size=4 -fomit-frame-pointer -march=i686 -fasynchronous-unwind-tables -mtune=pentium4 -gdwarf-4 -fno-debug-types-section -fvar-tracking-assignments -g2 -DNDEBUG -DQT_NO_DEBUG -fPIC -DVERSION=\"0.6.34\" -o CMakeFiles/libsolv.dir/sha2.o -c /tmp/B.GcEWCU/BUILD/libsolv-0.6.34/src/sha2.c make[2]: Leaving directory '/tmp/B.GcEWCU/BUILD/libsolv-0.6.34/build' make[2]: Entering directory '/tmp/B.GcEWCU/BUILD/libsolv-0.6.34/build' [ 32%] Building C object src/CMakeFiles/libsolv.dir/suse.o cd /tmp/B.GcEWCU/BUILD/libsolv-0.6.34/build/src && /usr/bin/i686-pld-linux-gcc -DENABLE_APPDATA=1 -DENABLE_BZIP2_COMPRESSION=1 -DENABLE_COMPLEX_DEPS=1 -DENABLE_HELIXREPO=1 -DENABLE_LZMA_COMPRESSION=1 -DENABLE_PGPVRFY=1 -DENABLE_PUBKEY=1 -DENABLE_RPMDB=1 -DENABLE_RPMDB_BYRPMHEADER=1 -DENABLE_RPMMD=1 -DENABLE_RPMPKG=1 -DENABLE_ZLIB_COMPRESSION=1 -DHAVE_FOPENCOOKIE=1 -DHAVE_QSORT_R=1 -DHAVE_STRCHRNUL=1 -DLIBSOLV_INTERNAL=1 -DRPM5 -D_FILE_OFFSET_BITS=64 -Dlibsolv_EXPORTS -I/usr/include/rpm -I/tmp/B.GcEWCU/BUILD/libsolv-0.6.34 -I/tmp/B.GcEWCU/BUILD/libsolv-0.6.34/src -I/tmp/B.GcEWCU/BUILD/libsolv-0.6.34/ext -I/tmp/B.GcEWCU/BUILD/libsolv-0.6.34/build -I/tmp/B.GcEWCU/BUILD/libsolv-0.6.34/build/src -Wall -fPIC -O2 -fwrapv -pipe -Wformat -Werror=format-security -gdwarf-4 -fno-debug-types-section -fvar-tracking-assignments -g2 -Wp,-D_FORTIFY_SOURCE=2 -fstack-protector-strong --param=ssp-buffer-size=4 -fomit-frame-pointer -march=i686 -fasynchronous-unwind-tables -mtune=pentium4 -gdwarf-4 -fno-debug-types-section -fvar-tracking-assignments -g2 -DNDEBUG -DQT_NO_DEBUG -fPIC -DVERSION=\"0.6.34\" -o CMakeFiles/libsolv.dir/suse.o -c /tmp/B.GcEWCU/BUILD/libsolv-0.6.34/src/suse.c make[2]: Leaving directory '/tmp/B.GcEWCU/BUILD/libsolv-0.6.34/build' make[2]: Entering directory '/tmp/B.GcEWCU/BUILD/libsolv-0.6.34/build' [ 33%] Building C object src/CMakeFiles/libsolv.dir/solver_util.o cd /tmp/B.GcEWCU/BUILD/libsolv-0.6.34/build/src && /usr/bin/i686-pld-linux-gcc -DENABLE_APPDATA=1 -DENABLE_BZIP2_COMPRESSION=1 -DENABLE_COMPLEX_DEPS=1 -DENABLE_HELIXREPO=1 -DENABLE_LZMA_COMPRESSION=1 -DENABLE_PGPVRFY=1 -DENABLE_PUBKEY=1 -DENABLE_RPMDB=1 -DENABLE_RPMDB_BYRPMHEADER=1 -DENABLE_RPMMD=1 -DENABLE_RPMPKG=1 -DENABLE_ZLIB_COMPRESSION=1 -DHAVE_FOPENCOOKIE=1 -DHAVE_QSORT_R=1 -DHAVE_STRCHRNUL=1 -DLIBSOLV_INTERNAL=1 -DRPM5 -D_FILE_OFFSET_BITS=64 -Dlibsolv_EXPORTS -I/usr/include/rpm -I/tmp/B.GcEWCU/BUILD/libsolv-0.6.34 -I/tmp/B.GcEWCU/BUILD/libsolv-0.6.34/src -I/tmp/B.GcEWCU/BUILD/libsolv-0.6.34/ext -I/tmp/B.GcEWCU/BUILD/libsolv-0.6.34/build -I/tmp/B.GcEWCU/BUILD/libsolv-0.6.34/build/src -Wall -fPIC -O2 -fwrapv -pipe -Wformat -Werror=format-security -gdwarf-4 -fno-debug-types-section -fvar-tracking-assignments -g2 -Wp,-D_FORTIFY_SOURCE=2 -fstack-protector-strong --param=ssp-buffer-size=4 -fomit-frame-pointer -march=i686 -fasynchronous-unwind-tables -mtune=pentium4 -gdwarf-4 -fno-debug-types-section -fvar-tracking-assignments -g2 -DNDEBUG -DQT_NO_DEBUG -fPIC -DVERSION=\"0.6.34\" -o CMakeFiles/libsolv.dir/solver_util.o -c /tmp/B.GcEWCU/BUILD/libsolv-0.6.34/src/solver_util.c make[2]: Leaving directory '/tmp/B.GcEWCU/BUILD/libsolv-0.6.34/build' make[2]: Entering directory '/tmp/B.GcEWCU/BUILD/libsolv-0.6.34/build' [ 34%] Building C object src/CMakeFiles/libsolv.dir/userinstalled.o cd /tmp/B.GcEWCU/BUILD/libsolv-0.6.34/build/src && /usr/bin/i686-pld-linux-gcc -DENABLE_APPDATA=1 -DENABLE_BZIP2_COMPRESSION=1 -DENABLE_COMPLEX_DEPS=1 -DENABLE_HELIXREPO=1 -DENABLE_LZMA_COMPRESSION=1 -DENABLE_PGPVRFY=1 -DENABLE_PUBKEY=1 -DENABLE_RPMDB=1 -DENABLE_RPMDB_BYRPMHEADER=1 -DENABLE_RPMMD=1 -DENABLE_RPMPKG=1 -DENABLE_ZLIB_COMPRESSION=1 -DHAVE_FOPENCOOKIE=1 -DHAVE_QSORT_R=1 -DHAVE_STRCHRNUL=1 -DLIBSOLV_INTERNAL=1 -DRPM5 -D_FILE_OFFSET_BITS=64 -Dlibsolv_EXPORTS -I/usr/include/rpm -I/tmp/B.GcEWCU/BUILD/libsolv-0.6.34 -I/tmp/B.GcEWCU/BUILD/libsolv-0.6.34/src -I/tmp/B.GcEWCU/BUILD/libsolv-0.6.34/ext -I/tmp/B.GcEWCU/BUILD/libsolv-0.6.34/build -I/tmp/B.GcEWCU/BUILD/libsolv-0.6.34/build/src -Wall -fPIC -O2 -fwrapv -pipe -Wformat -Werror=format-security -gdwarf-4 -fno-debug-types-section -fvar-tracking-assignments -g2 -Wp,-D_FORTIFY_SOURCE=2 -fstack-protector-strong --param=ssp-buffer-size=4 -fomit-frame-pointer -march=i686 -fasynchronous-unwind-tables -mtune=pentium4 -gdwarf-4 -fno-debug-types-section -fvar-tracking-assignments -g2 -DNDEBUG -DQT_NO_DEBUG -fPIC -DVERSION=\"0.6.34\" -o CMakeFiles/libsolv.dir/userinstalled.o -c /tmp/B.GcEWCU/BUILD/libsolv-0.6.34/src/userinstalled.c make[2]: Leaving directory '/tmp/B.GcEWCU/BUILD/libsolv-0.6.34/build' make[2]: Entering directory '/tmp/B.GcEWCU/BUILD/libsolv-0.6.34/build' [ 36%] Building C object src/CMakeFiles/libsolv_static.dir/evr.o cd /tmp/B.GcEWCU/BUILD/libsolv-0.6.34/build/src && /usr/bin/i686-pld-linux-gcc -DENABLE_APPDATA=1 -DENABLE_BZIP2_COMPRESSION=1 -DENABLE_COMPLEX_DEPS=1 -DENABLE_HELIXREPO=1 -DENABLE_LZMA_COMPRESSION=1 -DENABLE_PGPVRFY=1 -DENABLE_PUBKEY=1 -DENABLE_RPMDB=1 -DENABLE_RPMDB_BYRPMHEADER=1 -DENABLE_RPMMD=1 -DENABLE_RPMPKG=1 -DENABLE_ZLIB_COMPRESSION=1 -DHAVE_FOPENCOOKIE=1 -DHAVE_QSORT_R=1 -DHAVE_STRCHRNUL=1 -DLIBSOLV_INTERNAL=1 -DRPM5 -D_FILE_OFFSET_BITS=64 -I/usr/include/rpm -I/tmp/B.GcEWCU/BUILD/libsolv-0.6.34 -I/tmp/B.GcEWCU/BUILD/libsolv-0.6.34/src -I/tmp/B.GcEWCU/BUILD/libsolv-0.6.34/ext -I/tmp/B.GcEWCU/BUILD/libsolv-0.6.34/build -I/tmp/B.GcEWCU/BUILD/libsolv-0.6.34/build/src -Wall -fPIC -O2 -fwrapv -pipe -Wformat -Werror=format-security -gdwarf-4 -fno-debug-types-section -fvar-tracking-assignments -g2 -Wp,-D_FORTIFY_SOURCE=2 -fstack-protector-strong --param=ssp-buffer-size=4 -fomit-frame-pointer -march=i686 -fasynchronous-unwind-tables -mtune=pentium4 -gdwarf-4 -fno-debug-types-section -fvar-tracking-assignments -g2 -DNDEBUG -DQT_NO_DEBUG -DVERSION=\"0.6.34\" -o CMakeFiles/libsolv_static.dir/evr.o -c /tmp/B.GcEWCU/BUILD/libsolv-0.6.34/src/evr.c make[2]: Leaving directory '/tmp/B.GcEWCU/BUILD/libsolv-0.6.34/build' make[2]: Entering directory '/tmp/B.GcEWCU/BUILD/libsolv-0.6.34/build' [ 30%] Building C object src/CMakeFiles/libsolv.dir/selection.o cd /tmp/B.GcEWCU/BUILD/libsolv-0.6.34/build/src && /usr/bin/i686-pld-linux-gcc -DENABLE_APPDATA=1 -DENABLE_BZIP2_COMPRESSION=1 -DENABLE_COMPLEX_DEPS=1 -DENABLE_HELIXREPO=1 -DENABLE_LZMA_COMPRESSION=1 -DENABLE_PGPVRFY=1 -DENABLE_PUBKEY=1 -DENABLE_RPMDB=1 -DENABLE_RPMDB_BYRPMHEADER=1 -DENABLE_RPMMD=1 -DENABLE_RPMPKG=1 -DENABLE_ZLIB_COMPRESSION=1 -DHAVE_FOPENCOOKIE=1 -DHAVE_QSORT_R=1 -DHAVE_STRCHRNUL=1 -DLIBSOLV_INTERNAL=1 -DRPM5 -D_FILE_OFFSET_BITS=64 -Dlibsolv_EXPORTS -I/usr/include/rpm -I/tmp/B.GcEWCU/BUILD/libsolv-0.6.34 -I/tmp/B.GcEWCU/BUILD/libsolv-0.6.34/src -I/tmp/B.GcEWCU/BUILD/libsolv-0.6.34/ext -I/tmp/B.GcEWCU/BUILD/libsolv-0.6.34/build -I/tmp/B.GcEWCU/BUILD/libsolv-0.6.34/build/src -Wall -fPIC -O2 -fwrapv -pipe -Wformat -Werror=format-security -gdwarf-4 -fno-debug-types-section -fvar-tracking-assignments -g2 -Wp,-D_FORTIFY_SOURCE=2 -fstack-protector-strong --param=ssp-buffer-size=4 -fomit-frame-pointer -march=i686 -fasynchronous-unwind-tables -mtune=pentium4 -gdwarf-4 -fno-debug-types-section -fvar-tracking-assignments -g2 -DNDEBUG -DQT_NO_DEBUG -fPIC -DVERSION=\"0.6.34\" -o CMakeFiles/libsolv.dir/selection.o -c /tmp/B.GcEWCU/BUILD/libsolv-0.6.34/src/selection.c make[2]: Leaving directory '/tmp/B.GcEWCU/BUILD/libsolv-0.6.34/build' make[2]: Entering directory '/tmp/B.GcEWCU/BUILD/libsolv-0.6.34/build' [ 12%] Building C object src/CMakeFiles/libsolv.dir/solver.o cd /tmp/B.GcEWCU/BUILD/libsolv-0.6.34/build/src && /usr/bin/i686-pld-linux-gcc -DENABLE_APPDATA=1 -DENABLE_BZIP2_COMPRESSION=1 -DENABLE_COMPLEX_DEPS=1 -DENABLE_HELIXREPO=1 -DENABLE_LZMA_COMPRESSION=1 -DENABLE_PGPVRFY=1 -DENABLE_PUBKEY=1 -DENABLE_RPMDB=1 -DENABLE_RPMDB_BYRPMHEADER=1 -DENABLE_RPMMD=1 -DENABLE_RPMPKG=1 -DENABLE_ZLIB_COMPRESSION=1 -DHAVE_FOPENCOOKIE=1 -DHAVE_QSORT_R=1 -DHAVE_STRCHRNUL=1 -DLIBSOLV_INTERNAL=1 -DRPM5 -D_FILE_OFFSET_BITS=64 -Dlibsolv_EXPORTS -I/usr/include/rpm -I/tmp/B.GcEWCU/BUILD/libsolv-0.6.34 -I/tmp/B.GcEWCU/BUILD/libsolv-0.6.34/src -I/tmp/B.GcEWCU/BUILD/libsolv-0.6.34/ext -I/tmp/B.GcEWCU/BUILD/libsolv-0.6.34/build -I/tmp/B.GcEWCU/BUILD/libsolv-0.6.34/build/src -Wall -fPIC -O2 -fwrapv -pipe -Wformat -Werror=format-security -gdwarf-4 -fno-debug-types-section -fvar-tracking-assignments -g2 -Wp,-D_FORTIFY_SOURCE=2 -fstack-protector-strong --param=ssp-buffer-size=4 -fomit-frame-pointer -march=i686 -fasynchronous-unwind-tables -mtune=pentium4 -gdwarf-4 -fno-debug-types-section -fvar-tracking-assignments -g2 -DNDEBUG -DQT_NO_DEBUG -fPIC -DVERSION=\"0.6.34\" -o CMakeFiles/libsolv.dir/solver.o -c /tmp/B.GcEWCU/BUILD/libsolv-0.6.34/src/solver.c make[2]: Leaving directory '/tmp/B.GcEWCU/BUILD/libsolv-0.6.34/build' make[2]: Entering directory '/tmp/B.GcEWCU/BUILD/libsolv-0.6.34/build' [ 38%] Building C object src/CMakeFiles/libsolv_static.dir/queue.o cd /tmp/B.GcEWCU/BUILD/libsolv-0.6.34/build/src && /usr/bin/i686-pld-linux-gcc -DENABLE_APPDATA=1 -DENABLE_BZIP2_COMPRESSION=1 -DENABLE_COMPLEX_DEPS=1 -DENABLE_HELIXREPO=1 -DENABLE_LZMA_COMPRESSION=1 -DENABLE_PGPVRFY=1 -DENABLE_PUBKEY=1 -DENABLE_RPMDB=1 -DENABLE_RPMDB_BYRPMHEADER=1 -DENABLE_RPMMD=1 -DENABLE_RPMPKG=1 -DENABLE_ZLIB_COMPRESSION=1 -DHAVE_FOPENCOOKIE=1 -DHAVE_QSORT_R=1 -DHAVE_STRCHRNUL=1 -DLIBSOLV_INTERNAL=1 -DRPM5 -D_FILE_OFFSET_BITS=64 -I/usr/include/rpm -I/tmp/B.GcEWCU/BUILD/libsolv-0.6.34 -I/tmp/B.GcEWCU/BUILD/libsolv-0.6.34/src -I/tmp/B.GcEWCU/BUILD/libsolv-0.6.34/ext -I/tmp/B.GcEWCU/BUILD/libsolv-0.6.34/build -I/tmp/B.GcEWCU/BUILD/libsolv-0.6.34/build/src -Wall -fPIC -O2 -fwrapv -pipe -Wformat -Werror=format-security -gdwarf-4 -fno-debug-types-section -fvar-tracking-assignments -g2 -Wp,-D_FORTIFY_SOURCE=2 -fstack-protector-strong --param=ssp-buffer-size=4 -fomit-frame-pointer -march=i686 -fasynchronous-unwind-tables -mtune=pentium4 -gdwarf-4 -fno-debug-types-section -fvar-tracking-assignments -g2 -DNDEBUG -DQT_NO_DEBUG -DVERSION=\"0.6.34\" -o CMakeFiles/libsolv_static.dir/queue.o -c /tmp/B.GcEWCU/BUILD/libsolv-0.6.34/src/queue.c make[2]: Leaving directory '/tmp/B.GcEWCU/BUILD/libsolv-0.6.34/build' make[2]: Entering directory '/tmp/B.GcEWCU/BUILD/libsolv-0.6.34/build' [ 34%] Building C object src/CMakeFiles/libsolv.dir/cleandeps.o cd /tmp/B.GcEWCU/BUILD/libsolv-0.6.34/build/src && /usr/bin/i686-pld-linux-gcc -DENABLE_APPDATA=1 -DENABLE_BZIP2_COMPRESSION=1 -DENABLE_COMPLEX_DEPS=1 -DENABLE_HELIXREPO=1 -DENABLE_LZMA_COMPRESSION=1 -DENABLE_PGPVRFY=1 -DENABLE_PUBKEY=1 -DENABLE_RPMDB=1 -DENABLE_RPMDB_BYRPMHEADER=1 -DENABLE_RPMMD=1 -DENABLE_RPMPKG=1 -DENABLE_ZLIB_COMPRESSION=1 -DHAVE_FOPENCOOKIE=1 -DHAVE_QSORT_R=1 -DHAVE_STRCHRNUL=1 -DLIBSOLV_INTERNAL=1 -DRPM5 -D_FILE_OFFSET_BITS=64 -Dlibsolv_EXPORTS -I/usr/include/rpm -I/tmp/B.GcEWCU/BUILD/libsolv-0.6.34 -I/tmp/B.GcEWCU/BUILD/libsolv-0.6.34/src -I/tmp/B.GcEWCU/BUILD/libsolv-0.6.34/ext -I/tmp/B.GcEWCU/BUILD/libsolv-0.6.34/build -I/tmp/B.GcEWCU/BUILD/libsolv-0.6.34/build/src -Wall -fPIC -O2 -fwrapv -pipe -Wformat -Werror=format-security -gdwarf-4 -fno-debug-types-section -fvar-tracking-assignments -g2 -Wp,-D_FORTIFY_SOURCE=2 -fstack-protector-strong --param=ssp-buffer-size=4 -fomit-frame-pointer -march=i686 -fasynchronous-unwind-tables -mtune=pentium4 -gdwarf-4 -fno-debug-types-section -fvar-tracking-assignments -g2 -DNDEBUG -DQT_NO_DEBUG -fPIC -DVERSION=\"0.6.34\" -o CMakeFiles/libsolv.dir/cleandeps.o -c /tmp/B.GcEWCU/BUILD/libsolv-0.6.34/src/cleandeps.c make[2]: Leaving directory '/tmp/B.GcEWCU/BUILD/libsolv-0.6.34/build' make[2]: Entering directory '/tmp/B.GcEWCU/BUILD/libsolv-0.6.34/build' [ 35%] Building C object src/CMakeFiles/libsolv_static.dir/repo_solv.o cd /tmp/B.GcEWCU/BUILD/libsolv-0.6.34/build/src && /usr/bin/i686-pld-linux-gcc -DENABLE_APPDATA=1 -DENABLE_BZIP2_COMPRESSION=1 -DENABLE_COMPLEX_DEPS=1 -DENABLE_HELIXREPO=1 -DENABLE_LZMA_COMPRESSION=1 -DENABLE_PGPVRFY=1 -DENABLE_PUBKEY=1 -DENABLE_RPMDB=1 -DENABLE_RPMDB_BYRPMHEADER=1 -DENABLE_RPMMD=1 -DENABLE_RPMPKG=1 -DENABLE_ZLIB_COMPRESSION=1 -DHAVE_FOPENCOOKIE=1 -DHAVE_QSORT_R=1 -DHAVE_STRCHRNUL=1 -DLIBSOLV_INTERNAL=1 -DRPM5 -D_FILE_OFFSET_BITS=64 -I/usr/include/rpm -I/tmp/B.GcEWCU/BUILD/libsolv-0.6.34 -I/tmp/B.GcEWCU/BUILD/libsolv-0.6.34/src -I/tmp/B.GcEWCU/BUILD/libsolv-0.6.34/ext -I/tmp/B.GcEWCU/BUILD/libsolv-0.6.34/build -I/tmp/B.GcEWCU/BUILD/libsolv-0.6.34/build/src -Wall -fPIC -O2 -fwrapv -pipe -Wformat -Werror=format-security -gdwarf-4 -fno-debug-types-section -fvar-tracking-assignments -g2 -Wp,-D_FORTIFY_SOURCE=2 -fstack-protector-strong --param=ssp-buffer-size=4 -fomit-frame-pointer -march=i686 -fasynchronous-unwind-tables -mtune=pentium4 -gdwarf-4 -fno-debug-types-section -fvar-tracking-assignments -g2 -DNDEBUG -DQT_NO_DEBUG -DVERSION=\"0.6.34\" -o CMakeFiles/libsolv_static.dir/repo_solv.o -c /tmp/B.GcEWCU/BUILD/libsolv-0.6.34/src/repo_solv.c make[2]: Leaving directory '/tmp/B.GcEWCU/BUILD/libsolv-0.6.34/build' make[2]: Entering directory '/tmp/B.GcEWCU/BUILD/libsolv-0.6.34/build' [ 20%] Building C object src/CMakeFiles/libsolv_static.dir/solver.o cd /tmp/B.GcEWCU/BUILD/libsolv-0.6.34/build/src && /usr/bin/i686-pld-linux-gcc -DENABLE_APPDATA=1 -DENABLE_BZIP2_COMPRESSION=1 -DENABLE_COMPLEX_DEPS=1 -DENABLE_HELIXREPO=1 -DENABLE_LZMA_COMPRESSION=1 -DENABLE_PGPVRFY=1 -DENABLE_PUBKEY=1 -DENABLE_RPMDB=1 -DENABLE_RPMDB_BYRPMHEADER=1 -DENABLE_RPMMD=1 -DENABLE_RPMPKG=1 -DENABLE_ZLIB_COMPRESSION=1 -DHAVE_FOPENCOOKIE=1 -DHAVE_QSORT_R=1 -DHAVE_STRCHRNUL=1 -DLIBSOLV_INTERNAL=1 -DRPM5 -D_FILE_OFFSET_BITS=64 -I/usr/include/rpm -I/tmp/B.GcEWCU/BUILD/libsolv-0.6.34 -I/tmp/B.GcEWCU/BUILD/libsolv-0.6.34/src -I/tmp/B.GcEWCU/BUILD/libsolv-0.6.34/ext -I/tmp/B.GcEWCU/BUILD/libsolv-0.6.34/build -I/tmp/B.GcEWCU/BUILD/libsolv-0.6.34/build/src -Wall -fPIC -O2 -fwrapv -pipe -Wformat -Werror=format-security -gdwarf-4 -fno-debug-types-section -fvar-tracking-assignments -g2 -Wp,-D_FORTIFY_SOURCE=2 -fstack-protector-strong --param=ssp-buffer-size=4 -fomit-frame-pointer -march=i686 -fasynchronous-unwind-tables -mtune=pentium4 -gdwarf-4 -fno-debug-types-section -fvar-tracking-assignments -g2 -DNDEBUG -DQT_NO_DEBUG -DVERSION=\"0.6.34\" -o CMakeFiles/libsolv_static.dir/solver.o -c /tmp/B.GcEWCU/BUILD/libsolv-0.6.34/src/solver.c make[2]: Leaving directory '/tmp/B.GcEWCU/BUILD/libsolv-0.6.34/build' make[2]: Entering directory '/tmp/B.GcEWCU/BUILD/libsolv-0.6.34/build' [ 41%] Building C object src/CMakeFiles/libsolv_static.dir/util.o cd /tmp/B.GcEWCU/BUILD/libsolv-0.6.34/build/src && /usr/bin/i686-pld-linux-gcc -DENABLE_APPDATA=1 -DENABLE_BZIP2_COMPRESSION=1 -DENABLE_COMPLEX_DEPS=1 -DENABLE_HELIXREPO=1 -DENABLE_LZMA_COMPRESSION=1 -DENABLE_PGPVRFY=1 -DENABLE_PUBKEY=1 -DENABLE_RPMDB=1 -DENABLE_RPMDB_BYRPMHEADER=1 -DENABLE_RPMMD=1 -DENABLE_RPMPKG=1 -DENABLE_ZLIB_COMPRESSION=1 -DHAVE_FOPENCOOKIE=1 -DHAVE_QSORT_R=1 -DHAVE_STRCHRNUL=1 -DLIBSOLV_INTERNAL=1 -DRPM5 -D_FILE_OFFSET_BITS=64 -I/usr/include/rpm -I/tmp/B.GcEWCU/BUILD/libsolv-0.6.34 -I/tmp/B.GcEWCU/BUILD/libsolv-0.6.34/src -I/tmp/B.GcEWCU/BUILD/libsolv-0.6.34/ext -I/tmp/B.GcEWCU/BUILD/libsolv-0.6.34/build -I/tmp/B.GcEWCU/BUILD/libsolv-0.6.34/build/src -Wall -fPIC -O2 -fwrapv -pipe -Wformat -Werror=format-security -gdwarf-4 -fno-debug-types-section -fvar-tracking-assignments -g2 -Wp,-D_FORTIFY_SOURCE=2 -fstack-protector-strong --param=ssp-buffer-size=4 -fomit-frame-pointer -march=i686 -fasynchronous-unwind-tables -mtune=pentium4 -gdwarf-4 -fno-debug-types-section -fvar-tracking-assignments -g2 -DNDEBUG -DQT_NO_DEBUG -DVERSION=\"0.6.34\" -o CMakeFiles/libsolv_static.dir/util.o -c /tmp/B.GcEWCU/BUILD/libsolv-0.6.34/src/util.c make[2]: Leaving directory '/tmp/B.GcEWCU/BUILD/libsolv-0.6.34/build' make[2]: Entering directory '/tmp/B.GcEWCU/BUILD/libsolv-0.6.34/build' [ 40%] Building C object src/CMakeFiles/libsolv_static.dir/repopage.o cd /tmp/B.GcEWCU/BUILD/libsolv-0.6.34/build/src && /usr/bin/i686-pld-linux-gcc -DENABLE_APPDATA=1 -DENABLE_BZIP2_COMPRESSION=1 -DENABLE_COMPLEX_DEPS=1 -DENABLE_HELIXREPO=1 -DENABLE_LZMA_COMPRESSION=1 -DENABLE_PGPVRFY=1 -DENABLE_PUBKEY=1 -DENABLE_RPMDB=1 -DENABLE_RPMDB_BYRPMHEADER=1 -DENABLE_RPMMD=1 -DENABLE_RPMPKG=1 -DENABLE_ZLIB_COMPRESSION=1 -DHAVE_FOPENCOOKIE=1 -DHAVE_QSORT_R=1 -DHAVE_STRCHRNUL=1 -DLIBSOLV_INTERNAL=1 -DRPM5 -D_FILE_OFFSET_BITS=64 -I/usr/include/rpm -I/tmp/B.GcEWCU/BUILD/libsolv-0.6.34 -I/tmp/B.GcEWCU/BUILD/libsolv-0.6.34/src -I/tmp/B.GcEWCU/BUILD/libsolv-0.6.34/ext -I/tmp/B.GcEWCU/BUILD/libsolv-0.6.34/build -I/tmp/B.GcEWCU/BUILD/libsolv-0.6.34/build/src -Wall -fPIC -O2 -fwrapv -pipe -Wformat -Werror=format-security -gdwarf-4 -fno-debug-types-section -fvar-tracking-assignments -g2 -Wp,-D_FORTIFY_SOURCE=2 -fstack-protector-strong --param=ssp-buffer-size=4 -fomit-frame-pointer -march=i686 -fasynchronous-unwind-tables -mtune=pentium4 -gdwarf-4 -fno-debug-types-section -fvar-tracking-assignments -g2 -DNDEBUG -DQT_NO_DEBUG -DVERSION=\"0.6.34\" -o CMakeFiles/libsolv_static.dir/repopage.o -c /tmp/B.GcEWCU/BUILD/libsolv-0.6.34/src/repopage.c make[2]: Leaving directory '/tmp/B.GcEWCU/BUILD/libsolv-0.6.34/build' make[2]: Entering directory '/tmp/B.GcEWCU/BUILD/libsolv-0.6.34/build' [ 39%] Building C object src/CMakeFiles/libsolv_static.dir/repo.o cd /tmp/B.GcEWCU/BUILD/libsolv-0.6.34/build/src && /usr/bin/i686-pld-linux-gcc -DENABLE_APPDATA=1 -DENABLE_BZIP2_COMPRESSION=1 -DENABLE_COMPLEX_DEPS=1 -DENABLE_HELIXREPO=1 -DENABLE_LZMA_COMPRESSION=1 -DENABLE_PGPVRFY=1 -DENABLE_PUBKEY=1 -DENABLE_RPMDB=1 -DENABLE_RPMDB_BYRPMHEADER=1 -DENABLE_RPMMD=1 -DENABLE_RPMPKG=1 -DENABLE_ZLIB_COMPRESSION=1 -DHAVE_FOPENCOOKIE=1 -DHAVE_QSORT_R=1 -DHAVE_STRCHRNUL=1 -DLIBSOLV_INTERNAL=1 -DRPM5 -D_FILE_OFFSET_BITS=64 -I/usr/include/rpm -I/tmp/B.GcEWCU/BUILD/libsolv-0.6.34 -I/tmp/B.GcEWCU/BUILD/libsolv-0.6.34/src -I/tmp/B.GcEWCU/BUILD/libsolv-0.6.34/ext -I/tmp/B.GcEWCU/BUILD/libsolv-0.6.34/build -I/tmp/B.GcEWCU/BUILD/libsolv-0.6.34/build/src -Wall -fPIC -O2 -fwrapv -pipe -Wformat -Werror=format-security -gdwarf-4 -fno-debug-types-section -fvar-tracking-assignments -g2 -Wp,-D_FORTIFY_SOURCE=2 -fstack-protector-strong --param=ssp-buffer-size=4 -fomit-frame-pointer -march=i686 -fasynchronous-unwind-tables -mtune=pentium4 -gdwarf-4 -fno-debug-types-section -fvar-tracking-assignments -g2 -DNDEBUG -DQT_NO_DEBUG -DVERSION=\"0.6.34\" -o CMakeFiles/libsolv_static.dir/repo.o -c /tmp/B.GcEWCU/BUILD/libsolv-0.6.34/src/repo.c make[2]: Leaving directory '/tmp/B.GcEWCU/BUILD/libsolv-0.6.34/build' make[2]: Entering directory '/tmp/B.GcEWCU/BUILD/libsolv-0.6.34/build' [ 24%] Building C object src/CMakeFiles/libsolv.dir/rules.o cd /tmp/B.GcEWCU/BUILD/libsolv-0.6.34/build/src && /usr/bin/i686-pld-linux-gcc -DENABLE_APPDATA=1 -DENABLE_BZIP2_COMPRESSION=1 -DENABLE_COMPLEX_DEPS=1 -DENABLE_HELIXREPO=1 -DENABLE_LZMA_COMPRESSION=1 -DENABLE_PGPVRFY=1 -DENABLE_PUBKEY=1 -DENABLE_RPMDB=1 -DENABLE_RPMDB_BYRPMHEADER=1 -DENABLE_RPMMD=1 -DENABLE_RPMPKG=1 -DENABLE_ZLIB_COMPRESSION=1 -DHAVE_FOPENCOOKIE=1 -DHAVE_QSORT_R=1 -DHAVE_STRCHRNUL=1 -DLIBSOLV_INTERNAL=1 -DRPM5 -D_FILE_OFFSET_BITS=64 -Dlibsolv_EXPORTS -I/usr/include/rpm -I/tmp/B.GcEWCU/BUILD/libsolv-0.6.34 -I/tmp/B.GcEWCU/BUILD/libsolv-0.6.34/src -I/tmp/B.GcEWCU/BUILD/libsolv-0.6.34/ext -I/tmp/B.GcEWCU/BUILD/libsolv-0.6.34/build -I/tmp/B.GcEWCU/BUILD/libsolv-0.6.34/build/src -Wall -fPIC -O2 -fwrapv -pipe -Wformat -Werror=format-security -gdwarf-4 -fno-debug-types-section -fvar-tracking-assignments -g2 -Wp,-D_FORTIFY_SOURCE=2 -fstack-protector-strong --param=ssp-buffer-size=4 -fomit-frame-pointer -march=i686 -fasynchronous-unwind-tables -mtune=pentium4 -gdwarf-4 -fno-debug-types-section -fvar-tracking-assignments -g2 -DNDEBUG -DQT_NO_DEBUG -fPIC -DVERSION=\"0.6.34\" -o CMakeFiles/libsolv.dir/rules.o -c /tmp/B.GcEWCU/BUILD/libsolv-0.6.34/src/rules.c make[2]: Leaving directory '/tmp/B.GcEWCU/BUILD/libsolv-0.6.34/build' make[2]: Entering directory '/tmp/B.GcEWCU/BUILD/libsolv-0.6.34/build' [ 42%] Building C object src/CMakeFiles/libsolv_static.dir/solvable.o cd /tmp/B.GcEWCU/BUILD/libsolv-0.6.34/build/src && /usr/bin/i686-pld-linux-gcc -DENABLE_APPDATA=1 -DENABLE_BZIP2_COMPRESSION=1 -DENABLE_COMPLEX_DEPS=1 -DENABLE_HELIXREPO=1 -DENABLE_LZMA_COMPRESSION=1 -DENABLE_PGPVRFY=1 -DENABLE_PUBKEY=1 -DENABLE_RPMDB=1 -DENABLE_RPMDB_BYRPMHEADER=1 -DENABLE_RPMMD=1 -DENABLE_RPMPKG=1 -DENABLE_ZLIB_COMPRESSION=1 -DHAVE_FOPENCOOKIE=1 -DHAVE_QSORT_R=1 -DHAVE_STRCHRNUL=1 -DLIBSOLV_INTERNAL=1 -DRPM5 -D_FILE_OFFSET_BITS=64 -I/usr/include/rpm -I/tmp/B.GcEWCU/BUILD/libsolv-0.6.34 -I/tmp/B.GcEWCU/BUILD/libsolv-0.6.34/src -I/tmp/B.GcEWCU/BUILD/libsolv-0.6.34/ext -I/tmp/B.GcEWCU/BUILD/libsolv-0.6.34/build -I/tmp/B.GcEWCU/BUILD/libsolv-0.6.34/build/src -Wall -fPIC -O2 -fwrapv -pipe -Wformat -Werror=format-security -gdwarf-4 -fno-debug-types-section -fvar-tracking-assignments -g2 -Wp,-D_FORTIFY_SOURCE=2 -fstack-protector-strong --param=ssp-buffer-size=4 -fomit-frame-pointer -march=i686 -fasynchronous-unwind-tables -mtune=pentium4 -gdwarf-4 -fno-debug-types-section -fvar-tracking-assignments -g2 -DNDEBUG -DQT_NO_DEBUG -DVERSION=\"0.6.34\" -o CMakeFiles/libsolv_static.dir/solvable.o -c /tmp/B.GcEWCU/BUILD/libsolv-0.6.34/src/solvable.c make[2]: Leaving directory '/tmp/B.GcEWCU/BUILD/libsolv-0.6.34/build' make[2]: Entering directory '/tmp/B.GcEWCU/BUILD/libsolv-0.6.34/build' [ 36%] Building C object src/CMakeFiles/libsolv_static.dir/repo_write.o cd /tmp/B.GcEWCU/BUILD/libsolv-0.6.34/build/src && /usr/bin/i686-pld-linux-gcc -DENABLE_APPDATA=1 -DENABLE_BZIP2_COMPRESSION=1 -DENABLE_COMPLEX_DEPS=1 -DENABLE_HELIXREPO=1 -DENABLE_LZMA_COMPRESSION=1 -DENABLE_PGPVRFY=1 -DENABLE_PUBKEY=1 -DENABLE_RPMDB=1 -DENABLE_RPMDB_BYRPMHEADER=1 -DENABLE_RPMMD=1 -DENABLE_RPMPKG=1 -DENABLE_ZLIB_COMPRESSION=1 -DHAVE_FOPENCOOKIE=1 -DHAVE_QSORT_R=1 -DHAVE_STRCHRNUL=1 -DLIBSOLV_INTERNAL=1 -DRPM5 -D_FILE_OFFSET_BITS=64 -I/usr/include/rpm -I/tmp/B.GcEWCU/BUILD/libsolv-0.6.34 -I/tmp/B.GcEWCU/BUILD/libsolv-0.6.34/src -I/tmp/B.GcEWCU/BUILD/libsolv-0.6.34/ext -I/tmp/B.GcEWCU/BUILD/libsolv-0.6.34/build -I/tmp/B.GcEWCU/BUILD/libsolv-0.6.34/build/src -Wall -fPIC -O2 -fwrapv -pipe -Wformat -Werror=format-security -gdwarf-4 -fno-debug-types-section -fvar-tracking-assignments -g2 -Wp,-D_FORTIFY_SOURCE=2 -fstack-protector-strong --param=ssp-buffer-size=4 -fomit-frame-pointer -march=i686 -fasynchronous-unwind-tables -mtune=pentium4 -gdwarf-4 -fno-debug-types-section -fvar-tracking-assignments -g2 -DNDEBUG -DQT_NO_DEBUG -DVERSION=\"0.6.34\" -o CMakeFiles/libsolv_static.dir/repo_write.o -c /tmp/B.GcEWCU/BUILD/libsolv-0.6.34/src/repo_write.c make[2]: Leaving directory '/tmp/B.GcEWCU/BUILD/libsolv-0.6.34/build' make[2]: Entering directory '/tmp/B.GcEWCU/BUILD/libsolv-0.6.34/build' [ 46%] Building C object src/CMakeFiles/libsolv_static.dir/linkedpkg.o cd /tmp/B.GcEWCU/BUILD/libsolv-0.6.34/build/src && /usr/bin/i686-pld-linux-gcc -DENABLE_APPDATA=1 -DENABLE_BZIP2_COMPRESSION=1 -DENABLE_COMPLEX_DEPS=1 -DENABLE_HELIXREPO=1 -DENABLE_LZMA_COMPRESSION=1 -DENABLE_PGPVRFY=1 -DENABLE_PUBKEY=1 -DENABLE_RPMDB=1 -DENABLE_RPMDB_BYRPMHEADER=1 -DENABLE_RPMMD=1 -DENABLE_RPMPKG=1 -DENABLE_ZLIB_COMPRESSION=1 -DHAVE_FOPENCOOKIE=1 -DHAVE_QSORT_R=1 -DHAVE_STRCHRNUL=1 -DLIBSOLV_INTERNAL=1 -DRPM5 -D_FILE_OFFSET_BITS=64 -I/usr/include/rpm -I/tmp/B.GcEWCU/BUILD/libsolv-0.6.34 -I/tmp/B.GcEWCU/BUILD/libsolv-0.6.34/src -I/tmp/B.GcEWCU/BUILD/libsolv-0.6.34/ext -I/tmp/B.GcEWCU/BUILD/libsolv-0.6.34/build -I/tmp/B.GcEWCU/BUILD/libsolv-0.6.34/build/src -Wall -fPIC -O2 -fwrapv -pipe -Wformat -Werror=format-security -gdwarf-4 -fno-debug-types-section -fvar-tracking-assignments -g2 -Wp,-D_FORTIFY_SOURCE=2 -fstack-protector-strong --param=ssp-buffer-size=4 -fomit-frame-pointer -march=i686 -fasynchronous-unwind-tables -mtune=pentium4 -gdwarf-4 -fno-debug-types-section -fvar-tracking-assignments -g2 -DNDEBUG -DQT_NO_DEBUG -DVERSION=\"0.6.34\" -o CMakeFiles/libsolv_static.dir/linkedpkg.o -c /tmp/B.GcEWCU/BUILD/libsolv-0.6.34/src/linkedpkg.c make[2]: Leaving directory '/tmp/B.GcEWCU/BUILD/libsolv-0.6.34/build' make[2]: Entering directory '/tmp/B.GcEWCU/BUILD/libsolv-0.6.34/build' [ 45%] Linking C shared library libsolv.so cd /tmp/B.GcEWCU/BUILD/libsolv-0.6.34/build/src && /usr/bin/cmake -E cmake_link_script CMakeFiles/libsolv.dir/link.txt --verbose=1 /usr/bin/i686-pld-linux-gcc -fPIC -Wall -fPIC -O2 -fwrapv -pipe -Wformat -Werror=format-security -gdwarf-4 -fno-debug-types-section -fvar-tracking-assignments -g2 -Wp,-D_FORTIFY_SOURCE=2 -fstack-protector-strong --param=ssp-buffer-size=4 -fomit-frame-pointer -march=i686 -fasynchronous-unwind-tables -mtune=pentium4 -gdwarf-4 -fno-debug-types-section -fvar-tracking-assignments -g2 -DNDEBUG -DQT_NO_DEBUG -Wl,--version-script=/tmp/B.GcEWCU/BUILD/libsolv-0.6.34/src/libsolv.ver -Wl,--as-needed -Wl,--no-copy-dt-needed-entries -Wl,-z,relro -Wl,-z,combreloc -shared -Wl,-soname,libsolv.so.0 -o libsolv.so.0 CMakeFiles/libsolv.dir/bitmap.o CMakeFiles/libsolv.dir/poolarch.o CMakeFiles/libsolv.dir/poolvendor.o CMakeFiles/libsolv.dir/poolid.o CMakeFiles/libsolv.dir/strpool.o CMakeFiles/libsolv.dir/dirpool.o CMakeFiles/libsolv.dir/solver.o CMakeFiles/libsolv.dir/solverdebug.o CMakeFiles/libsolv.dir/repo_solv.o CMakeFiles/libsolv.dir/repo_write.o CMakeFiles/libsolv.dir/evr.o CMakeFiles/libsolv.dir/pool.o CMakeFiles/libsolv.dir/queue.o CMakeFiles/libsolv.dir/repo.o CMakeFiles/libsolv.dir/repodata.o CMakeFiles/libsolv.dir/repopage.o CMakeFiles/libsolv.dir/util.o CMakeFiles/libsolv.dir/policy.o CMakeFiles/libsolv.dir/solvable.o CMakeFiles/libsolv.dir/transaction.o CMakeFiles/libsolv.dir/order.o CMakeFiles/libsolv.dir/rules.o CMakeFiles/libsolv.dir/problems.o CMakeFiles/libsolv.dir/linkedpkg.o CMakeFiles/libsolv.dir/cplxdeps.o CMakeFiles/libsolv.dir/chksum.o CMakeFiles/libsolv.dir/md5.o CMakeFiles/libsolv.dir/sha1.o CMakeFiles/libsolv.dir/sha2.o CMakeFiles/libsolv.dir/solvversion.o CMakeFiles/libsolv.dir/selection.o CMakeFiles/libsolv.dir/fileprovides.o CMakeFiles/libsolv.dir/diskusage.o CMakeFiles/libsolv.dir/suse.o CMakeFiles/libsolv.dir/solver_util.o CMakeFiles/libsolv.dir/cleandeps.o CMakeFiles/libsolv.dir/userinstalled.o cd /tmp/B.GcEWCU/BUILD/libsolv-0.6.34/build/src && /usr/bin/cmake -E cmake_symlink_library libsolv.so.0 libsolv.so.0 libsolv.so make[2]: Leaving directory '/tmp/B.GcEWCU/BUILD/libsolv-0.6.34/build' make[1]: Entering directory '/tmp/B.GcEWCU/BUILD/libsolv-0.6.34/build' [ 47%] Built target libsolv make[1]: Leaving directory '/tmp/B.GcEWCU/BUILD/libsolv-0.6.34/build' make[2]: Entering directory '/tmp/B.GcEWCU/BUILD/libsolv-0.6.34/build' [ 37%] Building C object src/CMakeFiles/libsolv_static.dir/pool.o cd /tmp/B.GcEWCU/BUILD/libsolv-0.6.34/build/src && /usr/bin/i686-pld-linux-gcc -DENABLE_APPDATA=1 -DENABLE_BZIP2_COMPRESSION=1 -DENABLE_COMPLEX_DEPS=1 -DENABLE_HELIXREPO=1 -DENABLE_LZMA_COMPRESSION=1 -DENABLE_PGPVRFY=1 -DENABLE_PUBKEY=1 -DENABLE_RPMDB=1 -DENABLE_RPMDB_BYRPMHEADER=1 -DENABLE_RPMMD=1 -DENABLE_RPMPKG=1 -DENABLE_ZLIB_COMPRESSION=1 -DHAVE_FOPENCOOKIE=1 -DHAVE_QSORT_R=1 -DHAVE_STRCHRNUL=1 -DLIBSOLV_INTERNAL=1 -DRPM5 -D_FILE_OFFSET_BITS=64 -I/usr/include/rpm -I/tmp/B.GcEWCU/BUILD/libsolv-0.6.34 -I/tmp/B.GcEWCU/BUILD/libsolv-0.6.34/src -I/tmp/B.GcEWCU/BUILD/libsolv-0.6.34/ext -I/tmp/B.GcEWCU/BUILD/libsolv-0.6.34/build -I/tmp/B.GcEWCU/BUILD/libsolv-0.6.34/build/src -Wall -fPIC -O2 -fwrapv -pipe -Wformat -Werror=format-security -gdwarf-4 -fno-debug-types-section -fvar-tracking-assignments -g2 -Wp,-D_FORTIFY_SOURCE=2 -fstack-protector-strong --param=ssp-buffer-size=4 -fomit-frame-pointer -march=i686 -fasynchronous-unwind-tables -mtune=pentium4 -gdwarf-4 -fno-debug-types-section -fvar-tracking-assignments -g2 -DNDEBUG -DQT_NO_DEBUG -DVERSION=\"0.6.34\" -o CMakeFiles/libsolv_static.dir/pool.o -c /tmp/B.GcEWCU/BUILD/libsolv-0.6.34/src/pool.c make[2]: Leaving directory '/tmp/B.GcEWCU/BUILD/libsolv-0.6.34/build' make[2]: Entering directory '/tmp/B.GcEWCU/BUILD/libsolv-0.6.34/build' [ 48%] Building C object src/CMakeFiles/libsolv_static.dir/chksum.o cd /tmp/B.GcEWCU/BUILD/libsolv-0.6.34/build/src && /usr/bin/i686-pld-linux-gcc -DENABLE_APPDATA=1 -DENABLE_BZIP2_COMPRESSION=1 -DENABLE_COMPLEX_DEPS=1 -DENABLE_HELIXREPO=1 -DENABLE_LZMA_COMPRESSION=1 -DENABLE_PGPVRFY=1 -DENABLE_PUBKEY=1 -DENABLE_RPMDB=1 -DENABLE_RPMDB_BYRPMHEADER=1 -DENABLE_RPMMD=1 -DENABLE_RPMPKG=1 -DENABLE_ZLIB_COMPRESSION=1 -DHAVE_FOPENCOOKIE=1 -DHAVE_QSORT_R=1 -DHAVE_STRCHRNUL=1 -DLIBSOLV_INTERNAL=1 -DRPM5 -D_FILE_OFFSET_BITS=64 -I/usr/include/rpm -I/tmp/B.GcEWCU/BUILD/libsolv-0.6.34 -I/tmp/B.GcEWCU/BUILD/libsolv-0.6.34/src -I/tmp/B.GcEWCU/BUILD/libsolv-0.6.34/ext -I/tmp/B.GcEWCU/BUILD/libsolv-0.6.34/build -I/tmp/B.GcEWCU/BUILD/libsolv-0.6.34/build/src -Wall -fPIC -O2 -fwrapv -pipe -Wformat -Werror=format-security -gdwarf-4 -fno-debug-types-section -fvar-tracking-assignments -g2 -Wp,-D_FORTIFY_SOURCE=2 -fstack-protector-strong --param=ssp-buffer-size=4 -fomit-frame-pointer -march=i686 -fasynchronous-unwind-tables -mtune=pentium4 -gdwarf-4 -fno-debug-types-section -fvar-tracking-assignments -g2 -DNDEBUG -DQT_NO_DEBUG -DVERSION=\"0.6.34\" -o CMakeFiles/libsolv_static.dir/chksum.o -c /tmp/B.GcEWCU/BUILD/libsolv-0.6.34/src/chksum.c make[2]: Leaving directory '/tmp/B.GcEWCU/BUILD/libsolv-0.6.34/build' make[2]: Entering directory '/tmp/B.GcEWCU/BUILD/libsolv-0.6.34/build' [ 43%] Building C object src/CMakeFiles/libsolv_static.dir/transaction.o cd /tmp/B.GcEWCU/BUILD/libsolv-0.6.34/build/src && /usr/bin/i686-pld-linux-gcc -DENABLE_APPDATA=1 -DENABLE_BZIP2_COMPRESSION=1 -DENABLE_COMPLEX_DEPS=1 -DENABLE_HELIXREPO=1 -DENABLE_LZMA_COMPRESSION=1 -DENABLE_PGPVRFY=1 -DENABLE_PUBKEY=1 -DENABLE_RPMDB=1 -DENABLE_RPMDB_BYRPMHEADER=1 -DENABLE_RPMMD=1 -DENABLE_RPMPKG=1 -DENABLE_ZLIB_COMPRESSION=1 -DHAVE_FOPENCOOKIE=1 -DHAVE_QSORT_R=1 -DHAVE_STRCHRNUL=1 -DLIBSOLV_INTERNAL=1 -DRPM5 -D_FILE_OFFSET_BITS=64 -I/usr/include/rpm -I/tmp/B.GcEWCU/BUILD/libsolv-0.6.34 -I/tmp/B.GcEWCU/BUILD/libsolv-0.6.34/src -I/tmp/B.GcEWCU/BUILD/libsolv-0.6.34/ext -I/tmp/B.GcEWCU/BUILD/libsolv-0.6.34/build -I/tmp/B.GcEWCU/BUILD/libsolv-0.6.34/build/src -Wall -fPIC -O2 -fwrapv -pipe -Wformat -Werror=format-security -gdwarf-4 -fno-debug-types-section -fvar-tracking-assignments -g2 -Wp,-D_FORTIFY_SOURCE=2 -fstack-protector-strong --param=ssp-buffer-size=4 -fomit-frame-pointer -march=i686 -fasynchronous-unwind-tables -mtune=pentium4 -gdwarf-4 -fno-debug-types-section -fvar-tracking-assignments -g2 -DNDEBUG -DQT_NO_DEBUG -DVERSION=\"0.6.34\" -o CMakeFiles/libsolv_static.dir/transaction.o -c /tmp/B.GcEWCU/BUILD/libsolv-0.6.34/src/transaction.c make[2]: Leaving directory '/tmp/B.GcEWCU/BUILD/libsolv-0.6.34/build' make[2]: Entering directory '/tmp/B.GcEWCU/BUILD/libsolv-0.6.34/build' [ 48%] Building C object src/CMakeFiles/libsolv_static.dir/md5.o cd /tmp/B.GcEWCU/BUILD/libsolv-0.6.34/build/src && /usr/bin/i686-pld-linux-gcc -DENABLE_APPDATA=1 -DENABLE_BZIP2_COMPRESSION=1 -DENABLE_COMPLEX_DEPS=1 -DENABLE_HELIXREPO=1 -DENABLE_LZMA_COMPRESSION=1 -DENABLE_PGPVRFY=1 -DENABLE_PUBKEY=1 -DENABLE_RPMDB=1 -DENABLE_RPMDB_BYRPMHEADER=1 -DENABLE_RPMMD=1 -DENABLE_RPMPKG=1 -DENABLE_ZLIB_COMPRESSION=1 -DHAVE_FOPENCOOKIE=1 -DHAVE_QSORT_R=1 -DHAVE_STRCHRNUL=1 -DLIBSOLV_INTERNAL=1 -DRPM5 -D_FILE_OFFSET_BITS=64 -I/usr/include/rpm -I/tmp/B.GcEWCU/BUILD/libsolv-0.6.34 -I/tmp/B.GcEWCU/BUILD/libsolv-0.6.34/src -I/tmp/B.GcEWCU/BUILD/libsolv-0.6.34/ext -I/tmp/B.GcEWCU/BUILD/libsolv-0.6.34/build -I/tmp/B.GcEWCU/BUILD/libsolv-0.6.34/build/src -Wall -fPIC -O2 -fwrapv -pipe -Wformat -Werror=format-security -gdwarf-4 -fno-debug-types-section -fvar-tracking-assignments -g2 -Wp,-D_FORTIFY_SOURCE=2 -fstack-protector-strong --param=ssp-buffer-size=4 -fomit-frame-pointer -march=i686 -fasynchronous-unwind-tables -mtune=pentium4 -gdwarf-4 -fno-debug-types-section -fvar-tracking-assignments -g2 -DNDEBUG -DQT_NO_DEBUG -DVERSION=\"0.6.34\" -o CMakeFiles/libsolv_static.dir/md5.o -c /tmp/B.GcEWCU/BUILD/libsolv-0.6.34/src/md5.c make[2]: Leaving directory '/tmp/B.GcEWCU/BUILD/libsolv-0.6.34/build' make[2]: Entering directory '/tmp/B.GcEWCU/BUILD/libsolv-0.6.34/build' [ 47%] Building C object src/CMakeFiles/libsolv_static.dir/cplxdeps.o cd /tmp/B.GcEWCU/BUILD/libsolv-0.6.34/build/src && /usr/bin/i686-pld-linux-gcc -DENABLE_APPDATA=1 -DENABLE_BZIP2_COMPRESSION=1 -DENABLE_COMPLEX_DEPS=1 -DENABLE_HELIXREPO=1 -DENABLE_LZMA_COMPRESSION=1 -DENABLE_PGPVRFY=1 -DENABLE_PUBKEY=1 -DENABLE_RPMDB=1 -DENABLE_RPMDB_BYRPMHEADER=1 -DENABLE_RPMMD=1 -DENABLE_RPMPKG=1 -DENABLE_ZLIB_COMPRESSION=1 -DHAVE_FOPENCOOKIE=1 -DHAVE_QSORT_R=1 -DHAVE_STRCHRNUL=1 -DLIBSOLV_INTERNAL=1 -DRPM5 -D_FILE_OFFSET_BITS=64 -I/usr/include/rpm -I/tmp/B.GcEWCU/BUILD/libsolv-0.6.34 -I/tmp/B.GcEWCU/BUILD/libsolv-0.6.34/src -I/tmp/B.GcEWCU/BUILD/libsolv-0.6.34/ext -I/tmp/B.GcEWCU/BUILD/libsolv-0.6.34/build -I/tmp/B.GcEWCU/BUILD/libsolv-0.6.34/build/src -Wall -fPIC -O2 -fwrapv -pipe -Wformat -Werror=format-security -gdwarf-4 -fno-debug-types-section -fvar-tracking-assignments -g2 -Wp,-D_FORTIFY_SOURCE=2 -fstack-protector-strong --param=ssp-buffer-size=4 -fomit-frame-pointer -march=i686 -fasynchronous-unwind-tables -mtune=pentium4 -gdwarf-4 -fno-debug-types-section -fvar-tracking-assignments -g2 -DNDEBUG -DQT_NO_DEBUG -DVERSION=\"0.6.34\" -o CMakeFiles/libsolv_static.dir/cplxdeps.o -c /tmp/B.GcEWCU/BUILD/libsolv-0.6.34/src/cplxdeps.c make[2]: Leaving directory '/tmp/B.GcEWCU/BUILD/libsolv-0.6.34/build' make[2]: Entering directory '/tmp/B.GcEWCU/BUILD/libsolv-0.6.34/build' [ 50%] Building C object src/CMakeFiles/libsolv_static.dir/solvversion.o cd /tmp/B.GcEWCU/BUILD/libsolv-0.6.34/build/src && /usr/bin/i686-pld-linux-gcc -DENABLE_APPDATA=1 -DENABLE_BZIP2_COMPRESSION=1 -DENABLE_COMPLEX_DEPS=1 -DENABLE_HELIXREPO=1 -DENABLE_LZMA_COMPRESSION=1 -DENABLE_PGPVRFY=1 -DENABLE_PUBKEY=1 -DENABLE_RPMDB=1 -DENABLE_RPMDB_BYRPMHEADER=1 -DENABLE_RPMMD=1 -DENABLE_RPMPKG=1 -DENABLE_ZLIB_COMPRESSION=1 -DHAVE_FOPENCOOKIE=1 -DHAVE_QSORT_R=1 -DHAVE_STRCHRNUL=1 -DLIBSOLV_INTERNAL=1 -DRPM5 -D_FILE_OFFSET_BITS=64 -I/usr/include/rpm -I/tmp/B.GcEWCU/BUILD/libsolv-0.6.34 -I/tmp/B.GcEWCU/BUILD/libsolv-0.6.34/src -I/tmp/B.GcEWCU/BUILD/libsolv-0.6.34/ext -I/tmp/B.GcEWCU/BUILD/libsolv-0.6.34/build -I/tmp/B.GcEWCU/BUILD/libsolv-0.6.34/build/src -Wall -fPIC -O2 -fwrapv -pipe -Wformat -Werror=format-security -gdwarf-4 -fno-debug-types-section -fvar-tracking-assignments -g2 -Wp,-D_FORTIFY_SOURCE=2 -fstack-protector-strong --param=ssp-buffer-size=4 -fomit-frame-pointer -march=i686 -fasynchronous-unwind-tables -mtune=pentium4 -gdwarf-4 -fno-debug-types-section -fvar-tracking-assignments -g2 -DNDEBUG -DQT_NO_DEBUG -DVERSION=\"0.6.34\" -o CMakeFiles/libsolv_static.dir/solvversion.o -c /tmp/B.GcEWCU/BUILD/libsolv-0.6.34/src/solvversion.c make[2]: Leaving directory '/tmp/B.GcEWCU/BUILD/libsolv-0.6.34/build' make[2]: Entering directory '/tmp/B.GcEWCU/BUILD/libsolv-0.6.34/build' [ 49%] Building C object src/CMakeFiles/libsolv_static.dir/sha1.o cd /tmp/B.GcEWCU/BUILD/libsolv-0.6.34/build/src && /usr/bin/i686-pld-linux-gcc -DENABLE_APPDATA=1 -DENABLE_BZIP2_COMPRESSION=1 -DENABLE_COMPLEX_DEPS=1 -DENABLE_HELIXREPO=1 -DENABLE_LZMA_COMPRESSION=1 -DENABLE_PGPVRFY=1 -DENABLE_PUBKEY=1 -DENABLE_RPMDB=1 -DENABLE_RPMDB_BYRPMHEADER=1 -DENABLE_RPMMD=1 -DENABLE_RPMPKG=1 -DENABLE_ZLIB_COMPRESSION=1 -DHAVE_FOPENCOOKIE=1 -DHAVE_QSORT_R=1 -DHAVE_STRCHRNUL=1 -DLIBSOLV_INTERNAL=1 -DRPM5 -D_FILE_OFFSET_BITS=64 -I/usr/include/rpm -I/tmp/B.GcEWCU/BUILD/libsolv-0.6.34 -I/tmp/B.GcEWCU/BUILD/libsolv-0.6.34/src -I/tmp/B.GcEWCU/BUILD/libsolv-0.6.34/ext -I/tmp/B.GcEWCU/BUILD/libsolv-0.6.34/build -I/tmp/B.GcEWCU/BUILD/libsolv-0.6.34/build/src -Wall -fPIC -O2 -fwrapv -pipe -Wformat -Werror=format-security -gdwarf-4 -fno-debug-types-section -fvar-tracking-assignments -g2 -Wp,-D_FORTIFY_SOURCE=2 -fstack-protector-strong --param=ssp-buffer-size=4 -fomit-frame-pointer -march=i686 -fasynchronous-unwind-tables -mtune=pentium4 -gdwarf-4 -fno-debug-types-section -fvar-tracking-assignments -g2 -DNDEBUG -DQT_NO_DEBUG -DVERSION=\"0.6.34\" -o CMakeFiles/libsolv_static.dir/sha1.o -c /tmp/B.GcEWCU/BUILD/libsolv-0.6.34/src/sha1.c make[2]: Leaving directory '/tmp/B.GcEWCU/BUILD/libsolv-0.6.34/build' make[2]: Entering directory '/tmp/B.GcEWCU/BUILD/libsolv-0.6.34/build' [ 52%] Building C object src/CMakeFiles/libsolv_static.dir/fileprovides.o cd /tmp/B.GcEWCU/BUILD/libsolv-0.6.34/build/src && /usr/bin/i686-pld-linux-gcc -DENABLE_APPDATA=1 -DENABLE_BZIP2_COMPRESSION=1 -DENABLE_COMPLEX_DEPS=1 -DENABLE_HELIXREPO=1 -DENABLE_LZMA_COMPRESSION=1 -DENABLE_PGPVRFY=1 -DENABLE_PUBKEY=1 -DENABLE_RPMDB=1 -DENABLE_RPMDB_BYRPMHEADER=1 -DENABLE_RPMMD=1 -DENABLE_RPMPKG=1 -DENABLE_ZLIB_COMPRESSION=1 -DHAVE_FOPENCOOKIE=1 -DHAVE_QSORT_R=1 -DHAVE_STRCHRNUL=1 -DLIBSOLV_INTERNAL=1 -DRPM5 -D_FILE_OFFSET_BITS=64 -I/usr/include/rpm -I/tmp/B.GcEWCU/BUILD/libsolv-0.6.34 -I/tmp/B.GcEWCU/BUILD/libsolv-0.6.34/src -I/tmp/B.GcEWCU/BUILD/libsolv-0.6.34/ext -I/tmp/B.GcEWCU/BUILD/libsolv-0.6.34/build -I/tmp/B.GcEWCU/BUILD/libsolv-0.6.34/build/src -Wall -fPIC -O2 -fwrapv -pipe -Wformat -Werror=format-security -gdwarf-4 -fno-debug-types-section -fvar-tracking-assignments -g2 -Wp,-D_FORTIFY_SOURCE=2 -fstack-protector-strong --param=ssp-buffer-size=4 -fomit-frame-pointer -march=i686 -fasynchronous-unwind-tables -mtune=pentium4 -gdwarf-4 -fno-debug-types-section -fvar-tracking-assignments -g2 -DNDEBUG -DQT_NO_DEBUG -DVERSION=\"0.6.34\" -o CMakeFiles/libsolv_static.dir/fileprovides.o -c /tmp/B.GcEWCU/BUILD/libsolv-0.6.34/src/fileprovides.c make[2]: Leaving directory '/tmp/B.GcEWCU/BUILD/libsolv-0.6.34/build' make[2]: Entering directory '/tmp/B.GcEWCU/BUILD/libsolv-0.6.34/build' [ 42%] Building C object src/CMakeFiles/libsolv_static.dir/policy.o cd /tmp/B.GcEWCU/BUILD/libsolv-0.6.34/build/src && /usr/bin/i686-pld-linux-gcc -DENABLE_APPDATA=1 -DENABLE_BZIP2_COMPRESSION=1 -DENABLE_COMPLEX_DEPS=1 -DENABLE_HELIXREPO=1 -DENABLE_LZMA_COMPRESSION=1 -DENABLE_PGPVRFY=1 -DENABLE_PUBKEY=1 -DENABLE_RPMDB=1 -DENABLE_RPMDB_BYRPMHEADER=1 -DENABLE_RPMMD=1 -DENABLE_RPMPKG=1 -DENABLE_ZLIB_COMPRESSION=1 -DHAVE_FOPENCOOKIE=1 -DHAVE_QSORT_R=1 -DHAVE_STRCHRNUL=1 -DLIBSOLV_INTERNAL=1 -DRPM5 -D_FILE_OFFSET_BITS=64 -I/usr/include/rpm -I/tmp/B.GcEWCU/BUILD/libsolv-0.6.34 -I/tmp/B.GcEWCU/BUILD/libsolv-0.6.34/src -I/tmp/B.GcEWCU/BUILD/libsolv-0.6.34/ext -I/tmp/B.GcEWCU/BUILD/libsolv-0.6.34/build -I/tmp/B.GcEWCU/BUILD/libsolv-0.6.34/build/src -Wall -fPIC -O2 -fwrapv -pipe -Wformat -Werror=format-security -gdwarf-4 -fno-debug-types-section -fvar-tracking-assignments -g2 -Wp,-D_FORTIFY_SOURCE=2 -fstack-protector-strong --param=ssp-buffer-size=4 -fomit-frame-pointer -march=i686 -fasynchronous-unwind-tables -mtune=pentium4 -gdwarf-4 -fno-debug-types-section -fvar-tracking-assignments -g2 -DNDEBUG -DQT_NO_DEBUG -DVERSION=\"0.6.34\" -o CMakeFiles/libsolv_static.dir/policy.o -c /tmp/B.GcEWCU/BUILD/libsolv-0.6.34/src/policy.c In file included from /usr/include/string.h:494, from /tmp/B.GcEWCU/BUILD/libsolv-0.6.34/src/policy.c:16: In function 'memcpy', inlined from 'urpm_reorder.isra.17' at /tmp/B.GcEWCU/BUILD/libsolv-0.6.34/src/policy.c:1241:9: /usr/include/bits/string_fortified.h:34:10: warning: '__builtin_memcpy' forming offset 8 is out of the bounds [0, 7] [-Warray-bounds] return __builtin___memcpy_chk (__dest, __src, __len, __bos0 (__dest)); ^~~~~~~~~~~~~~~~~~~~~~~~~~~~~~~~~~~~~~~~~~~~~~~~~~~~~~~~~~~~~~ make[2]: Leaving directory '/tmp/B.GcEWCU/BUILD/libsolv-0.6.34/build' make[2]: Entering directory '/tmp/B.GcEWCU/BUILD/libsolv-0.6.34/build' [ 46%] Building C object src/CMakeFiles/libsolv_static.dir/problems.o cd /tmp/B.GcEWCU/BUILD/libsolv-0.6.34/build/src && /usr/bin/i686-pld-linux-gcc -DENABLE_APPDATA=1 -DENABLE_BZIP2_COMPRESSION=1 -DENABLE_COMPLEX_DEPS=1 -DENABLE_HELIXREPO=1 -DENABLE_LZMA_COMPRESSION=1 -DENABLE_PGPVRFY=1 -DENABLE_PUBKEY=1 -DENABLE_RPMDB=1 -DENABLE_RPMDB_BYRPMHEADER=1 -DENABLE_RPMMD=1 -DENABLE_RPMPKG=1 -DENABLE_ZLIB_COMPRESSION=1 -DHAVE_FOPENCOOKIE=1 -DHAVE_QSORT_R=1 -DHAVE_STRCHRNUL=1 -DLIBSOLV_INTERNAL=1 -DRPM5 -D_FILE_OFFSET_BITS=64 -I/usr/include/rpm -I/tmp/B.GcEWCU/BUILD/libsolv-0.6.34 -I/tmp/B.GcEWCU/BUILD/libsolv-0.6.34/src -I/tmp/B.GcEWCU/BUILD/libsolv-0.6.34/ext -I/tmp/B.GcEWCU/BUILD/libsolv-0.6.34/build -I/tmp/B.GcEWCU/BUILD/libsolv-0.6.34/build/src -Wall -fPIC -O2 -fwrapv -pipe -Wformat -Werror=format-security -gdwarf-4 -fno-debug-types-section -fvar-tracking-assignments -g2 -Wp,-D_FORTIFY_SOURCE=2 -fstack-protector-strong --param=ssp-buffer-size=4 -fomit-frame-pointer -march=i686 -fasynchronous-unwind-tables -mtune=pentium4 -gdwarf-4 -fno-debug-types-section -fvar-tracking-assignments -g2 -DNDEBUG -DQT_NO_DEBUG -DVERSION=\"0.6.34\" -o CMakeFiles/libsolv_static.dir/problems.o -c /tmp/B.GcEWCU/BUILD/libsolv-0.6.34/src/problems.c make[2]: Leaving directory '/tmp/B.GcEWCU/BUILD/libsolv-0.6.34/build' make[2]: Entering directory '/tmp/B.GcEWCU/BUILD/libsolv-0.6.34/build' [ 43%] Building C object src/CMakeFiles/libsolv_static.dir/order.o cd /tmp/B.GcEWCU/BUILD/libsolv-0.6.34/build/src && /usr/bin/i686-pld-linux-gcc -DENABLE_APPDATA=1 -DENABLE_BZIP2_COMPRESSION=1 -DENABLE_COMPLEX_DEPS=1 -DENABLE_HELIXREPO=1 -DENABLE_LZMA_COMPRESSION=1 -DENABLE_PGPVRFY=1 -DENABLE_PUBKEY=1 -DENABLE_RPMDB=1 -DENABLE_RPMDB_BYRPMHEADER=1 -DENABLE_RPMMD=1 -DENABLE_RPMPKG=1 -DENABLE_ZLIB_COMPRESSION=1 -DHAVE_FOPENCOOKIE=1 -DHAVE_QSORT_R=1 -DHAVE_STRCHRNUL=1 -DLIBSOLV_INTERNAL=1 -DRPM5 -D_FILE_OFFSET_BITS=64 -I/usr/include/rpm -I/tmp/B.GcEWCU/BUILD/libsolv-0.6.34 -I/tmp/B.GcEWCU/BUILD/libsolv-0.6.34/src -I/tmp/B.GcEWCU/BUILD/libsolv-0.6.34/ext -I/tmp/B.GcEWCU/BUILD/libsolv-0.6.34/build -I/tmp/B.GcEWCU/BUILD/libsolv-0.6.34/build/src -Wall -fPIC -O2 -fwrapv -pipe -Wformat -Werror=format-security -gdwarf-4 -fno-debug-types-section -fvar-tracking-assignments -g2 -Wp,-D_FORTIFY_SOURCE=2 -fstack-protector-strong --param=ssp-buffer-size=4 -fomit-frame-pointer -march=i686 -fasynchronous-unwind-tables -mtune=pentium4 -gdwarf-4 -fno-debug-types-section -fvar-tracking-assignments -g2 -DNDEBUG -DQT_NO_DEBUG -DVERSION=\"0.6.34\" -o CMakeFiles/libsolv_static.dir/order.o -c /tmp/B.GcEWCU/BUILD/libsolv-0.6.34/src/order.c /tmp/B.GcEWCU/BUILD/libsolv-0.6.34/src/order.c: In function 'transaction_order': /tmp/B.GcEWCU/BUILD/libsolv-0.6.34/src/order.c:787:7: warning: variable 'oldcount' set but not used [-Wunused-but-set-variable] int oldcount; ^~~~~~~~ make[2]: Leaving directory '/tmp/B.GcEWCU/BUILD/libsolv-0.6.34/build' make[2]: Entering directory '/tmp/B.GcEWCU/BUILD/libsolv-0.6.34/build' [ 52%] Building C object src/CMakeFiles/libsolv_static.dir/diskusage.o cd /tmp/B.GcEWCU/BUILD/libsolv-0.6.34/build/src && /usr/bin/i686-pld-linux-gcc -DENABLE_APPDATA=1 -DENABLE_BZIP2_COMPRESSION=1 -DENABLE_COMPLEX_DEPS=1 -DENABLE_HELIXREPO=1 -DENABLE_LZMA_COMPRESSION=1 -DENABLE_PGPVRFY=1 -DENABLE_PUBKEY=1 -DENABLE_RPMDB=1 -DENABLE_RPMDB_BYRPMHEADER=1 -DENABLE_RPMMD=1 -DENABLE_RPMPKG=1 -DENABLE_ZLIB_COMPRESSION=1 -DHAVE_FOPENCOOKIE=1 -DHAVE_QSORT_R=1 -DHAVE_STRCHRNUL=1 -DLIBSOLV_INTERNAL=1 -DRPM5 -D_FILE_OFFSET_BITS=64 -I/usr/include/rpm -I/tmp/B.GcEWCU/BUILD/libsolv-0.6.34 -I/tmp/B.GcEWCU/BUILD/libsolv-0.6.34/src -I/tmp/B.GcEWCU/BUILD/libsolv-0.6.34/ext -I/tmp/B.GcEWCU/BUILD/libsolv-0.6.34/build -I/tmp/B.GcEWCU/BUILD/libsolv-0.6.34/build/src -Wall -fPIC -O2 -fwrapv -pipe -Wformat -Werror=format-security -gdwarf-4 -fno-debug-types-section -fvar-tracking-assignments -g2 -Wp,-D_FORTIFY_SOURCE=2 -fstack-protector-strong --param=ssp-buffer-size=4 -fomit-frame-pointer -march=i686 -fasynchronous-unwind-tables -mtune=pentium4 -gdwarf-4 -fno-debug-types-section -fvar-tracking-assignments -g2 -DNDEBUG -DQT_NO_DEBUG -DVERSION=\"0.6.34\" -o CMakeFiles/libsolv_static.dir/diskusage.o -c /tmp/B.GcEWCU/BUILD/libsolv-0.6.34/src/diskusage.c make[2]: Leaving directory '/tmp/B.GcEWCU/BUILD/libsolv-0.6.34/build' make[2]: Entering directory '/tmp/B.GcEWCU/BUILD/libsolv-0.6.34/build' [ 50%] Building C object src/CMakeFiles/libsolv_static.dir/sha2.o cd /tmp/B.GcEWCU/BUILD/libsolv-0.6.34/build/src && /usr/bin/i686-pld-linux-gcc -DENABLE_APPDATA=1 -DENABLE_BZIP2_COMPRESSION=1 -DENABLE_COMPLEX_DEPS=1 -DENABLE_HELIXREPO=1 -DENABLE_LZMA_COMPRESSION=1 -DENABLE_PGPVRFY=1 -DENABLE_PUBKEY=1 -DENABLE_RPMDB=1 -DENABLE_RPMDB_BYRPMHEADER=1 -DENABLE_RPMMD=1 -DENABLE_RPMPKG=1 -DENABLE_ZLIB_COMPRESSION=1 -DHAVE_FOPENCOOKIE=1 -DHAVE_QSORT_R=1 -DHAVE_STRCHRNUL=1 -DLIBSOLV_INTERNAL=1 -DRPM5 -D_FILE_OFFSET_BITS=64 -I/usr/include/rpm -I/tmp/B.GcEWCU/BUILD/libsolv-0.6.34 -I/tmp/B.GcEWCU/BUILD/libsolv-0.6.34/src -I/tmp/B.GcEWCU/BUILD/libsolv-0.6.34/ext -I/tmp/B.GcEWCU/BUILD/libsolv-0.6.34/build -I/tmp/B.GcEWCU/BUILD/libsolv-0.6.34/build/src -Wall -fPIC -O2 -fwrapv -pipe -Wformat -Werror=format-security -gdwarf-4 -fno-debug-types-section -fvar-tracking-assignments -g2 -Wp,-D_FORTIFY_SOURCE=2 -fstack-protector-strong --param=ssp-buffer-size=4 -fomit-frame-pointer -march=i686 -fasynchronous-unwind-tables -mtune=pentium4 -gdwarf-4 -fno-debug-types-section -fvar-tracking-assignments -g2 -DNDEBUG -DQT_NO_DEBUG -DVERSION=\"0.6.34\" -o CMakeFiles/libsolv_static.dir/sha2.o -c /tmp/B.GcEWCU/BUILD/libsolv-0.6.34/src/sha2.c make[2]: Leaving directory '/tmp/B.GcEWCU/BUILD/libsolv-0.6.34/build' make[2]: Entering directory '/tmp/B.GcEWCU/BUILD/libsolv-0.6.34/build' [ 53%] Building C object src/CMakeFiles/libsolv_static.dir/suse.o cd /tmp/B.GcEWCU/BUILD/libsolv-0.6.34/build/src && /usr/bin/i686-pld-linux-gcc -DENABLE_APPDATA=1 -DENABLE_BZIP2_COMPRESSION=1 -DENABLE_COMPLEX_DEPS=1 -DENABLE_HELIXREPO=1 -DENABLE_LZMA_COMPRESSION=1 -DENABLE_PGPVRFY=1 -DENABLE_PUBKEY=1 -DENABLE_RPMDB=1 -DENABLE_RPMDB_BYRPMHEADER=1 -DENABLE_RPMMD=1 -DENABLE_RPMPKG=1 -DENABLE_ZLIB_COMPRESSION=1 -DHAVE_FOPENCOOKIE=1 -DHAVE_QSORT_R=1 -DHAVE_STRCHRNUL=1 -DLIBSOLV_INTERNAL=1 -DRPM5 -D_FILE_OFFSET_BITS=64 -I/usr/include/rpm -I/tmp/B.GcEWCU/BUILD/libsolv-0.6.34 -I/tmp/B.GcEWCU/BUILD/libsolv-0.6.34/src -I/tmp/B.GcEWCU/BUILD/libsolv-0.6.34/ext -I/tmp/B.GcEWCU/BUILD/libsolv-0.6.34/build -I/tmp/B.GcEWCU/BUILD/libsolv-0.6.34/build/src -Wall -fPIC -O2 -fwrapv -pipe -Wformat -Werror=format-security -gdwarf-4 -fno-debug-types-section -fvar-tracking-assignments -g2 -Wp,-D_FORTIFY_SOURCE=2 -fstack-protector-strong --param=ssp-buffer-size=4 -fomit-frame-pointer -march=i686 -fasynchronous-unwind-tables -mtune=pentium4 -gdwarf-4 -fno-debug-types-section -fvar-tracking-assignments -g2 -DNDEBUG -DQT_NO_DEBUG -DVERSION=\"0.6.34\" -o CMakeFiles/libsolv_static.dir/suse.o -c /tmp/B.GcEWCU/BUILD/libsolv-0.6.34/src/suse.c make[2]: Leaving directory '/tmp/B.GcEWCU/BUILD/libsolv-0.6.34/build' make[2]: Entering directory '/tmp/B.GcEWCU/BUILD/libsolv-0.6.34/build' [ 54%] Building C object src/CMakeFiles/libsolv_static.dir/solver_util.o cd /tmp/B.GcEWCU/BUILD/libsolv-0.6.34/build/src && /usr/bin/i686-pld-linux-gcc -DENABLE_APPDATA=1 -DENABLE_BZIP2_COMPRESSION=1 -DENABLE_COMPLEX_DEPS=1 -DENABLE_HELIXREPO=1 -DENABLE_LZMA_COMPRESSION=1 -DENABLE_PGPVRFY=1 -DENABLE_PUBKEY=1 -DENABLE_RPMDB=1 -DENABLE_RPMDB_BYRPMHEADER=1 -DENABLE_RPMMD=1 -DENABLE_RPMPKG=1 -DENABLE_ZLIB_COMPRESSION=1 -DHAVE_FOPENCOOKIE=1 -DHAVE_QSORT_R=1 -DHAVE_STRCHRNUL=1 -DLIBSOLV_INTERNAL=1 -DRPM5 -D_FILE_OFFSET_BITS=64 -I/usr/include/rpm -I/tmp/B.GcEWCU/BUILD/libsolv-0.6.34 -I/tmp/B.GcEWCU/BUILD/libsolv-0.6.34/src -I/tmp/B.GcEWCU/BUILD/libsolv-0.6.34/ext -I/tmp/B.GcEWCU/BUILD/libsolv-0.6.34/build -I/tmp/B.GcEWCU/BUILD/libsolv-0.6.34/build/src -Wall -fPIC -O2 -fwrapv -pipe -Wformat -Werror=format-security -gdwarf-4 -fno-debug-types-section -fvar-tracking-assignments -g2 -Wp,-D_FORTIFY_SOURCE=2 -fstack-protector-strong --param=ssp-buffer-size=4 -fomit-frame-pointer -march=i686 -fasynchronous-unwind-tables -mtune=pentium4 -gdwarf-4 -fno-debug-types-section -fvar-tracking-assignments -g2 -DNDEBUG -DQT_NO_DEBUG -DVERSION=\"0.6.34\" -o CMakeFiles/libsolv_static.dir/solver_util.o -c /tmp/B.GcEWCU/BUILD/libsolv-0.6.34/src/solver_util.c make[2]: Leaving directory '/tmp/B.GcEWCU/BUILD/libsolv-0.6.34/build' make[2]: Entering directory '/tmp/B.GcEWCU/BUILD/libsolv-0.6.34/build' [ 55%] Building C object src/CMakeFiles/libsolv_static.dir/userinstalled.o cd /tmp/B.GcEWCU/BUILD/libsolv-0.6.34/build/src && /usr/bin/i686-pld-linux-gcc -DENABLE_APPDATA=1 -DENABLE_BZIP2_COMPRESSION=1 -DENABLE_COMPLEX_DEPS=1 -DENABLE_HELIXREPO=1 -DENABLE_LZMA_COMPRESSION=1 -DENABLE_PGPVRFY=1 -DENABLE_PUBKEY=1 -DENABLE_RPMDB=1 -DENABLE_RPMDB_BYRPMHEADER=1 -DENABLE_RPMMD=1 -DENABLE_RPMPKG=1 -DENABLE_ZLIB_COMPRESSION=1 -DHAVE_FOPENCOOKIE=1 -DHAVE_QSORT_R=1 -DHAVE_STRCHRNUL=1 -DLIBSOLV_INTERNAL=1 -DRPM5 -D_FILE_OFFSET_BITS=64 -I/usr/include/rpm -I/tmp/B.GcEWCU/BUILD/libsolv-0.6.34 -I/tmp/B.GcEWCU/BUILD/libsolv-0.6.34/src -I/tmp/B.GcEWCU/BUILD/libsolv-0.6.34/ext -I/tmp/B.GcEWCU/BUILD/libsolv-0.6.34/build -I/tmp/B.GcEWCU/BUILD/libsolv-0.6.34/build/src -Wall -fPIC -O2 -fwrapv -pipe -Wformat -Werror=format-security -gdwarf-4 -fno-debug-types-section -fvar-tracking-assignments -g2 -Wp,-D_FORTIFY_SOURCE=2 -fstack-protector-strong --param=ssp-buffer-size=4 -fomit-frame-pointer -march=i686 -fasynchronous-unwind-tables -mtune=pentium4 -gdwarf-4 -fno-debug-types-section -fvar-tracking-assignments -g2 -DNDEBUG -DQT_NO_DEBUG -DVERSION=\"0.6.34\" -o CMakeFiles/libsolv_static.dir/userinstalled.o -c /tmp/B.GcEWCU/BUILD/libsolv-0.6.34/src/userinstalled.c make[2]: Leaving directory '/tmp/B.GcEWCU/BUILD/libsolv-0.6.34/build' make[2]: Entering directory '/tmp/B.GcEWCU/BUILD/libsolv-0.6.34/build' [ 39%] Building C object src/CMakeFiles/libsolv_static.dir/repodata.o cd /tmp/B.GcEWCU/BUILD/libsolv-0.6.34/build/src && /usr/bin/i686-pld-linux-gcc -DENABLE_APPDATA=1 -DENABLE_BZIP2_COMPRESSION=1 -DENABLE_COMPLEX_DEPS=1 -DENABLE_HELIXREPO=1 -DENABLE_LZMA_COMPRESSION=1 -DENABLE_PGPVRFY=1 -DENABLE_PUBKEY=1 -DENABLE_RPMDB=1 -DENABLE_RPMDB_BYRPMHEADER=1 -DENABLE_RPMMD=1 -DENABLE_RPMPKG=1 -DENABLE_ZLIB_COMPRESSION=1 -DHAVE_FOPENCOOKIE=1 -DHAVE_QSORT_R=1 -DHAVE_STRCHRNUL=1 -DLIBSOLV_INTERNAL=1 -DRPM5 -D_FILE_OFFSET_BITS=64 -I/usr/include/rpm -I/tmp/B.GcEWCU/BUILD/libsolv-0.6.34 -I/tmp/B.GcEWCU/BUILD/libsolv-0.6.34/src -I/tmp/B.GcEWCU/BUILD/libsolv-0.6.34/ext -I/tmp/B.GcEWCU/BUILD/libsolv-0.6.34/build -I/tmp/B.GcEWCU/BUILD/libsolv-0.6.34/build/src -Wall -fPIC -O2 -fwrapv -pipe -Wformat -Werror=format-security -gdwarf-4 -fno-debug-types-section -fvar-tracking-assignments -g2 -Wp,-D_FORTIFY_SOURCE=2 -fstack-protector-strong --param=ssp-buffer-size=4 -fomit-frame-pointer -march=i686 -fasynchronous-unwind-tables -mtune=pentium4 -gdwarf-4 -fno-debug-types-section -fvar-tracking-assignments -g2 -DNDEBUG -DQT_NO_DEBUG -DVERSION=\"0.6.34\" -o CMakeFiles/libsolv_static.dir/repodata.o -c /tmp/B.GcEWCU/BUILD/libsolv-0.6.34/src/repodata.c make[2]: Leaving directory '/tmp/B.GcEWCU/BUILD/libsolv-0.6.34/build' make[2]: Entering directory '/tmp/B.GcEWCU/BUILD/libsolv-0.6.34/build' [ 51%] Building C object src/CMakeFiles/libsolv_static.dir/selection.o cd /tmp/B.GcEWCU/BUILD/libsolv-0.6.34/build/src && /usr/bin/i686-pld-linux-gcc -DENABLE_APPDATA=1 -DENABLE_BZIP2_COMPRESSION=1 -DENABLE_COMPLEX_DEPS=1 -DENABLE_HELIXREPO=1 -DENABLE_LZMA_COMPRESSION=1 -DENABLE_PGPVRFY=1 -DENABLE_PUBKEY=1 -DENABLE_RPMDB=1 -DENABLE_RPMDB_BYRPMHEADER=1 -DENABLE_RPMMD=1 -DENABLE_RPMPKG=1 -DENABLE_ZLIB_COMPRESSION=1 -DHAVE_FOPENCOOKIE=1 -DHAVE_QSORT_R=1 -DHAVE_STRCHRNUL=1 -DLIBSOLV_INTERNAL=1 -DRPM5 -D_FILE_OFFSET_BITS=64 -I/usr/include/rpm -I/tmp/B.GcEWCU/BUILD/libsolv-0.6.34 -I/tmp/B.GcEWCU/BUILD/libsolv-0.6.34/src -I/tmp/B.GcEWCU/BUILD/libsolv-0.6.34/ext -I/tmp/B.GcEWCU/BUILD/libsolv-0.6.34/build -I/tmp/B.GcEWCU/BUILD/libsolv-0.6.34/build/src -Wall -fPIC -O2 -fwrapv -pipe -Wformat -Werror=format-security -gdwarf-4 -fno-debug-types-section -fvar-tracking-assignments -g2 -Wp,-D_FORTIFY_SOURCE=2 -fstack-protector-strong --param=ssp-buffer-size=4 -fomit-frame-pointer -march=i686 -fasynchronous-unwind-tables -mtune=pentium4 -gdwarf-4 -fno-debug-types-section -fvar-tracking-assignments -g2 -DNDEBUG -DQT_NO_DEBUG -DVERSION=\"0.6.34\" -o CMakeFiles/libsolv_static.dir/selection.o -c /tmp/B.GcEWCU/BUILD/libsolv-0.6.34/src/selection.c make[2]: Leaving directory '/tmp/B.GcEWCU/BUILD/libsolv-0.6.34/build' make[2]: Entering directory '/tmp/B.GcEWCU/BUILD/libsolv-0.6.34/build' [ 54%] Building C object src/CMakeFiles/libsolv_static.dir/cleandeps.o cd /tmp/B.GcEWCU/BUILD/libsolv-0.6.34/build/src && /usr/bin/i686-pld-linux-gcc -DENABLE_APPDATA=1 -DENABLE_BZIP2_COMPRESSION=1 -DENABLE_COMPLEX_DEPS=1 -DENABLE_HELIXREPO=1 -DENABLE_LZMA_COMPRESSION=1 -DENABLE_PGPVRFY=1 -DENABLE_PUBKEY=1 -DENABLE_RPMDB=1 -DENABLE_RPMDB_BYRPMHEADER=1 -DENABLE_RPMMD=1 -DENABLE_RPMPKG=1 -DENABLE_ZLIB_COMPRESSION=1 -DHAVE_FOPENCOOKIE=1 -DHAVE_QSORT_R=1 -DHAVE_STRCHRNUL=1 -DLIBSOLV_INTERNAL=1 -DRPM5 -D_FILE_OFFSET_BITS=64 -I/usr/include/rpm -I/tmp/B.GcEWCU/BUILD/libsolv-0.6.34 -I/tmp/B.GcEWCU/BUILD/libsolv-0.6.34/src -I/tmp/B.GcEWCU/BUILD/libsolv-0.6.34/ext -I/tmp/B.GcEWCU/BUILD/libsolv-0.6.34/build -I/tmp/B.GcEWCU/BUILD/libsolv-0.6.34/build/src -Wall -fPIC -O2 -fwrapv -pipe -Wformat -Werror=format-security -gdwarf-4 -fno-debug-types-section -fvar-tracking-assignments -g2 -Wp,-D_FORTIFY_SOURCE=2 -fstack-protector-strong --param=ssp-buffer-size=4 -fomit-frame-pointer -march=i686 -fasynchronous-unwind-tables -mtune=pentium4 -gdwarf-4 -fno-debug-types-section -fvar-tracking-assignments -g2 -DNDEBUG -DQT_NO_DEBUG -DVERSION=\"0.6.34\" -o CMakeFiles/libsolv_static.dir/cleandeps.o -c /tmp/B.GcEWCU/BUILD/libsolv-0.6.34/src/cleandeps.c make[2]: Leaving directory '/tmp/B.GcEWCU/BUILD/libsolv-0.6.34/build' make[2]: Entering directory '/tmp/B.GcEWCU/BUILD/libsolv-0.6.34/build' [ 44%] Building C object src/CMakeFiles/libsolv_static.dir/rules.o cd /tmp/B.GcEWCU/BUILD/libsolv-0.6.34/build/src && /usr/bin/i686-pld-linux-gcc -DENABLE_APPDATA=1 -DENABLE_BZIP2_COMPRESSION=1 -DENABLE_COMPLEX_DEPS=1 -DENABLE_HELIXREPO=1 -DENABLE_LZMA_COMPRESSION=1 -DENABLE_PGPVRFY=1 -DENABLE_PUBKEY=1 -DENABLE_RPMDB=1 -DENABLE_RPMDB_BYRPMHEADER=1 -DENABLE_RPMMD=1 -DENABLE_RPMPKG=1 -DENABLE_ZLIB_COMPRESSION=1 -DHAVE_FOPENCOOKIE=1 -DHAVE_QSORT_R=1 -DHAVE_STRCHRNUL=1 -DLIBSOLV_INTERNAL=1 -DRPM5 -D_FILE_OFFSET_BITS=64 -I/usr/include/rpm -I/tmp/B.GcEWCU/BUILD/libsolv-0.6.34 -I/tmp/B.GcEWCU/BUILD/libsolv-0.6.34/src -I/tmp/B.GcEWCU/BUILD/libsolv-0.6.34/ext -I/tmp/B.GcEWCU/BUILD/libsolv-0.6.34/build -I/tmp/B.GcEWCU/BUILD/libsolv-0.6.34/build/src -Wall -fPIC -O2 -fwrapv -pipe -Wformat -Werror=format-security -gdwarf-4 -fno-debug-types-section -fvar-tracking-assignments -g2 -Wp,-D_FORTIFY_SOURCE=2 -fstack-protector-strong --param=ssp-buffer-size=4 -fomit-frame-pointer -march=i686 -fasynchronous-unwind-tables -mtune=pentium4 -gdwarf-4 -fno-debug-types-section -fvar-tracking-assignments -g2 -DNDEBUG -DQT_NO_DEBUG -DVERSION=\"0.6.34\" -o CMakeFiles/libsolv_static.dir/rules.o -c /tmp/B.GcEWCU/BUILD/libsolv-0.6.34/src/rules.c make[2]: Leaving directory '/tmp/B.GcEWCU/BUILD/libsolv-0.6.34/build' make[2]: Entering directory '/tmp/B.GcEWCU/BUILD/libsolv-0.6.34/build' [ 56%] Linking C static library libsolv.a cd /tmp/B.GcEWCU/BUILD/libsolv-0.6.34/build/src && /usr/bin/cmake -P CMakeFiles/libsolv_static.dir/cmake_clean_target.cmake cd /tmp/B.GcEWCU/BUILD/libsolv-0.6.34/build/src && /usr/bin/cmake -E cmake_link_script CMakeFiles/libsolv_static.dir/link.txt --verbose=1 /usr/bin/ar qc libsolv.a CMakeFiles/libsolv_static.dir/bitmap.o CMakeFiles/libsolv_static.dir/poolarch.o CMakeFiles/libsolv_static.dir/poolvendor.o CMakeFiles/libsolv_static.dir/poolid.o CMakeFiles/libsolv_static.dir/strpool.o CMakeFiles/libsolv_static.dir/dirpool.o CMakeFiles/libsolv_static.dir/solver.o CMakeFiles/libsolv_static.dir/solverdebug.o CMakeFiles/libsolv_static.dir/repo_solv.o CMakeFiles/libsolv_static.dir/repo_write.o CMakeFiles/libsolv_static.dir/evr.o CMakeFiles/libsolv_static.dir/pool.o CMakeFiles/libsolv_static.dir/queue.o CMakeFiles/libsolv_static.dir/repo.o CMakeFiles/libsolv_static.dir/repodata.o CMakeFiles/libsolv_static.dir/repopage.o CMakeFiles/libsolv_static.dir/util.o CMakeFiles/libsolv_static.dir/policy.o CMakeFiles/libsolv_static.dir/solvable.o CMakeFiles/libsolv_static.dir/transaction.o CMakeFiles/libsolv_static.dir/order.o CMakeFiles/libsolv_static.dir/rules.o CMakeFiles/libsolv_static.dir/problems.o CMakeFiles/libsolv_static.dir/linkedpkg.o CMakeFiles/libsolv_static.dir/cplxdeps.o CMakeFiles/libsolv_static.dir/chksum.o CMakeFiles/libsolv_static.dir/md5.o CMakeFiles/libsolv_static.dir/sha1.o CMakeFiles/libsolv_static.dir/sha2.o CMakeFiles/libsolv_static.dir/solvversion.o CMakeFiles/libsolv_static.dir/selection.o CMakeFiles/libsolv_static.dir/fileprovides.o CMakeFiles/libsolv_static.dir/diskusage.o CMakeFiles/libsolv_static.dir/suse.o CMakeFiles/libsolv_static.dir/solver_util.o CMakeFiles/libsolv_static.dir/cleandeps.o CMakeFiles/libsolv_static.dir/userinstalled.o /usr/bin/ranlib libsolv.a make[2]: Leaving directory '/tmp/B.GcEWCU/BUILD/libsolv-0.6.34/build' make[1]: Entering directory '/tmp/B.GcEWCU/BUILD/libsolv-0.6.34/build' [ 56%] Built target libsolv_static make[1]: Leaving directory '/tmp/B.GcEWCU/BUILD/libsolv-0.6.34/build' make: *** [Makefile:166: all] Error 2 error: Bad exit status from /tmp/B.GcEWCU/BUILD/tmp/rpm-tmp.20344 (%build) RPM build errors: Bad exit status from /tmp/B.GcEWCU/BUILD/tmp/rpm-tmp.20344 (%build) ended at: Fri Sep 14 20:31:39 2018, done in 0:00:12.326198 error: No files produced. + chmod -R u+rwX /tmp/B.GcEWCU/BUILD + rm -rf /tmp/B.GcEWCU/tmp /tmp/B.GcEWCU/BUILD + rm -rf /tmp/B.GcEWCU Begin-PLD-Builder-Info Build-Time: user:66.07s sys:3.81s real:23.23s (faults io:0 non-io:781745) End-PLD-Builder-Info
[Back to list of logs] [View rpm -qa of builder]