FailedOk

th/SRPMS[OK]
th/x32[OK]
th/i686[OK]
th/x86_64[OK]

ac/SRPMS[OK]
ac/i386[OK]
ac/i586[OK]
ac/i686[OK]
ac/alpha[OK]
ac/amd64[OK]
ac/athlon[OK]
ac/ppc[OK]
ac/sparc[OK]
ac/sparc64[OK]

Advanced Search
main()
Powered by PLD Linux
(c) 2002-2018 PLD Team
$Revision: 1.37 $
Powered by Ken.
Your IP: 54.158.52.166

libssh 757a5e64-20c8-4f31-a437-14fab16cf678

Status:Failed
Source URL:ftp://buildlogs.pld-linux.org/th/i686/FAIL/libssh,757a5e64-20c8-4f31-a437-14fab16cf678.bz2
text/plain URL:View!
rpm -qa of builder:View!
Date:2018/09/14 20:33:00
Runtime:0:00:09.208392

Toc:

  • prep
  • Executing(%prep): /bin/sh -e /tmp/B.bUdaXr/BUILD/tmp/rpm-tmp.59450
  • build
  • Executing(%build): /bin/sh -e /tmp/B.bUdaXr/BUILD/tmp/rpm-tmp.59450
  • error 1
  • /tmp/B.bUdaXr/BUILD/libssh-0.7.5/src/libcrypto.c:136:16: error: storage size of 'md' isn't known
  • error 2
  • /tmp/B.bUdaXr/BUILD/libssh-0.7.5/src/libcrypto.c:147:32: error: invalid application of 'sizeof' to incomplete type 'EVP_MD_CTX' {aka 'struct evp_md_ctx_st'}
  • error 3
  • /tmp/B.bUdaXr/BUILD/libssh-0.7.5/src/libcrypto.c:325:23: error: dereferencing pointer to incomplete type 'HMAC_CTX' {aka 'struct hmac_ctx_st'}
  • error 4
  • /tmp/B.bUdaXr/BUILD/libssh-0.7.5/src/libcrypto.c:331:3: error: implicit declaration of function 'HMAC_CTX_init'; did you mean 'HMAC_CTX_new'? [-Wimplicit-function-declaration]
  • error 5
  • /tmp/B.bUdaXr/BUILD/libssh-0.7.5/src/libcrypto.c:366:3: error: implicit declaration of function 'HMAC_CTX_cleanup'; did you mean 'HMAC_CTX_get_md'? [-Wimplicit-function-declaration]
  • error 6
  • /tmp/B.bUdaXr/BUILD/libssh-0.7.5/src/libcrypto.c:458:3: error: implicit declaration of function 'AES_ctr128_encrypt'; did you mean 'AES_cfb128_encrypt'? [-Wimplicit-function-declaration]
  • error 7
  • make[2]: *** [src/CMakeFiles/ssh_shared.dir/build.make:313: src/CMakeFiles/ssh_shared.dir/libcrypto.c.o] Error 1
  • error 8
  • make[1]: *** [CMakeFiles/Makefile2:210: src/CMakeFiles/ssh_shared.dir/all] Error 2
  • error 9
  • error: Bad exit status from /tmp/B.bUdaXr/BUILD/tmp/rpm-tmp.59450 (%build)
  • error 10
  • RPM build errors:
  • error 11
  • error: No files produced.

Content:

request from: arekm
checking if we should skip the build
started at: Fri Sep 14 20:32:49 2018
killing old processes on a builder
sending signal 9 to pid -1
Killed
cleaning up /tmp
fetching https://srcbuilder.pld-linux.org/th//srpms/757a5e64-20c8-4f31-a437-14fab16cf678/libssh-0.7.5-2.src.rpm
fetched 388854 bytes, 734.3 K/s
installing srpm: libssh-0.7.5-2.src.rpm
+ install -d /tmp/B.bUdaXr/BUILD /tmp/B.bUdaXr/RPMS
+ LC_ALL=en_US.UTF-8
+ rpm -qp --changelog libssh-0.7.5-2.src.rpm
* Fri Sep 14 2018 PLD Linux Team <feedback@pld-linux.org>
- For complete changelog see: http://git.pld-linux.org/?p=packages/libssh.git;a=log;h=master
* Fri Sep 14 2018 Arkadiusz Miƛkiewicz <arekm@maven.pl> f67f8fa
- release 2 (by relup.sh) + rpm -Uhv --nodeps --define '_topdir /tmp/B.bUdaXr' --define '_specdir %{_topdir}' --define '_sourcedir %{_specdir}' --define '_rpmdir %{_topdir}/RPMS' --define '_builddir %{_topdir}/BUILD' libssh-0.7.5-2.src.rpm Preparing... ################################################## libssh ################################################## + rm -f libssh-0.7.5-2.src.rpm + install -m 700 -d /tmp/B.bUdaXr/BUILD/tmp + TMPDIR=/tmp/B.bUdaXr/BUILD/tmp + exec nice -n 0 rpmbuild -bp --short-circuit --nodeps --define '_topdir /tmp/B.bUdaXr' --define '_specdir %{_topdir}' --define '_sourcedir %{_specdir}' --define '_rpmdir %{_topdir}/RPMS' --define '_builddir %{_topdir}/BUILD' --target i686-pld-linux --define 'prep exit 0' /tmp/B.bUdaXr/libssh.spec Building target platforms: i686-pld-linux checking BuildConflict-ing packages no BuildConflicts found checking BR rpm: Building target platforms: i686-pld-linux no BR needed building RPM using: set -ex; : build-id: 757a5e64-20c8-4f31-a437-14fab16cf678; TMPDIR=/tmp/B.bUdaXr/BUILD/tmp exec nice -n 0 rpmbuild -bb --define '_smp_mflags -j9' --define '_make_opts -Otarget' --define '_pld_builder 1' --define '_topdir /tmp/B.bUdaXr' --define '_specdir %{_topdir}' --define '_sourcedir %{_specdir}' --define '_rpmdir %{_topdir}/RPMS' --define '_builddir %{_topdir}/BUILD' --target i686-pld-linux /tmp/B.bUdaXr/libssh.spec + : build-id: 757a5e64-20c8-4f31-a437-14fab16cf678 + TMPDIR=/tmp/B.bUdaXr/BUILD/tmp + exec nice -n 0 rpmbuild -bb --define '_smp_mflags -j9' --define '_make_opts -Otarget' --define '_pld_builder 1' --define '_topdir /tmp/B.bUdaXr' --define '_specdir %{_topdir}' --define '_sourcedir %{_specdir}' --define '_rpmdir %{_topdir}/RPMS' --define '_builddir %{_topdir}/BUILD' --target i686-pld-linux /tmp/B.bUdaXr/libssh.spec Building target platforms: i686-pld-linux Executing(%prep): /bin/sh -e /tmp/B.bUdaXr/BUILD/tmp/rpm-tmp.59450 + umask 022 + cd /tmp/B.bUdaXr/BUILD + cd /tmp/B.bUdaXr/BUILD + rm -rf libssh-0.7.5 + /bin/tar -xf - + /usr/bin/bzip2 -dc /tmp/B.bUdaXr/libssh-0.7.5.tar.bz2 + STATUS=0 + '[' 0 -ne 0 ']' + cd libssh-0.7.5 + /bin/id -u + '[' 1001 '=' 0 ']' + /bin/id -u + '[' 1001 '=' 0 ']' + /bin/chmod -Rf a+rX,u+w,g-w,o-w . + exit 0 Executing(%build): /bin/sh -e /tmp/B.bUdaXr/BUILD/tmp/rpm-tmp.59450 TMP=/home/users/builder/tmp HOME=/home/users/builder PATH=/usr/local/bin:/usr/bin:/bin:/home/users/builder/bin TMPDIR=/tmp/B.bUdaXr/BUILD/tmp + umask 022 + cd /tmp/B.bUdaXr/BUILD + cd libssh-0.7.5 + install -d build + cd build + CC=i686-pld-linux-gcc CXX=i686-pld-linux-g++ CPPFLAGS= /usr/bin/cmake '-DCMAKE_VERBOSE_MAKEFILE=ON' '-DCMAKE_BUILD_TYPE=PLD' '-DCMAKE_INSTALL_BINDIR:PATH=/usr/bin' '-DCMAKE_INSTALL_SBINDIR:PATH=/usr/sbin' '-DCMAKE_INSTALL_LIBEXECDIR:PATH=/usr/libexec' '-DCMAKE_INSTALL_SYSCONFDIR:PATH=/etc' '-DCMAKE_INSTALL_SHAREDSTATEDIRPATH:PATH=/var/lib' '-DCMAKE_INSTALL_LOCALSTATEDIRPATH:PATH=/var' '-DCMAKE_INSTALL_LIBDIR:PATH=/usr/lib' '-DCMAKE_INSTALL_INCLUDEDIR:PATH=/usr/include' '-DCMAKE_INSTALL_OLDINCLUDEDIR:PATH=/usr/include' '-DCMAKE_INSTALL_DATAROOTDIR:PATH=/usr/share' '-DCMAKE_INSTALL_DATADIR:PATH=/usr/share' '-DCMAKE_INSTALL_INFODIR:PATH=/usr/share/info' '-DCMAKE_INSTALL_LOCALEDIR:PATH=/usr/share/locale' '-DCMAKE_INSTALL_MANDIR:PATH=/usr/share/man' '-DCMAKE_INSTALL_DOCDIR:PATH=/usr/share/doc' '-DCMAKE_INSTALL_PREFIX:PATH=/usr' '-DSYSCONF_INSTALL_DIR:PATH=/etc' '-DCMAKE_CXX_FLAGS_PLD=-O2 -fwrapv -pipe -Wformat -Werror=format-security -gdwarf-4 -fno-debug-types-section -fvar-tracking-assignments -g2 -Wp,-D_FORTIFY_SOURCE=2 -fstack-protector-strong --param=ssp-buffer-size=4 -fomit-frame-pointer -march=i686 -fasynchronous-unwind-tables -mtune=pentium4 -gdwarf-4 -fno-debug-types-section -fvar-tracking-assignments -g2 -DNDEBUG -DQT_NO_DEBUG' '-DCMAKE_C_FLAGS_PLD=-O2 -fwrapv -pipe -Wformat -Werror=format-security -gdwarf-4 -fno-debug-types-section -fvar-tracking-assignments -g2 -Wp,-D_FORTIFY_SOURCE=2 -fstack-protector-strong --param=ssp-buffer-size=4 -fomit-frame-pointer -march=i686 -fasynchronous-unwind-tables -mtune=pentium4 -gdwarf-4 -fno-debug-types-section -fvar-tracking-assignments -g2 -DNDEBUG -DQT_NO_DEBUG' '-DCMAKE_Fortran_FLAGS_PLD=-O2 -fwrapv -pipe -Wformat -Werror=format-security -gdwarf-4 -fno-debug-types-section -fvar-tracking-assignments -g2 -Wp,-D_FORTIFY_SOURCE=2 -fstack-protector-strong --param=ssp-buffer-size=4 -fomit-frame-pointer -march=i686 -fasynchronous-unwind-tables -mtune=pentium4 -gdwarf-4 -fno-debug-types-section -fvar-tracking-assignments -g2 -DNDEBUG -DQT_NO_DEBUG' '-DCMAKE_EXE_LINKER_FLAGS_PLD=-Wl,--as-needed -Wl,--no-copy-dt-needed-entries -Wl,-z,relro -Wl,-z,combreloc ' '-DCMAKE_SHARED_LINKER_FLAGS_PLD=-Wl,--as-needed -Wl,--no-copy-dt-needed-entries -Wl,-z,relro -Wl,-z,combreloc ' '-DCMAKE_MODULE_LINKER_FLAGS_PLD=-Wl,--as-needed -Wl,--no-copy-dt-needed-entries -Wl,-z,relro -Wl,-z,combreloc ' '-DBUILD_SHARED_LIBS:BOOL=ON' .. '-DWITH_SSH1=ON' -- The C compiler identification is GNU 8.2.0 -- Check for working C compiler: /usr/bin/i686-pld-linux-gcc -- Check for working C compiler: /usr/bin/i686-pld-linux-gcc -- works -- Detecting C compiler ABI info -- Detecting C compiler ABI info - done -- Detecting C compile features -- Detecting C compile features - done -- Performing Test WITH_FPIC -- Performing Test WITH_FPIC - Success -- Performing Test WITH_STACK_PROTECTOR -- Performing Test WITH_STACK_PROTECTOR - Success -- Found ZLIB: /usr/lib/libz.so (found version "1.2.11") -- Found OpenSSL: /usr/lib/libcrypto.so (found version "1.1.1") -- Looking for pthread.h -- Looking for pthread.h - found -- Looking for pthread_create -- Looking for pthread_create - not found -- Looking for pthread_create in pthreads -- Looking for pthread_create in pthreads - not found -- Looking for pthread_create in pthread -- Looking for pthread_create in pthread - found -- Found Threads: TRUE -- Found PkgConfig: /usr/bin/pkg-config (found version "0.29.2") -- Checking for module 'heimdal-gssapi' -- Found heimdal-gssapi, version 7.5.0 -- Found GSSAPI: /usr/lib/libgssapi.so;/usr/lib/libkrb5.so;/usr/lib/libhcrypto.so;/usr/lib/libcom_err.so;/usr/lib/libheimntlm.so;/usr/lib/libhx509.so;/usr/lib/libasn1.so;/usr/lib/libwind.so;/usr/lib/libwind.so -- Could NOT find NaCl (missing: NACL_LIBRARIES NACL_INCLUDE_DIRS) -- Performing Test WITH_VISIBILITY_HIDDEN -- Performing Test WITH_VISIBILITY_HIDDEN - Success -- Looking for argp.h -- Looking for argp.h - found -- Looking for pty.h -- Looking for pty.h - found -- Looking for utmp.h -- Looking for utmp.h - found -- Looking for termios.h -- Looking for termios.h - found -- Looking for unistd.h -- Looking for unistd.h - found -- Looking for util.h -- Looking for util.h - not found -- Looking for libutil.h -- Looking for libutil.h - not found -- Looking for sys/time.h -- Looking for sys/time.h - found -- Looking for sys/param.h -- Looking for sys/param.h - found -- Looking for arpa/inet.h -- Looking for arpa/inet.h - found -- Looking for byteswap.h -- Looking for byteswap.h - found -- Looking for openssl/des.h -- Looking for openssl/des.h - found -- Looking for openssl/aes.h -- Looking for openssl/aes.h - found -- Looking for openssl/blowfish.h -- Looking for openssl/blowfish.h - found -- Looking for openssl/ecdh.h -- Looking for openssl/ecdh.h - found -- Looking for openssl/ec.h -- Looking for openssl/ec.h - found -- Looking for openssl/ecdsa.h -- Looking for openssl/ecdsa.h - found -- Looking for isblank -- Looking for isblank - found -- Looking for strncpy -- Looking for strncpy - found -- Looking for strtoull -- Looking for strtoull - found -- Looking for vsnprintf -- Looking for vsnprintf - found -- Looking for snprintf -- Looking for snprintf - found -- Looking for poll -- Looking for poll - found -- Looking for select -- Looking for select - found -- Looking for getaddrinfo -- Looking for getaddrinfo - found -- Looking for ntohll -- Looking for ntohll - not found -- Looking for htonll -- Looking for htonll - not found -- Looking for clock_gettime in rt -- Looking for clock_gettime in rt - found -- Looking for forkpty in util -- Looking for forkpty in util - found -- Looking for cfmakeraw -- Looking for cfmakeraw - found -- Looking for __strtoull -- Looking for __strtoull - not found -- Performing Test HAVE_GCC_THREAD_LOCAL_STORAGE -- Performing Test HAVE_GCC_THREAD_LOCAL_STORAGE - Success -- Performing Test HAVE_MSC_THREAD_LOCAL_STORAGE -- Performing Test HAVE_MSC_THREAD_LOCAL_STORAGE - Failed -- Performing Test HAVE_GCC_VOLATILE_MEMORY_PROTECTION -- Performing Test HAVE_GCC_VOLATILE_MEMORY_PROTECTION - Success -- Performing Test HAVE_GCC_NARG_MACRO -- Performing Test HAVE_GCC_NARG_MACRO - Success -- Performing Test HAVE_COMPILER__FUNC__ -- Performing Test HAVE_COMPILER__FUNC__ - Success -- Performing Test HAVE_COMPILER__FUNCTION__ -- Performing Test HAVE_COMPILER__FUNCTION__ - Failed -- Check if the system is big endian -- Searching 16 bit integer -- Looking for sys/types.h -- Looking for sys/types.h - found -- Looking for stdint.h -- Looking for stdint.h - found -- Looking for stddef.h -- Looking for stddef.h - found -- Check size of unsigned short -- Check size of unsigned short - done -- Using unsigned short -- Check if the system is big endian - little endian -- Found Doxygen: /usr/bin/doxygen (found version "1.8.8") found components: doxygen dot -- Found DOXYFILE_IN: /tmp/B.bUdaXr/BUILD/libssh-0.7.5/doc/Doxyfile.in -- Threads_FOUND=TRUE -- threads library: Threads_FOUND=TRUE -- libssh_threads_SRCS=pthread.c -- The CXX compiler identification is GNU 8.2.0 -- Check for working CXX compiler: /usr/bin/i686-pld-linux-g++ -- Check for working CXX compiler: /usr/bin/i686-pld-linux-g++ -- works -- Detecting CXX compiler ABI info -- Detecting CXX compiler ABI info - done -- Detecting CXX compile features -- Detecting CXX compile features - done -- ******************************************** -- ********** libssh build options : ********** -- zlib support: ON -- libgcrypt support: OFF -- libnacl support: OFF -- SSH-1 support: ON -- SFTP support: ON -- Server support : ON -- GSSAPI support : ON -- Pcap debugging support : ON -- With static library: OFF -- Unit testing: OFF -- Client code Unit testing: OFF -- Public API documentation generation -- Benchmarks: OFF -- ******************************************** -- Configuring done -- Generating done CMake Warning: Manually-specified variables were not used by the project: CMAKE_Fortran_FLAGS_PLD CMAKE_INSTALL_BINDIR CMAKE_INSTALL_DATADIR CMAKE_INSTALL_DATAROOTDIR CMAKE_INSTALL_DOCDIR CMAKE_INSTALL_INCLUDEDIR CMAKE_INSTALL_INFODIR CMAKE_INSTALL_LIBDIR CMAKE_INSTALL_LIBEXECDIR CMAKE_INSTALL_LOCALEDIR CMAKE_INSTALL_LOCALSTATEDIRPATH CMAKE_INSTALL_MANDIR CMAKE_INSTALL_OLDINCLUDEDIR CMAKE_INSTALL_SBINDIR CMAKE_INSTALL_SHAREDSTATEDIRPATH CMAKE_INSTALL_SYSCONFDIR -- Build files have been written to: /tmp/B.bUdaXr/BUILD/libssh-0.7.5/build + /usr/bin/make -Otarget -j9 /usr/bin/cmake -H/tmp/B.bUdaXr/BUILD/libssh-0.7.5 -B/tmp/B.bUdaXr/BUILD/libssh-0.7.5/build --check-build-system CMakeFiles/Makefile.cmake 0 /usr/bin/cmake -E cmake_progress_start /tmp/B.bUdaXr/BUILD/libssh-0.7.5/build/CMakeFiles /tmp/B.bUdaXr/BUILD/libssh-0.7.5/build/CMakeFiles/progress.marks /usr/bin/make -f CMakeFiles/Makefile2 all /usr/bin/make -f src/CMakeFiles/ssh_shared.dir/build.make src/CMakeFiles/ssh_shared.dir/depend make[2]: Entering directory '/tmp/B.bUdaXr/BUILD/libssh-0.7.5/build' cd /tmp/B.bUdaXr/BUILD/libssh-0.7.5/build && /usr/bin/cmake -E cmake_depends "Unix Makefiles" /tmp/B.bUdaXr/BUILD/libssh-0.7.5 /tmp/B.bUdaXr/BUILD/libssh-0.7.5/src /tmp/B.bUdaXr/BUILD/libssh-0.7.5/build /tmp/B.bUdaXr/BUILD/libssh-0.7.5/build/src /tmp/B.bUdaXr/BUILD/libssh-0.7.5/build/src/CMakeFiles/ssh_shared.dir/DependInfo.cmake --color= Scanning dependencies of target ssh_shared make[2]: Leaving directory '/tmp/B.bUdaXr/BUILD/libssh-0.7.5/build' /usr/bin/make -f src/CMakeFiles/ssh_shared.dir/build.make src/CMakeFiles/ssh_shared.dir/build make[2]: Entering directory '/tmp/B.bUdaXr/BUILD/libssh-0.7.5/build' [ 2%] Building C object src/CMakeFiles/ssh_shared.dir/bignum.c.o cd /tmp/B.bUdaXr/BUILD/libssh-0.7.5/build/src && /usr/bin/i686-pld-linux-gcc -DLIBSSH_EXPORTS -I/tmp/B.bUdaXr/BUILD/libssh-0.7.5/build/src -I/tmp/B.bUdaXr/BUILD/libssh-0.7.5/src -I/tmp/B.bUdaXr/BUILD/libssh-0.7.5/include -I/tmp/B.bUdaXr/BUILD/libssh-0.7.5/build -std=gnu99 -pedantic -pedantic-errors -Wall -Wextra -Wshadow -Wmissing-prototypes -Wdeclaration-after-statement -Wunused -Wfloat-equal -Wpointer-arith -Wwrite-strings -Wformat-security -Wmissing-format-attribute -fPIC -fstack-protector -D_LARGEFILE_SOURCE -D_FILE_OFFSET_BITS=64 -O2 -fwrapv -pipe -Wformat -Werror=format-security -gdwarf-4 -fno-debug-types-section -fvar-tracking-assignments -g2 -Wp,-D_FORTIFY_SOURCE=2 -fstack-protector-strong --param=ssp-buffer-size=4 -fomit-frame-pointer -march=i686 -fasynchronous-unwind-tables -mtune=pentium4 -gdwarf-4 -fno-debug-types-section -fvar-tracking-assignments -g2 -DNDEBUG -DQT_NO_DEBUG -fPIC -fvisibility=hidden -o CMakeFiles/ssh_shared.dir/bignum.c.o -c /tmp/B.bUdaXr/BUILD/libssh-0.7.5/src/bignum.c make[2]: Leaving directory '/tmp/B.bUdaXr/BUILD/libssh-0.7.5/build' make[2]: Entering directory '/tmp/B.bUdaXr/BUILD/libssh-0.7.5/build' [ 4%] Building C object src/CMakeFiles/ssh_shared.dir/callbacks.c.o cd /tmp/B.bUdaXr/BUILD/libssh-0.7.5/build/src && /usr/bin/i686-pld-linux-gcc -DLIBSSH_EXPORTS -I/tmp/B.bUdaXr/BUILD/libssh-0.7.5/build/src -I/tmp/B.bUdaXr/BUILD/libssh-0.7.5/src -I/tmp/B.bUdaXr/BUILD/libssh-0.7.5/include -I/tmp/B.bUdaXr/BUILD/libssh-0.7.5/build -std=gnu99 -pedantic -pedantic-errors -Wall -Wextra -Wshadow -Wmissing-prototypes -Wdeclaration-after-statement -Wunused -Wfloat-equal -Wpointer-arith -Wwrite-strings -Wformat-security -Wmissing-format-attribute -fPIC -fstack-protector -D_LARGEFILE_SOURCE -D_FILE_OFFSET_BITS=64 -O2 -fwrapv -pipe -Wformat -Werror=format-security -gdwarf-4 -fno-debug-types-section -fvar-tracking-assignments -g2 -Wp,-D_FORTIFY_SOURCE=2 -fstack-protector-strong --param=ssp-buffer-size=4 -fomit-frame-pointer -march=i686 -fasynchronous-unwind-tables -mtune=pentium4 -gdwarf-4 -fno-debug-types-section -fvar-tracking-assignments -g2 -DNDEBUG -DQT_NO_DEBUG -fPIC -fvisibility=hidden -o CMakeFiles/ssh_shared.dir/callbacks.c.o -c /tmp/B.bUdaXr/BUILD/libssh-0.7.5/src/callbacks.c make[2]: Leaving directory '/tmp/B.bUdaXr/BUILD/libssh-0.7.5/build' make[2]: Entering directory '/tmp/B.bUdaXr/BUILD/libssh-0.7.5/build' [ 2%] Building C object src/CMakeFiles/ssh_shared.dir/base64.c.o cd /tmp/B.bUdaXr/BUILD/libssh-0.7.5/build/src && /usr/bin/i686-pld-linux-gcc -DLIBSSH_EXPORTS -I/tmp/B.bUdaXr/BUILD/libssh-0.7.5/build/src -I/tmp/B.bUdaXr/BUILD/libssh-0.7.5/src -I/tmp/B.bUdaXr/BUILD/libssh-0.7.5/include -I/tmp/B.bUdaXr/BUILD/libssh-0.7.5/build -std=gnu99 -pedantic -pedantic-errors -Wall -Wextra -Wshadow -Wmissing-prototypes -Wdeclaration-after-statement -Wunused -Wfloat-equal -Wpointer-arith -Wwrite-strings -Wformat-security -Wmissing-format-attribute -fPIC -fstack-protector -D_LARGEFILE_SOURCE -D_FILE_OFFSET_BITS=64 -O2 -fwrapv -pipe -Wformat -Werror=format-security -gdwarf-4 -fno-debug-types-section -fvar-tracking-assignments -g2 -Wp,-D_FORTIFY_SOURCE=2 -fstack-protector-strong --param=ssp-buffer-size=4 -fomit-frame-pointer -march=i686 -fasynchronous-unwind-tables -mtune=pentium4 -gdwarf-4 -fno-debug-types-section -fvar-tracking-assignments -g2 -DNDEBUG -DQT_NO_DEBUG -fPIC -fvisibility=hidden -o CMakeFiles/ssh_shared.dir/base64.c.o -c /tmp/B.bUdaXr/BUILD/libssh-0.7.5/src/base64.c make[2]: Leaving directory '/tmp/B.bUdaXr/BUILD/libssh-0.7.5/build' make[2]: Entering directory '/tmp/B.bUdaXr/BUILD/libssh-0.7.5/build' [ 7%] Building C object src/CMakeFiles/ssh_shared.dir/client.c.o cd /tmp/B.bUdaXr/BUILD/libssh-0.7.5/build/src && /usr/bin/i686-pld-linux-gcc -DLIBSSH_EXPORTS -I/tmp/B.bUdaXr/BUILD/libssh-0.7.5/build/src -I/tmp/B.bUdaXr/BUILD/libssh-0.7.5/src -I/tmp/B.bUdaXr/BUILD/libssh-0.7.5/include -I/tmp/B.bUdaXr/BUILD/libssh-0.7.5/build -std=gnu99 -pedantic -pedantic-errors -Wall -Wextra -Wshadow -Wmissing-prototypes -Wdeclaration-after-statement -Wunused -Wfloat-equal -Wpointer-arith -Wwrite-strings -Wformat-security -Wmissing-format-attribute -fPIC -fstack-protector -D_LARGEFILE_SOURCE -D_FILE_OFFSET_BITS=64 -O2 -fwrapv -pipe -Wformat -Werror=format-security -gdwarf-4 -fno-debug-types-section -fvar-tracking-assignments -g2 -Wp,-D_FORTIFY_SOURCE=2 -fstack-protector-strong --param=ssp-buffer-size=4 -fomit-frame-pointer -march=i686 -fasynchronous-unwind-tables -mtune=pentium4 -gdwarf-4 -fno-debug-types-section -fvar-tracking-assignments -g2 -DNDEBUG -DQT_NO_DEBUG -fPIC -fvisibility=hidden -o CMakeFiles/ssh_shared.dir/client.c.o -c /tmp/B.bUdaXr/BUILD/libssh-0.7.5/src/client.c make[2]: Leaving directory '/tmp/B.bUdaXr/BUILD/libssh-0.7.5/build' make[2]: Entering directory '/tmp/B.bUdaXr/BUILD/libssh-0.7.5/build' [ 4%] Building C object src/CMakeFiles/ssh_shared.dir/agent.c.o cd /tmp/B.bUdaXr/BUILD/libssh-0.7.5/build/src && /usr/bin/i686-pld-linux-gcc -DLIBSSH_EXPORTS -I/tmp/B.bUdaXr/BUILD/libssh-0.7.5/build/src -I/tmp/B.bUdaXr/BUILD/libssh-0.7.5/src -I/tmp/B.bUdaXr/BUILD/libssh-0.7.5/include -I/tmp/B.bUdaXr/BUILD/libssh-0.7.5/build -std=gnu99 -pedantic -pedantic-errors -Wall -Wextra -Wshadow -Wmissing-prototypes -Wdeclaration-after-statement -Wunused -Wfloat-equal -Wpointer-arith -Wwrite-strings -Wformat-security -Wmissing-format-attribute -fPIC -fstack-protector -D_LARGEFILE_SOURCE -D_FILE_OFFSET_BITS=64 -O2 -fwrapv -pipe -Wformat -Werror=format-security -gdwarf-4 -fno-debug-types-section -fvar-tracking-assignments -g2 -Wp,-D_FORTIFY_SOURCE=2 -fstack-protector-strong --param=ssp-buffer-size=4 -fomit-frame-pointer -march=i686 -fasynchronous-unwind-tables -mtune=pentium4 -gdwarf-4 -fno-debug-types-section -fvar-tracking-assignments -g2 -DNDEBUG -DQT_NO_DEBUG -fPIC -fvisibility=hidden -o CMakeFiles/ssh_shared.dir/agent.c.o -c /tmp/B.bUdaXr/BUILD/libssh-0.7.5/src/agent.c make[2]: Leaving directory '/tmp/B.bUdaXr/BUILD/libssh-0.7.5/build' make[2]: Entering directory '/tmp/B.bUdaXr/BUILD/libssh-0.7.5/build' [ 10%] Building C object src/CMakeFiles/ssh_shared.dir/curve25519.c.o cd /tmp/B.bUdaXr/BUILD/libssh-0.7.5/build/src && /usr/bin/i686-pld-linux-gcc -DLIBSSH_EXPORTS -I/tmp/B.bUdaXr/BUILD/libssh-0.7.5/build/src -I/tmp/B.bUdaXr/BUILD/libssh-0.7.5/src -I/tmp/B.bUdaXr/BUILD/libssh-0.7.5/include -I/tmp/B.bUdaXr/BUILD/libssh-0.7.5/build -std=gnu99 -pedantic -pedantic-errors -Wall -Wextra -Wshadow -Wmissing-prototypes -Wdeclaration-after-statement -Wunused -Wfloat-equal -Wpointer-arith -Wwrite-strings -Wformat-security -Wmissing-format-attribute -fPIC -fstack-protector -D_LARGEFILE_SOURCE -D_FILE_OFFSET_BITS=64 -O2 -fwrapv -pipe -Wformat -Werror=format-security -gdwarf-4 -fno-debug-types-section -fvar-tracking-assignments -g2 -Wp,-D_FORTIFY_SOURCE=2 -fstack-protector-strong --param=ssp-buffer-size=4 -fomit-frame-pointer -march=i686 -fasynchronous-unwind-tables -mtune=pentium4 -gdwarf-4 -fno-debug-types-section -fvar-tracking-assignments -g2 -DNDEBUG -DQT_NO_DEBUG -fPIC -fvisibility=hidden -o CMakeFiles/ssh_shared.dir/curve25519.c.o -c /tmp/B.bUdaXr/BUILD/libssh-0.7.5/src/curve25519.c make[2]: Leaving directory '/tmp/B.bUdaXr/BUILD/libssh-0.7.5/build' make[2]: Entering directory '/tmp/B.bUdaXr/BUILD/libssh-0.7.5/build' [ 8%] Building C object src/CMakeFiles/ssh_shared.dir/config.c.o cd /tmp/B.bUdaXr/BUILD/libssh-0.7.5/build/src && /usr/bin/i686-pld-linux-gcc -DLIBSSH_EXPORTS -I/tmp/B.bUdaXr/BUILD/libssh-0.7.5/build/src -I/tmp/B.bUdaXr/BUILD/libssh-0.7.5/src -I/tmp/B.bUdaXr/BUILD/libssh-0.7.5/include -I/tmp/B.bUdaXr/BUILD/libssh-0.7.5/build -std=gnu99 -pedantic -pedantic-errors -Wall -Wextra -Wshadow -Wmissing-prototypes -Wdeclaration-after-statement -Wunused -Wfloat-equal -Wpointer-arith -Wwrite-strings -Wformat-security -Wmissing-format-attribute -fPIC -fstack-protector -D_LARGEFILE_SOURCE -D_FILE_OFFSET_BITS=64 -O2 -fwrapv -pipe -Wformat -Werror=format-security -gdwarf-4 -fno-debug-types-section -fvar-tracking-assignments -g2 -Wp,-D_FORTIFY_SOURCE=2 -fstack-protector-strong --param=ssp-buffer-size=4 -fomit-frame-pointer -march=i686 -fasynchronous-unwind-tables -mtune=pentium4 -gdwarf-4 -fno-debug-types-section -fvar-tracking-assignments -g2 -DNDEBUG -DQT_NO_DEBUG -fPIC -fvisibility=hidden -o CMakeFiles/ssh_shared.dir/config.c.o -c /tmp/B.bUdaXr/BUILD/libssh-0.7.5/src/config.c make[2]: Leaving directory '/tmp/B.bUdaXr/BUILD/libssh-0.7.5/build' make[2]: Entering directory '/tmp/B.bUdaXr/BUILD/libssh-0.7.5/build' [ 3%] Building C object src/CMakeFiles/ssh_shared.dir/buffer.c.o cd /tmp/B.bUdaXr/BUILD/libssh-0.7.5/build/src && /usr/bin/i686-pld-linux-gcc -DLIBSSH_EXPORTS -I/tmp/B.bUdaXr/BUILD/libssh-0.7.5/build/src -I/tmp/B.bUdaXr/BUILD/libssh-0.7.5/src -I/tmp/B.bUdaXr/BUILD/libssh-0.7.5/include -I/tmp/B.bUdaXr/BUILD/libssh-0.7.5/build -std=gnu99 -pedantic -pedantic-errors -Wall -Wextra -Wshadow -Wmissing-prototypes -Wdeclaration-after-statement -Wunused -Wfloat-equal -Wpointer-arith -Wwrite-strings -Wformat-security -Wmissing-format-attribute -fPIC -fstack-protector -D_LARGEFILE_SOURCE -D_FILE_OFFSET_BITS=64 -O2 -fwrapv -pipe -Wformat -Werror=format-security -gdwarf-4 -fno-debug-types-section -fvar-tracking-assignments -g2 -Wp,-D_FORTIFY_SOURCE=2 -fstack-protector-strong --param=ssp-buffer-size=4 -fomit-frame-pointer -march=i686 -fasynchronous-unwind-tables -mtune=pentium4 -gdwarf-4 -fno-debug-types-section -fvar-tracking-assignments -g2 -DNDEBUG -DQT_NO_DEBUG -fPIC -fvisibility=hidden -o CMakeFiles/ssh_shared.dir/buffer.c.o -c /tmp/B.bUdaXr/BUILD/libssh-0.7.5/src/buffer.c make[2]: Leaving directory '/tmp/B.bUdaXr/BUILD/libssh-0.7.5/build' make[2]: Entering directory '/tmp/B.bUdaXr/BUILD/libssh-0.7.5/build' [ 9%] Building C object src/CMakeFiles/ssh_shared.dir/connect.c.o cd /tmp/B.bUdaXr/BUILD/libssh-0.7.5/build/src && /usr/bin/i686-pld-linux-gcc -DLIBSSH_EXPORTS -I/tmp/B.bUdaXr/BUILD/libssh-0.7.5/build/src -I/tmp/B.bUdaXr/BUILD/libssh-0.7.5/src -I/tmp/B.bUdaXr/BUILD/libssh-0.7.5/include -I/tmp/B.bUdaXr/BUILD/libssh-0.7.5/build -std=gnu99 -pedantic -pedantic-errors -Wall -Wextra -Wshadow -Wmissing-prototypes -Wdeclaration-after-statement -Wunused -Wfloat-equal -Wpointer-arith -Wwrite-strings -Wformat-security -Wmissing-format-attribute -fPIC -fstack-protector -D_LARGEFILE_SOURCE -D_FILE_OFFSET_BITS=64 -O2 -fwrapv -pipe -Wformat -Werror=format-security -gdwarf-4 -fno-debug-types-section -fvar-tracking-assignments -g2 -Wp,-D_FORTIFY_SOURCE=2 -fstack-protector-strong --param=ssp-buffer-size=4 -fomit-frame-pointer -march=i686 -fasynchronous-unwind-tables -mtune=pentium4 -gdwarf-4 -fno-debug-types-section -fvar-tracking-assignments -g2 -DNDEBUG -DQT_NO_DEBUG -fPIC -fvisibility=hidden -o CMakeFiles/ssh_shared.dir/connect.c.o -c /tmp/B.bUdaXr/BUILD/libssh-0.7.5/src/connect.c make[2]: Leaving directory '/tmp/B.bUdaXr/BUILD/libssh-0.7.5/build' make[2]: Entering directory '/tmp/B.bUdaXr/BUILD/libssh-0.7.5/build' [ 14%] Building C object src/CMakeFiles/ssh_shared.dir/getpass.c.o cd /tmp/B.bUdaXr/BUILD/libssh-0.7.5/build/src && /usr/bin/i686-pld-linux-gcc -DLIBSSH_EXPORTS -I/tmp/B.bUdaXr/BUILD/libssh-0.7.5/build/src -I/tmp/B.bUdaXr/BUILD/libssh-0.7.5/src -I/tmp/B.bUdaXr/BUILD/libssh-0.7.5/include -I/tmp/B.bUdaXr/BUILD/libssh-0.7.5/build -std=gnu99 -pedantic -pedantic-errors -Wall -Wextra -Wshadow -Wmissing-prototypes -Wdeclaration-after-statement -Wunused -Wfloat-equal -Wpointer-arith -Wwrite-strings -Wformat-security -Wmissing-format-attribute -fPIC -fstack-protector -D_LARGEFILE_SOURCE -D_FILE_OFFSET_BITS=64 -O2 -fwrapv -pipe -Wformat -Werror=format-security -gdwarf-4 -fno-debug-types-section -fvar-tracking-assignments -g2 -Wp,-D_FORTIFY_SOURCE=2 -fstack-protector-strong --param=ssp-buffer-size=4 -fomit-frame-pointer -march=i686 -fasynchronous-unwind-tables -mtune=pentium4 -gdwarf-4 -fno-debug-types-section -fvar-tracking-assignments -g2 -DNDEBUG -DQT_NO_DEBUG -fPIC -fvisibility=hidden -o CMakeFiles/ssh_shared.dir/getpass.c.o -c /tmp/B.bUdaXr/BUILD/libssh-0.7.5/src/getpass.c make[2]: Leaving directory '/tmp/B.bUdaXr/BUILD/libssh-0.7.5/build' make[2]: Entering directory '/tmp/B.bUdaXr/BUILD/libssh-0.7.5/build' [ 13%] Building C object src/CMakeFiles/ssh_shared.dir/error.c.o cd /tmp/B.bUdaXr/BUILD/libssh-0.7.5/build/src && /usr/bin/i686-pld-linux-gcc -DLIBSSH_EXPORTS -I/tmp/B.bUdaXr/BUILD/libssh-0.7.5/build/src -I/tmp/B.bUdaXr/BUILD/libssh-0.7.5/src -I/tmp/B.bUdaXr/BUILD/libssh-0.7.5/include -I/tmp/B.bUdaXr/BUILD/libssh-0.7.5/build -std=gnu99 -pedantic -pedantic-errors -Wall -Wextra -Wshadow -Wmissing-prototypes -Wdeclaration-after-statement -Wunused -Wfloat-equal -Wpointer-arith -Wwrite-strings -Wformat-security -Wmissing-format-attribute -fPIC -fstack-protector -D_LARGEFILE_SOURCE -D_FILE_OFFSET_BITS=64 -O2 -fwrapv -pipe -Wformat -Werror=format-security -gdwarf-4 -fno-debug-types-section -fvar-tracking-assignments -g2 -Wp,-D_FORTIFY_SOURCE=2 -fstack-protector-strong --param=ssp-buffer-size=4 -fomit-frame-pointer -march=i686 -fasynchronous-unwind-tables -mtune=pentium4 -gdwarf-4 -fno-debug-types-section -fvar-tracking-assignments -g2 -DNDEBUG -DQT_NO_DEBUG -fPIC -fvisibility=hidden -o CMakeFiles/ssh_shared.dir/error.c.o -c /tmp/B.bUdaXr/BUILD/libssh-0.7.5/src/error.c make[2]: Leaving directory '/tmp/B.bUdaXr/BUILD/libssh-0.7.5/build' make[2]: Entering directory '/tmp/B.bUdaXr/BUILD/libssh-0.7.5/build' [ 15%] Building C object src/CMakeFiles/ssh_shared.dir/init.c.o cd /tmp/B.bUdaXr/BUILD/libssh-0.7.5/build/src && /usr/bin/i686-pld-linux-gcc -DLIBSSH_EXPORTS -I/tmp/B.bUdaXr/BUILD/libssh-0.7.5/build/src -I/tmp/B.bUdaXr/BUILD/libssh-0.7.5/src -I/tmp/B.bUdaXr/BUILD/libssh-0.7.5/include -I/tmp/B.bUdaXr/BUILD/libssh-0.7.5/build -std=gnu99 -pedantic -pedantic-errors -Wall -Wextra -Wshadow -Wmissing-prototypes -Wdeclaration-after-statement -Wunused -Wfloat-equal -Wpointer-arith -Wwrite-strings -Wformat-security -Wmissing-format-attribute -fPIC -fstack-protector -D_LARGEFILE_SOURCE -D_FILE_OFFSET_BITS=64 -O2 -fwrapv -pipe -Wformat -Werror=format-security -gdwarf-4 -fno-debug-types-section -fvar-tracking-assignments -g2 -Wp,-D_FORTIFY_SOURCE=2 -fstack-protector-strong --param=ssp-buffer-size=4 -fomit-frame-pointer -march=i686 -fasynchronous-unwind-tables -mtune=pentium4 -gdwarf-4 -fno-debug-types-section -fvar-tracking-assignments -g2 -DNDEBUG -DQT_NO_DEBUG -fPIC -fvisibility=hidden -o CMakeFiles/ssh_shared.dir/init.c.o -c /tmp/B.bUdaXr/BUILD/libssh-0.7.5/src/init.c make[2]: Leaving directory '/tmp/B.bUdaXr/BUILD/libssh-0.7.5/build' make[2]: Entering directory '/tmp/B.bUdaXr/BUILD/libssh-0.7.5/build' [ 12%] Building C object src/CMakeFiles/ssh_shared.dir/ecdh.c.o cd /tmp/B.bUdaXr/BUILD/libssh-0.7.5/build/src && /usr/bin/i686-pld-linux-gcc -DLIBSSH_EXPORTS -I/tmp/B.bUdaXr/BUILD/libssh-0.7.5/build/src -I/tmp/B.bUdaXr/BUILD/libssh-0.7.5/src -I/tmp/B.bUdaXr/BUILD/libssh-0.7.5/include -I/tmp/B.bUdaXr/BUILD/libssh-0.7.5/build -std=gnu99 -pedantic -pedantic-errors -Wall -Wextra -Wshadow -Wmissing-prototypes -Wdeclaration-after-statement -Wunused -Wfloat-equal -Wpointer-arith -Wwrite-strings -Wformat-security -Wmissing-format-attribute -fPIC -fstack-protector -D_LARGEFILE_SOURCE -D_FILE_OFFSET_BITS=64 -O2 -fwrapv -pipe -Wformat -Werror=format-security -gdwarf-4 -fno-debug-types-section -fvar-tracking-assignments -g2 -Wp,-D_FORTIFY_SOURCE=2 -fstack-protector-strong --param=ssp-buffer-size=4 -fomit-frame-pointer -march=i686 -fasynchronous-unwind-tables -mtune=pentium4 -gdwarf-4 -fno-debug-types-section -fvar-tracking-assignments -g2 -DNDEBUG -DQT_NO_DEBUG -fPIC -fvisibility=hidden -o CMakeFiles/ssh_shared.dir/ecdh.c.o -c /tmp/B.bUdaXr/BUILD/libssh-0.7.5/src/ecdh.c make[2]: Leaving directory '/tmp/B.bUdaXr/BUILD/libssh-0.7.5/build' make[2]: Entering directory '/tmp/B.bUdaXr/BUILD/libssh-0.7.5/build' [ 5%] Building C object src/CMakeFiles/ssh_shared.dir/auth.c.o cd /tmp/B.bUdaXr/BUILD/libssh-0.7.5/build/src && /usr/bin/i686-pld-linux-gcc -DLIBSSH_EXPORTS -I/tmp/B.bUdaXr/BUILD/libssh-0.7.5/build/src -I/tmp/B.bUdaXr/BUILD/libssh-0.7.5/src -I/tmp/B.bUdaXr/BUILD/libssh-0.7.5/include -I/tmp/B.bUdaXr/BUILD/libssh-0.7.5/build -std=gnu99 -pedantic -pedantic-errors -Wall -Wextra -Wshadow -Wmissing-prototypes -Wdeclaration-after-statement -Wunused -Wfloat-equal -Wpointer-arith -Wwrite-strings -Wformat-security -Wmissing-format-attribute -fPIC -fstack-protector -D_LARGEFILE_SOURCE -D_FILE_OFFSET_BITS=64 -O2 -fwrapv -pipe -Wformat -Werror=format-security -gdwarf-4 -fno-debug-types-section -fvar-tracking-assignments -g2 -Wp,-D_FORTIFY_SOURCE=2 -fstack-protector-strong --param=ssp-buffer-size=4 -fomit-frame-pointer -march=i686 -fasynchronous-unwind-tables -mtune=pentium4 -gdwarf-4 -fno-debug-types-section -fvar-tracking-assignments -g2 -DNDEBUG -DQT_NO_DEBUG -fPIC -fvisibility=hidden -o CMakeFiles/ssh_shared.dir/auth.c.o -c /tmp/B.bUdaXr/BUILD/libssh-0.7.5/src/auth.c make[2]: Leaving directory '/tmp/B.bUdaXr/BUILD/libssh-0.7.5/build' make[2]: Entering directory '/tmp/B.bUdaXr/BUILD/libssh-0.7.5/build' [ 18%] Building C object src/CMakeFiles/ssh_shared.dir/libcrypto.c.o cd /tmp/B.bUdaXr/BUILD/libssh-0.7.5/build/src && /usr/bin/i686-pld-linux-gcc -DLIBSSH_EXPORTS -I/tmp/B.bUdaXr/BUILD/libssh-0.7.5/build/src -I/tmp/B.bUdaXr/BUILD/libssh-0.7.5/src -I/tmp/B.bUdaXr/BUILD/libssh-0.7.5/include -I/tmp/B.bUdaXr/BUILD/libssh-0.7.5/build -std=gnu99 -pedantic -pedantic-errors -Wall -Wextra -Wshadow -Wmissing-prototypes -Wdeclaration-after-statement -Wunused -Wfloat-equal -Wpointer-arith -Wwrite-strings -Wformat-security -Wmissing-format-attribute -fPIC -fstack-protector -D_LARGEFILE_SOURCE -D_FILE_OFFSET_BITS=64 -O2 -fwrapv -pipe -Wformat -Werror=format-security -gdwarf-4 -fno-debug-types-section -fvar-tracking-assignments -g2 -Wp,-D_FORTIFY_SOURCE=2 -fstack-protector-strong --param=ssp-buffer-size=4 -fomit-frame-pointer -march=i686 -fasynchronous-unwind-tables -mtune=pentium4 -gdwarf-4 -fno-debug-types-section -fvar-tracking-assignments -g2 -DNDEBUG -DQT_NO_DEBUG -fPIC -fvisibility=hidden -o CMakeFiles/ssh_shared.dir/libcrypto.c.o -c /tmp/B.bUdaXr/BUILD/libssh-0.7.5/src/libcrypto.c /tmp/B.bUdaXr/BUILD/libssh-0.7.5/src/libcrypto.c: In function 'evp': /tmp/B.bUdaXr/BUILD/libssh-0.7.5/src/libcrypto.c:136:16: error: storage size of 'md' isn't known EVP_MD_CTX md; ^~ /tmp/B.bUdaXr/BUILD/libssh-0.7.5/src/libcrypto.c:136:16: warning: unused variable 'md' [-Wunused-variable] /tmp/B.bUdaXr/BUILD/libssh-0.7.5/src/libcrypto.c: In function 'evp_init': /tmp/B.bUdaXr/BUILD/libssh-0.7.5/src/libcrypto.c:147:32: error: invalid application of 'sizeof' to incomplete type 'EVP_MD_CTX' {aka 'struct evp_md_ctx_st'} EVPCTX ctx = malloc(sizeof(EVP_MD_CTX)); ^~~~~~~~~~ /tmp/B.bUdaXr/BUILD/libssh-0.7.5/src/libcrypto.c: In function 'hmac_init': /tmp/B.bUdaXr/BUILD/libssh-0.7.5/src/libcrypto.c:325:23: error: dereferencing pointer to incomplete type 'HMAC_CTX' {aka 'struct hmac_ctx_st'} ctx = malloc(sizeof(*ctx)); ^~~~ /tmp/B.bUdaXr/BUILD/libssh-0.7.5/src/libcrypto.c:331:3: error: implicit declaration of function 'HMAC_CTX_init'; did you mean 'HMAC_CTX_new'? [-Wimplicit-function-declaration] HMAC_CTX_init(ctx); // openssl 0.9.7 requires it. ^~~~~~~~~~~~~ HMAC_CTX_new /tmp/B.bUdaXr/BUILD/libssh-0.7.5/src/libcrypto.c:336:7: warning: 'HMAC_Init' is deprecated [-Wdeprecated-declarations] HMAC_Init(ctx, key, len, EVP_sha1()); ^~~~~~~~~ In file included from /usr/include/openssl/dsa.h:13, from /tmp/B.bUdaXr/BUILD/libssh-0.7.5/include/libssh/libcrypto.h:28, from /tmp/B.bUdaXr/BUILD/libssh-0.7.5/include/libssh/wrapper.h:26, from /tmp/B.bUdaXr/BUILD/libssh-0.7.5/include/libssh/packet.h:24, from /tmp/B.bUdaXr/BUILD/libssh-0.7.5/include/libssh/session.h:25, from /tmp/B.bUdaXr/BUILD/libssh-0.7.5/src/libcrypto.c:32: /usr/include/openssl/hmac.h:30:1: note: declared here DEPRECATEDIN_1_1_0(__owur int HMAC_Init(HMAC_CTX *ctx, const void *key, int len, ^~~~~~~~~~~~~~~~~~ /tmp/B.bUdaXr/BUILD/libssh-0.7.5/src/libcrypto.c:339:7: warning: 'HMAC_Init' is deprecated [-Wdeprecated-declarations] HMAC_Init(ctx, key, len, EVP_sha256()); ^~~~~~~~~ In file included from /usr/include/openssl/dsa.h:13, from /tmp/B.bUdaXr/BUILD/libssh-0.7.5/include/libssh/libcrypto.h:28, from /tmp/B.bUdaXr/BUILD/libssh-0.7.5/include/libssh/wrapper.h:26, from /tmp/B.bUdaXr/BUILD/libssh-0.7.5/include/libssh/packet.h:24, from /tmp/B.bUdaXr/BUILD/libssh-0.7.5/include/libssh/session.h:25, from /tmp/B.bUdaXr/BUILD/libssh-0.7.5/src/libcrypto.c:32: /usr/include/openssl/hmac.h:30:1: note: declared here DEPRECATEDIN_1_1_0(__owur int HMAC_Init(HMAC_CTX *ctx, const void *key, int len, ^~~~~~~~~~~~~~~~~~ /tmp/B.bUdaXr/BUILD/libssh-0.7.5/src/libcrypto.c:342:7: warning: 'HMAC_Init' is deprecated [-Wdeprecated-declarations] HMAC_Init(ctx, key, len, EVP_sha384()); ^~~~~~~~~ In file included from /usr/include/openssl/dsa.h:13, from /tmp/B.bUdaXr/BUILD/libssh-0.7.5/include/libssh/libcrypto.h:28, from /tmp/B.bUdaXr/BUILD/libssh-0.7.5/include/libssh/wrapper.h:26, from /tmp/B.bUdaXr/BUILD/libssh-0.7.5/include/libssh/packet.h:24, from /tmp/B.bUdaXr/BUILD/libssh-0.7.5/include/libssh/session.h:25, from /tmp/B.bUdaXr/BUILD/libssh-0.7.5/src/libcrypto.c:32: /usr/include/openssl/hmac.h:30:1: note: declared here DEPRECATEDIN_1_1_0(__owur int HMAC_Init(HMAC_CTX *ctx, const void *key, int len, ^~~~~~~~~~~~~~~~~~ /tmp/B.bUdaXr/BUILD/libssh-0.7.5/src/libcrypto.c:345:7: warning: 'HMAC_Init' is deprecated [-Wdeprecated-declarations] HMAC_Init(ctx, key, len, EVP_sha512()); ^~~~~~~~~ In file included from /usr/include/openssl/dsa.h:13, from /tmp/B.bUdaXr/BUILD/libssh-0.7.5/include/libssh/libcrypto.h:28, from /tmp/B.bUdaXr/BUILD/libssh-0.7.5/include/libssh/wrapper.h:26, from /tmp/B.bUdaXr/BUILD/libssh-0.7.5/include/libssh/packet.h:24, from /tmp/B.bUdaXr/BUILD/libssh-0.7.5/include/libssh/session.h:25, from /tmp/B.bUdaXr/BUILD/libssh-0.7.5/src/libcrypto.c:32: /usr/include/openssl/hmac.h:30:1: note: declared here DEPRECATEDIN_1_1_0(__owur int HMAC_Init(HMAC_CTX *ctx, const void *key, int len, ^~~~~~~~~~~~~~~~~~ /tmp/B.bUdaXr/BUILD/libssh-0.7.5/src/libcrypto.c:348:7: warning: 'HMAC_Init' is deprecated [-Wdeprecated-declarations] HMAC_Init(ctx, key, len, EVP_md5()); ^~~~~~~~~ In file included from /usr/include/openssl/dsa.h:13, from /tmp/B.bUdaXr/BUILD/libssh-0.7.5/include/libssh/libcrypto.h:28, from /tmp/B.bUdaXr/BUILD/libssh-0.7.5/include/libssh/wrapper.h:26, from /tmp/B.bUdaXr/BUILD/libssh-0.7.5/include/libssh/packet.h:24, from /tmp/B.bUdaXr/BUILD/libssh-0.7.5/include/libssh/session.h:25, from /tmp/B.bUdaXr/BUILD/libssh-0.7.5/src/libcrypto.c:32: /usr/include/openssl/hmac.h:30:1: note: declared here DEPRECATEDIN_1_1_0(__owur int HMAC_Init(HMAC_CTX *ctx, const void *key, int len, ^~~~~~~~~~~~~~~~~~ /tmp/B.bUdaXr/BUILD/libssh-0.7.5/src/libcrypto.c: In function 'hmac_final': /tmp/B.bUdaXr/BUILD/libssh-0.7.5/src/libcrypto.c:366:3: error: implicit declaration of function 'HMAC_CTX_cleanup'; did you mean 'HMAC_CTX_get_md'? [-Wimplicit-function-declaration] HMAC_CTX_cleanup(ctx); ^~~~~~~~~~~~~~~~ HMAC_CTX_get_md /tmp/B.bUdaXr/BUILD/libssh-0.7.5/src/libcrypto.c: In function 'aes_ctr128_encrypt': /tmp/B.bUdaXr/BUILD/libssh-0.7.5/src/libcrypto.c:458:3: error: implicit declaration of function 'AES_ctr128_encrypt'; did you mean 'AES_cfb128_encrypt'? [-Wimplicit-function-declaration] AES_ctr128_encrypt(in, out, len, cipher->key, cipher->IV, tmp_buffer, &num); ^~~~~~~~~~~~~~~~~~ AES_cfb128_encrypt make[2]: *** [src/CMakeFiles/ssh_shared.dir/build.make:313: src/CMakeFiles/ssh_shared.dir/libcrypto.c.o] Error 1 make[2]: Leaving directory '/tmp/B.bUdaXr/BUILD/libssh-0.7.5/build' make[2]: *** Waiting for unfinished jobs.... make[2]: Entering directory '/tmp/B.bUdaXr/BUILD/libssh-0.7.5/build' [ 19%] Building C object src/CMakeFiles/ssh_shared.dir/match.c.o cd /tmp/B.bUdaXr/BUILD/libssh-0.7.5/build/src && /usr/bin/i686-pld-linux-gcc -DLIBSSH_EXPORTS -I/tmp/B.bUdaXr/BUILD/libssh-0.7.5/build/src -I/tmp/B.bUdaXr/BUILD/libssh-0.7.5/src -I/tmp/B.bUdaXr/BUILD/libssh-0.7.5/include -I/tmp/B.bUdaXr/BUILD/libssh-0.7.5/build -std=gnu99 -pedantic -pedantic-errors -Wall -Wextra -Wshadow -Wmissing-prototypes -Wdeclaration-after-statement -Wunused -Wfloat-equal -Wpointer-arith -Wwrite-strings -Wformat-security -Wmissing-format-attribute -fPIC -fstack-protector -D_LARGEFILE_SOURCE -D_FILE_OFFSET_BITS=64 -O2 -fwrapv -pipe -Wformat -Werror=format-security -gdwarf-4 -fno-debug-types-section -fvar-tracking-assignments -g2 -Wp,-D_FORTIFY_SOURCE=2 -fstack-protector-strong --param=ssp-buffer-size=4 -fomit-frame-pointer -march=i686 -fasynchronous-unwind-tables -mtune=pentium4 -gdwarf-4 -fno-debug-types-section -fvar-tracking-assignments -g2 -DNDEBUG -DQT_NO_DEBUG -fPIC -fvisibility=hidden -o CMakeFiles/ssh_shared.dir/match.c.o -c /tmp/B.bUdaXr/BUILD/libssh-0.7.5/src/match.c make[2]: Leaving directory '/tmp/B.bUdaXr/BUILD/libssh-0.7.5/build' make[2]: Entering directory '/tmp/B.bUdaXr/BUILD/libssh-0.7.5/build' [ 11%] Building C object src/CMakeFiles/ssh_shared.dir/dh.c.o cd /tmp/B.bUdaXr/BUILD/libssh-0.7.5/build/src && /usr/bin/i686-pld-linux-gcc -DLIBSSH_EXPORTS -I/tmp/B.bUdaXr/BUILD/libssh-0.7.5/build/src -I/tmp/B.bUdaXr/BUILD/libssh-0.7.5/src -I/tmp/B.bUdaXr/BUILD/libssh-0.7.5/include -I/tmp/B.bUdaXr/BUILD/libssh-0.7.5/build -std=gnu99 -pedantic -pedantic-errors -Wall -Wextra -Wshadow -Wmissing-prototypes -Wdeclaration-after-statement -Wunused -Wfloat-equal -Wpointer-arith -Wwrite-strings -Wformat-security -Wmissing-format-attribute -fPIC -fstack-protector -D_LARGEFILE_SOURCE -D_FILE_OFFSET_BITS=64 -O2 -fwrapv -pipe -Wformat -Werror=format-security -gdwarf-4 -fno-debug-types-section -fvar-tracking-assignments -g2 -Wp,-D_FORTIFY_SOURCE=2 -fstack-protector-strong --param=ssp-buffer-size=4 -fomit-frame-pointer -march=i686 -fasynchronous-unwind-tables -mtune=pentium4 -gdwarf-4 -fno-debug-types-section -fvar-tracking-assignments -g2 -DNDEBUG -DQT_NO_DEBUG -fPIC -fvisibility=hidden -o CMakeFiles/ssh_shared.dir/dh.c.o -c /tmp/B.bUdaXr/BUILD/libssh-0.7.5/src/dh.c /tmp/B.bUdaXr/BUILD/libssh-0.7.5/src/dh.c: In function 'ssh_get_random': /tmp/B.bUdaXr/BUILD/libssh-0.7.5/src/dh.c:137:5: warning: 'RAND_pseudo_bytes' is deprecated [-Wdeprecated-declarations] return RAND_pseudo_bytes(where,len); ^~~~~~ In file included from /usr/include/openssl/dsa.h:13, from /tmp/B.bUdaXr/BUILD/libssh-0.7.5/include/libssh/libcrypto.h:28, from /tmp/B.bUdaXr/BUILD/libssh-0.7.5/include/libssh/wrapper.h:26, from /tmp/B.bUdaXr/BUILD/libssh-0.7.5/include/libssh/crypto.h:33, from /tmp/B.bUdaXr/BUILD/libssh-0.7.5/src/dh.c:56: /usr/include/openssl/rand.h:44:1: note: declared here DEPRECATEDIN_1_1_0(int RAND_pseudo_bytes(unsigned char *buf, int num)) ^~~~~~~~~~~~~~~~~~ make[2]: Leaving directory '/tmp/B.bUdaXr/BUILD/libssh-0.7.5/build' make[2]: Entering directory '/tmp/B.bUdaXr/BUILD/libssh-0.7.5/build' [ 16%] Building C object src/CMakeFiles/ssh_shared.dir/kex.c.o cd /tmp/B.bUdaXr/BUILD/libssh-0.7.5/build/src && /usr/bin/i686-pld-linux-gcc -DLIBSSH_EXPORTS -I/tmp/B.bUdaXr/BUILD/libssh-0.7.5/build/src -I/tmp/B.bUdaXr/BUILD/libssh-0.7.5/src -I/tmp/B.bUdaXr/BUILD/libssh-0.7.5/include -I/tmp/B.bUdaXr/BUILD/libssh-0.7.5/build -std=gnu99 -pedantic -pedantic-errors -Wall -Wextra -Wshadow -Wmissing-prototypes -Wdeclaration-after-statement -Wunused -Wfloat-equal -Wpointer-arith -Wwrite-strings -Wformat-security -Wmissing-format-attribute -fPIC -fstack-protector -D_LARGEFILE_SOURCE -D_FILE_OFFSET_BITS=64 -O2 -fwrapv -pipe -Wformat -Werror=format-security -gdwarf-4 -fno-debug-types-section -fvar-tracking-assignments -g2 -Wp,-D_FORTIFY_SOURCE=2 -fstack-protector-strong --param=ssp-buffer-size=4 -fomit-frame-pointer -march=i686 -fasynchronous-unwind-tables -mtune=pentium4 -gdwarf-4 -fno-debug-types-section -fvar-tracking-assignments -g2 -DNDEBUG -DQT_NO_DEBUG -fPIC -fvisibility=hidden -o CMakeFiles/ssh_shared.dir/kex.c.o -c /tmp/B.bUdaXr/BUILD/libssh-0.7.5/src/kex.c make[2]: Leaving directory '/tmp/B.bUdaXr/BUILD/libssh-0.7.5/build' make[2]: Entering directory '/tmp/B.bUdaXr/BUILD/libssh-0.7.5/build' [ 21%] Building C object src/CMakeFiles/ssh_shared.dir/log.c.o cd /tmp/B.bUdaXr/BUILD/libssh-0.7.5/build/src && /usr/bin/i686-pld-linux-gcc -DLIBSSH_EXPORTS -I/tmp/B.bUdaXr/BUILD/libssh-0.7.5/build/src -I/tmp/B.bUdaXr/BUILD/libssh-0.7.5/src -I/tmp/B.bUdaXr/BUILD/libssh-0.7.5/include -I/tmp/B.bUdaXr/BUILD/libssh-0.7.5/build -std=gnu99 -pedantic -pedantic-errors -Wall -Wextra -Wshadow -Wmissing-prototypes -Wdeclaration-after-statement -Wunused -Wfloat-equal -Wpointer-arith -Wwrite-strings -Wformat-security -Wmissing-format-attribute -fPIC -fstack-protector -D_LARGEFILE_SOURCE -D_FILE_OFFSET_BITS=64 -O2 -fwrapv -pipe -Wformat -Werror=format-security -gdwarf-4 -fno-debug-types-section -fvar-tracking-assignments -g2 -Wp,-D_FORTIFY_SOURCE=2 -fstack-protector-strong --param=ssp-buffer-size=4 -fomit-frame-pointer -march=i686 -fasynchronous-unwind-tables -mtune=pentium4 -gdwarf-4 -fno-debug-types-section -fvar-tracking-assignments -g2 -DNDEBUG -DQT_NO_DEBUG -fPIC -fvisibility=hidden -o CMakeFiles/ssh_shared.dir/log.c.o -c /tmp/B.bUdaXr/BUILD/libssh-0.7.5/src/log.c /tmp/B.bUdaXr/BUILD/libssh-0.7.5/src/log.c: In function 'ssh_log_function': /tmp/B.bUdaXr/BUILD/libssh-0.7.5/src/log.c:68:32: warning: '%06ld' directive output may be truncated writing between 6 and 11 bytes into a region of size between 0 and 63 [-Wformat-truncation=] snprintf(buf, len, "%s.%06ld", tbuf, (long)tv.tv_usec); ^~~~~ In file included from /usr/include/stdio.h:873, from /tmp/B.bUdaXr/BUILD/libssh-0.7.5/src/log.c:24: /usr/include/bits/stdio2.h:67:10: note: '__builtin___snprintf_chk' output between 8 and 76 bytes into a destination of size 64 return __builtin___snprintf_chk (__s, __n, __USE_FORTIFY_LEVEL - 1, ^~~~~~~~~~~~~~~~~~~~~~~~~~~~~~~~~~~~~~~~~~~~~~~~~~~~~~~~~~~~ __bos (__s), __fmt, __va_arg_pack ()); ~~~~~~~~~~~~~~~~~~~~~~~~~~~~~~~~~~~~~ make[2]: Leaving directory '/tmp/B.bUdaXr/BUILD/libssh-0.7.5/build' make[2]: Entering directory '/tmp/B.bUdaXr/BUILD/libssh-0.7.5/build' [ 16%] Building C object src/CMakeFiles/ssh_shared.dir/known_hosts.c.o cd /tmp/B.bUdaXr/BUILD/libssh-0.7.5/build/src && /usr/bin/i686-pld-linux-gcc -DLIBSSH_EXPORTS -I/tmp/B.bUdaXr/BUILD/libssh-0.7.5/build/src -I/tmp/B.bUdaXr/BUILD/libssh-0.7.5/src -I/tmp/B.bUdaXr/BUILD/libssh-0.7.5/include -I/tmp/B.bUdaXr/BUILD/libssh-0.7.5/build -std=gnu99 -pedantic -pedantic-errors -Wall -Wextra -Wshadow -Wmissing-prototypes -Wdeclaration-after-statement -Wunused -Wfloat-equal -Wpointer-arith -Wwrite-strings -Wformat-security -Wmissing-format-attribute -fPIC -fstack-protector -D_LARGEFILE_SOURCE -D_FILE_OFFSET_BITS=64 -O2 -fwrapv -pipe -Wformat -Werror=format-security -gdwarf-4 -fno-debug-types-section -fvar-tracking-assignments -g2 -Wp,-D_FORTIFY_SOURCE=2 -fstack-protector-strong --param=ssp-buffer-size=4 -fomit-frame-pointer -march=i686 -fasynchronous-unwind-tables -mtune=pentium4 -gdwarf-4 -fno-debug-types-section -fvar-tracking-assignments -g2 -DNDEBUG -DQT_NO_DEBUG -fPIC -fvisibility=hidden -o CMakeFiles/ssh_shared.dir/known_hosts.c.o -c /tmp/B.bUdaXr/BUILD/libssh-0.7.5/src/known_hosts.c make[2]: Leaving directory '/tmp/B.bUdaXr/BUILD/libssh-0.7.5/build' make[2]: Entering directory '/tmp/B.bUdaXr/BUILD/libssh-0.7.5/build' [ 17%] Building C object src/CMakeFiles/ssh_shared.dir/legacy.c.o cd /tmp/B.bUdaXr/BUILD/libssh-0.7.5/build/src && /usr/bin/i686-pld-linux-gcc -DLIBSSH_EXPORTS -I/tmp/B.bUdaXr/BUILD/libssh-0.7.5/build/src -I/tmp/B.bUdaXr/BUILD/libssh-0.7.5/src -I/tmp/B.bUdaXr/BUILD/libssh-0.7.5/include -I/tmp/B.bUdaXr/BUILD/libssh-0.7.5/build -std=gnu99 -pedantic -pedantic-errors -Wall -Wextra -Wshadow -Wmissing-prototypes -Wdeclaration-after-statement -Wunused -Wfloat-equal -Wpointer-arith -Wwrite-strings -Wformat-security -Wmissing-format-attribute -fPIC -fstack-protector -D_LARGEFILE_SOURCE -D_FILE_OFFSET_BITS=64 -O2 -fwrapv -pipe -Wformat -Werror=format-security -gdwarf-4 -fno-debug-types-section -fvar-tracking-assignments -g2 -Wp,-D_FORTIFY_SOURCE=2 -fstack-protector-strong --param=ssp-buffer-size=4 -fomit-frame-pointer -march=i686 -fasynchronous-unwind-tables -mtune=pentium4 -gdwarf-4 -fno-debug-types-section -fvar-tracking-assignments -g2 -DNDEBUG -DQT_NO_DEBUG -fPIC -fvisibility=hidden -o CMakeFiles/ssh_shared.dir/legacy.c.o -c /tmp/B.bUdaXr/BUILD/libssh-0.7.5/src/legacy.c make[2]: Leaving directory '/tmp/B.bUdaXr/BUILD/libssh-0.7.5/build' make[2]: Entering directory '/tmp/B.bUdaXr/BUILD/libssh-0.7.5/build' [ 6%] Building C object src/CMakeFiles/ssh_shared.dir/channels.c.o cd /tmp/B.bUdaXr/BUILD/libssh-0.7.5/build/src && /usr/bin/i686-pld-linux-gcc -DLIBSSH_EXPORTS -I/tmp/B.bUdaXr/BUILD/libssh-0.7.5/build/src -I/tmp/B.bUdaXr/BUILD/libssh-0.7.5/src -I/tmp/B.bUdaXr/BUILD/libssh-0.7.5/include -I/tmp/B.bUdaXr/BUILD/libssh-0.7.5/build -std=gnu99 -pedantic -pedantic-errors -Wall -Wextra -Wshadow -Wmissing-prototypes -Wdeclaration-after-statement -Wunused -Wfloat-equal -Wpointer-arith -Wwrite-strings -Wformat-security -Wmissing-format-attribute -fPIC -fstack-protector -D_LARGEFILE_SOURCE -D_FILE_OFFSET_BITS=64 -O2 -fwrapv -pipe -Wformat -Werror=format-security -gdwarf-4 -fno-debug-types-section -fvar-tracking-assignments -g2 -Wp,-D_FORTIFY_SOURCE=2 -fstack-protector-strong --param=ssp-buffer-size=4 -fomit-frame-pointer -march=i686 -fasynchronous-unwind-tables -mtune=pentium4 -gdwarf-4 -fno-debug-types-section -fvar-tracking-assignments -g2 -DNDEBUG -DQT_NO_DEBUG -fPIC -fvisibility=hidden -o CMakeFiles/ssh_shared.dir/channels.c.o -c /tmp/B.bUdaXr/BUILD/libssh-0.7.5/src/channels.c make[2]: Leaving directory '/tmp/B.bUdaXr/BUILD/libssh-0.7.5/build' make[2]: Entering directory '/tmp/B.bUdaXr/BUILD/libssh-0.7.5/build' [ 20%] Building C object src/CMakeFiles/ssh_shared.dir/messages.c.o cd /tmp/B.bUdaXr/BUILD/libssh-0.7.5/build/src && /usr/bin/i686-pld-linux-gcc -DLIBSSH_EXPORTS -I/tmp/B.bUdaXr/BUILD/libssh-0.7.5/build/src -I/tmp/B.bUdaXr/BUILD/libssh-0.7.5/src -I/tmp/B.bUdaXr/BUILD/libssh-0.7.5/include -I/tmp/B.bUdaXr/BUILD/libssh-0.7.5/build -std=gnu99 -pedantic -pedantic-errors -Wall -Wextra -Wshadow -Wmissing-prototypes -Wdeclaration-after-statement -Wunused -Wfloat-equal -Wpointer-arith -Wwrite-strings -Wformat-security -Wmissing-format-attribute -fPIC -fstack-protector -D_LARGEFILE_SOURCE -D_FILE_OFFSET_BITS=64 -O2 -fwrapv -pipe -Wformat -Werror=format-security -gdwarf-4 -fno-debug-types-section -fvar-tracking-assignments -g2 -Wp,-D_FORTIFY_SOURCE=2 -fstack-protector-strong --param=ssp-buffer-size=4 -fomit-frame-pointer -march=i686 -fasynchronous-unwind-tables -mtune=pentium4 -gdwarf-4 -fno-debug-types-section -fvar-tracking-assignments -g2 -DNDEBUG -DQT_NO_DEBUG -fPIC -fvisibility=hidden -o CMakeFiles/ssh_shared.dir/messages.c.o -c /tmp/B.bUdaXr/BUILD/libssh-0.7.5/src/messages.c make[2]: Leaving directory '/tmp/B.bUdaXr/BUILD/libssh-0.7.5/build' make[1]: *** [CMakeFiles/Makefile2:210: src/CMakeFiles/ssh_shared.dir/all] Error 2 make: *** [Makefile:155: all] Error 2 error: Bad exit status from /tmp/B.bUdaXr/BUILD/tmp/rpm-tmp.59450 (%build) RPM build errors: Bad exit status from /tmp/B.bUdaXr/BUILD/tmp/rpm-tmp.59450 (%build) ended at: Fri Sep 14 20:33:00 2018, done in 0:00:09.208392 error: No files produced. + chmod -R u+rwX /tmp/B.bUdaXr/BUILD + rm -rf /tmp/B.bUdaXr/tmp /tmp/B.bUdaXr/BUILD + rm -rf /tmp/B.bUdaXr Begin-PLD-Builder-Info Build-Time: user:11.88s sys:2.43s real:11.87s (faults io:0 non-io:530518) End-PLD-Builder-Info
[Back to list of logs] [View rpm -qa of builder]