FailedOk

th/SRPMS[OK]
th/x32[OK]
th/i686[OK]
th/x86_64[OK]

ac/SRPMS[OK]
ac/i386[OK]
ac/i586[OK]
ac/i686[OK]
ac/alpha[OK]
ac/amd64[OK]
ac/athlon[OK]
ac/ppc[OK]
ac/sparc[OK]
ac/sparc64[OK]

Advanced Search
main()
Powered by PLD Linux
(c) 2002-2017 PLD Team
$Revision: 1.37 $
Powered by Linus.
Your IP: 23.20.103.97

lin_tape c305dc54-0d71-4c5e-8950-4235c0546490

Status:Failed
Source URL:ftp://buildlogs.pld-linux.org/th/i686/FAIL/lin_tape,c305dc54-0d71-4c5e-8950-4235c0546490.bz2
text/plain URL:View!
full text:View!
rpm -qa of builder:View!
Date:2017/07/31 19:40:53
Runtime:0:00:07.692939

Toc:

  • error 1
  • /tmp/B.VuQkmc/BUILD/lin_tape-3.0.18/lin_tape_ioctl_tape.c:6557:5: error: 'struct request' has no member named 'retries'
  • error 2
  • /tmp/B.VuQkmc/BUILD/lin_tape-3.0.18/lin_tape_ioctl_tape.c:6566:19: error: 'struct request' has no member named 'errors'
  • error 3
  • /tmp/B.VuQkmc/BUILD/lin_tape-3.0.18/lower.c:571:4: error: 'struct request' has no member named 'retries'
  • error 4
  • /tmp/B.VuQkmc/BUILD/lin_tape-3.0.18/lower.c:592:22: error: 'struct request' has no member named 'errors'
  • error 5
  • error: Bad exit status from /tmp/B.VuQkmc/BUILD/tmp/rpm-tmp.8279 (%build)
  • error 6
  • RPM build errors:
  • error 7
  • error: No files produced.

Content:

- rel 3

* Sat Jan 21 2017 Jan Rękorajski <baggins@pld-linux.org> 6f6082f
- fix building with linux 4.9 - rel 2 + rpm -Uhv --nodeps --define '_topdir /tmp/B.VuQkmc' --define '_specdir %{_topdir}' --define '_sourcedir %{_specdir}' --define '_rpmdir %{_topdir}/RPMS' --define '_builddir %{_topdir}/BUILD' --without userspace --define 'build_kernels head,4.9,4.4,4.1' lin_tape-3.0.18-1@4.12.4_1.src.rpm Preparing... ################################################## lin_tape ################################################## + rm -f lin_tape-3.0.18-1@4.12.4_1.src.rpm + install -m 700 -d /tmp/B.VuQkmc/BUILD/tmp + TMPDIR=/tmp/B.VuQkmc/BUILD/tmp + exec nice -n 0 rpmbuild -bp --short-circuit --nodeps --define '_topdir /tmp/B.VuQkmc' --define '_specdir %{_topdir}' --define '_sourcedir %{_specdir}' --define '_rpmdir %{_topdir}/RPMS' --define '_builddir %{_topdir}/BUILD' --without userspace --target i686-pld-linux --define 'build_kernels head,4.9,4.4,4.1' --define 'prep exit 0' /tmp/B.VuQkmc/lin_tape.spec Building target platforms: i686-pld-linux checking BuildConflict-ing packages no BuildConflicts found checking BR rpm: Building target platforms: i686-pld-linux no BR needed building RPM using: set -ex; : build-id: c305dc54-0d71-4c5e-8950-4235c0546490; TMPDIR=/tmp/B.VuQkmc/BUILD/tmp exec nice -n 0 rpmbuild -bb --define '_smp_mflags -j9' --define '_make_opts -Otarget' --define '_pld_builder 1' --define '_topdir /tmp/B.VuQkmc' --define '_specdir %{_topdir}' --define '_sourcedir %{_specdir}' --define '_rpmdir %{_topdir}/RPMS' --define '_builddir %{_topdir}/BUILD' --without userspace --target i686-pld-linux --define 'build_kernels head,4.9,4.4,4.1' /tmp/B.VuQkmc/lin_tape.spec + : build-id: c305dc54-0d71-4c5e-8950-4235c0546490 + TMPDIR=/tmp/B.VuQkmc/BUILD/tmp + exec nice -n 0 rpmbuild -bb --define '_smp_mflags -j9' --define '_make_opts -Otarget' --define '_pld_builder 1' --define '_topdir /tmp/B.VuQkmc' --define '_specdir %{_topdir}' --define '_sourcedir %{_specdir}' --define '_rpmdir %{_topdir}/RPMS' --define '_builddir %{_topdir}/BUILD' --without userspace --target i686-pld-linux --define 'build_kernels head,4.9,4.4,4.1' /tmp/B.VuQkmc/lin_tape.spec Building target platforms: i686-pld-linux Executing(%prep): /bin/sh -e /tmp/B.VuQkmc/BUILD/tmp/rpm-tmp.8279 + umask 022 + cd /tmp/B.VuQkmc/BUILD + cd /tmp/B.VuQkmc/BUILD + rm -rf lin_tape-3.0.18 + /usr/bin/gzip -dc /tmp/B.VuQkmc/lin_tape-3.0.18.tgz + /bin/tar -xf - + STATUS=0 + '[' 0 -ne 0 ']' + cd lin_tape-3.0.18 + /bin/id -u + '[' 1001 '=' 0 ']' + /bin/id -u + '[' 1001 '=' 0 ']' + /bin/chmod -Rf a+rX,u+w,g-w,o-w . + /bin/sed -i -e 's,\r$,,' Makefile + echo 'Patch #0 (use-module-dir.patch):' Patch #0 (use-module-dir.patch): + '[' -f /tmp/B.VuQkmc/use-module-dir.patch ']' + /bin/cat /tmp/B.VuQkmc/use-module-dir.patch + /usr/bin/patch -s -p1 + echo 'Patch #1 (clean-ifdefs.patch):' Patch #1 (clean-ifdefs.patch): + '[' -f /tmp/B.VuQkmc/clean-ifdefs.patch ']' + /bin/cat /tmp/B.VuQkmc/clean-ifdefs.patch + /usr/bin/patch -s -p1 + echo 'Patch #2 (linux-4.9.patch):' Patch #2 (linux-4.9.patch): + '[' -f /tmp/B.VuQkmc/linux-4.9.patch ']' + /bin/cat /tmp/B.VuQkmc/linux-4.9.patch + /usr/bin/patch -s -p1 + echo 'Patch #3 (linux-4.10.patch):' Patch #3 (linux-4.10.patch): + '[' -f /tmp/B.VuQkmc/linux-4.10.patch ']' + /bin/cat /tmp/B.VuQkmc/linux-4.10.patch + /usr/bin/patch -s -p1 + echo 'Patch #4 (linux-4.11.patch):' Patch #4 (linux-4.11.patch): + '[' -f /tmp/B.VuQkmc/linux-4.11.patch ']' + /usr/bin/patch -s -p1 + /bin/cat /tmp/B.VuQkmc/linux-4.11.patch + install -p /tmp/B.VuQkmc/lin_tape.fixlist . + exit 0 Executing(%build): /bin/sh -e /tmp/B.VuQkmc/BUILD/tmp/rpm-tmp.8279 TMP=/home/users/builder/tmp HOME=/home/users/builder PATH=/home/users/builder/GNUstep/Tools:/usr/local/bin:/usr/bin:/bin:/home/users/builder/bin TMPDIR=/tmp/B.VuQkmc/BUILD/tmp + umask 022 + cd /tmp/B.VuQkmc/BUILD + cd lin_tape-3.0.18 + compile + typeset 'L=<' PATCH_SH + set -e -x + '[' -r /usr/src/linux/.config ']' + rm -rf o + install -d o/include/linux o/include/generated o/arch/x86/include o/arch/powerpc/lib + ln -sf /usr/src/linux/.config o/.config + ln -sf /usr/src/linux/Module.symvers o/Module.symvers + '[' -f /usr/src/linux/include/generated/autoconf.h ']' + ln -sf /usr/src/linux/include/generated/autoconf.h o/include/generated/autoconf.h + ln -s ../generated/autoconf.h o/include/linux/autoconf.h + '[' -d /usr/src/linux/arch/x86/include/generated ']' + ln -s /usr/src/linux/arch/x86/include/generated o/arch/x86/include + set +x + install -d o/include/config + touch o/include/config/MARKER + ln -sf /usr/src/linux/include/config/auto.conf o/include/config/auto.conf + ln -sf /usr/src/linux/scripts o/scripts + /usr/bin/make -Otarget -j9 -C /usr/src/linux clean 'RCS_FIND_IGNORE=-name '\''*.[ks]o'\'' -o' 'M=/tmp/B.VuQkmc/BUILD/lin_tape-3.0.18' 'HOSTCC=i686-pld-linux-gcc' 'SYSSRC=/usr/src/linux' 'SYSOUT=/tmp/B.VuQkmc/BUILD/lin_tape-3.0.18/o' 'CC=i686-pld-linux-gcc' + /usr/bin/make -Otarget -j9 -C /usr/src/linux modules 'M=/tmp/B.VuQkmc/BUILD/lin_tape-3.0.18' 'CONSTIFY_PLUGIN=' 'HOSTCC=i686-pld-linux-gcc' 'SYSSRC=/usr/src/linux' 'SYSOUT=/tmp/B.VuQkmc/BUILD/lin_tape-3.0.18/o' 'CC=i686-pld-linux-gcc' CC [M] /tmp/B.VuQkmc/BUILD/lin_tape-3.0.18/fo_util.o CC [M] /tmp/B.VuQkmc/BUILD/lin_tape-3.0.18/lin_tape_scsi_trace.o CC [M] /tmp/B.VuQkmc/BUILD/lin_tape-3.0.18/lin_tape_ioctl_tape.o /tmp/B.VuQkmc/BUILD/lin_tape-3.0.18/lin_tape_ioctl_tape.c: In function 'lin_tape_blk_rq': /tmp/B.VuQkmc/BUILD/lin_tape-3.0.18/lin_tape_ioctl_tape.c:6557:5: error: 'struct request' has no member named 'retries' req->retries = 0; ^~ /tmp/B.VuQkmc/BUILD/lin_tape-3.0.18/lin_tape_ioctl_tape.c:6566:19: error: 'struct request' has no member named 'errors' status_code = req->errors; ^~ make[1]: *** [scripts/Makefile.build:302: /tmp/B.VuQkmc/BUILD/lin_tape-3.0.18/lin_tape_ioctl_tape.o] Error 1 make[1]: *** Waiting for unfinished jobs.... CC [M] /tmp/B.VuQkmc/BUILD/lin_tape-3.0.18/join.o CC [M] /tmp/B.VuQkmc/BUILD/lin_tape-3.0.18/resolve_ibm_hp.o CC [M] /tmp/B.VuQkmc/BUILD/lin_tape-3.0.18/lower.o /tmp/B.VuQkmc/BUILD/lin_tape-3.0.18/lower.c: In function 'lower_scsi_execute': /tmp/B.VuQkmc/BUILD/lin_tape-3.0.18/lower.c:571:4: error: 'struct request' has no member named 'retries' rq->retries = pfo_cmd->retries; ^~ /tmp/B.VuQkmc/BUILD/lin_tape-3.0.18/lower.c:592:22: error: 'struct request' has no member named 'errors' pfo_cmd->errors = rq->errors; ^~ make[1]: *** [scripts/Makefile.build:302: /tmp/B.VuQkmc/BUILD/lin_tape-3.0.18/lower.o] Error 1 CC [M] /tmp/B.VuQkmc/BUILD/lin_tape-3.0.18/lin_tape_extra_ioctl.o CC [M] /tmp/B.VuQkmc/BUILD/lin_tape-3.0.18/upper.o CC [M] /tmp/B.VuQkmc/BUILD/lin_tape-3.0.18/lin_tape_ioctl_changer.o CC [M] /tmp/B.VuQkmc/BUILD/lin_tape-3.0.18/lin_tape_scsi_config.o CC [M] /tmp/B.VuQkmc/BUILD/lin_tape-3.0.18/lin_tape_scsi_tape.o make: *** [Makefile:1515: _module_/tmp/B.VuQkmc/BUILD/lin_tape-3.0.18] Error 2 error: Bad exit status from /tmp/B.VuQkmc/BUILD/tmp/rpm-tmp.8279 (%build) RPM build errors: Bad exit status from /tmp/B.VuQkmc/BUILD/tmp/rpm-tmp.8279 (%build) ended at: Mon Jul 31 19:40:53 2017, done in 0:00:07.692939 error: No files produced. + chmod -R u+rwX /tmp/B.VuQkmc/BUILD + rm -rf /tmp/B.VuQkmc/tmp /tmp/B.VuQkmc/BUILD + rm -rf /tmp/B.VuQkmc Begin-PLD-Builder-Info Build-Time: user:15.68s sys:1.43s real:17.39s (faults io:0 non-io:539823) End-PLD-Builder-Info
[Back to list of logs] [View rpm -qa of builder]