FailedOk

th/SRPMS[OK]
th/x32[OK]
th/i686[OK]
th/x86_64[OK]

ac/SRPMS[OK]
ac/i386[OK]
ac/i586[OK]
ac/i686[OK]
ac/alpha[OK]
ac/amd64[OK]
ac/athlon[OK]
ac/ppc[OK]
ac/sparc[OK]
ac/sparc64[OK]

Advanced Search
main()
Powered by PLD Linux
(c) 2002-2020 PLD Team
$Revision: 1.37 $
Powered by electricity.
Your IP: 3.89.87.12

lms 34c4aa16-1f41-4a8d-82ae-c933c70690d5

Status:Failed
Source URL:https://buildlogs.pld-linux.org/pld/th/i686/FAIL/lms,34c4aa16-1f41-4a8d-82ae-c933c70690d5.bz2
text/plain URL:View!
full text:View!
rpm -qa of builder:View!
Date:2020/10/08 21:10:17
Runtime:0:00:16.110198

Toc:

  • error 1
  • make[2]: *** No rule to make target 'lib/libtscript.a', needed by 'parser.so'. Stop.
  • error 2
  • make[3]: *** [<builtin>: tscript_parser.c] Error 1
  • error 3
  • tscript_exec.h:4:10: fatal error: tscript_context.h: No such file or directory
  • error 4
  • compilation terminated.
  • error 5
  • make[3]: *** [Makefile:14: tscript_exec.o] Error 1
  • error 6
  • tscript_string.h:4:10: fatal error: tscript_context.h: No such file or directory
  • error 7
  • compilation terminated.
  • error 8
  • make[3]: *** [Makefile:14: tscript_string.o] Error 1
  • error 9
  • sql.h:4:10: fatal error: tscript_context.h: No such file or directory
  • error 10
  • compilation terminated.
  • error 11
  • make[3]: *** [Makefile:14: sql.o] Error 1
  • error 12
  • tscript_sysinfo.h:4:10: fatal error: tscript_context.h: No such file or directory
  • error 13
  • compilation terminated.
  • error 14
  • make[3]: *** [Makefile:14: tscript_sysinfo.o] Error 1
  • error 15
  • tscript_file.h:4:10: fatal error: tscript_context.h: No such file or directory
  • error 16
  • compilation terminated.
  • error 17
  • make[3]: *** [Makefile:14: tscript_file.o] Error 1
  • error 18
  • parser.c:32:10: fatal error: tscript_context.h: No such file or directory
  • error 19
  • compilation terminated.
  • error 20
  • make[2]: *** [<builtin>: parser.o] Error 1
  • error 21
  • syslog.h:4:10: fatal error: tscript_context.h: No such file or directory
  • error 22
  • compilation terminated.
  • error 23
  • make[3]: *** [Makefile:14: syslog.o] Error 1
  • error 24
  • net.h:4:10: fatal error: tscript_context.h: No such file or directory
  • error 25
  • compilation terminated.
  • error 26
  • make[3]: *** [Makefile:14: net.o] Error 1
  • error 27
  • make[2]: *** [Makefile:20: ext] Error 2
  • error 28
  • make[2]: *** [Makefile:17: libs] Error 2
  • install
  • Executing(%install): /bin/sh -e /tmp/B.0mZ65d/BUILD/tmp/rpm-tmp.96948
  • error 29
  • error: Bad exit status from /tmp/B.0mZ65d/BUILD/tmp/rpm-tmp.96948 (%install)
  • error 30
  • RPM build errors:
  • error 31
  • error: No files produced.

Content:

gcc -shared ethers.o -o ethers.so -L/usr/lib -lmysqlclient -ldl 
rm -rf ethers.o
make[2]: Leaving directory '/tmp/B.0mZ65d/BUILD/lms/daemon/modules/ethers'
make[2]: Entering directory '/tmp/B.0mZ65d/BUILD/lms/daemon/modules/ewx-pt'
i686-pld-linux-gcc -O2 -fwrapv -pipe -Wformat -Werror=format-security -gdwarf-4 -fno-debug-types-section -fvar-tracking-assignments -g2 -Wp,-D_FORTIFY_SOURCE=2 -fstack-protector-strong --param=ssp-buffer-size=4 -Werror=trampolines -fomit-frame-pointer -march=i686 -fasynchronous-unwind-tables -mtune=pentium4 -gdwarf-4 -fno-debug-types-section -fvar-tracking-assignments -g2  -fPIC -DUSE_MYSQL -DLMS_LIB_DIR=\"/usr/lib/lms/\" -I../..   -c -o ewx-pt.o ewx-pt.c
ewx-pt.c: In function 'reload':
ewx-pt.c:204:2: warning: 'remote_port' is deprecated [-Wdeprecated-declarations]
  204 |  session.remote_port = ewx->port;   // destination port
      |  ^~~~~~~
In file included from /usr/include/net-snmp/definitions.h:22,
                 from /usr/include/net-snmp/net-snmp-includes.h:24,
                 from ewx-pt.h:2,
                 from ewx-pt.c:33:
/usr/include/net-snmp/types.h:307:21: note: declared here
  307 |     u_short         remote_port NETSNMP_ATTRIBUTE_DEPRECATED;
      |                     ^~~~~~~~~~~
make[2]: Leaving directory '/tmp/B.0mZ65d/BUILD/lms/daemon/modules/ewx-pt'
make[2]: Entering directory '/tmp/B.0mZ65d/BUILD/lms/daemon/modules/ewx-pt'
gcc -shared ewx-pt.o -o ewx-pt.so -L/usr/lib `net-snmp-config --ldflags` -lmysqlclient -ldl  `net-snmp-config --libs`
rm -rf ewx-pt.o
make[2]: Leaving directory '/tmp/B.0mZ65d/BUILD/lms/daemon/modules/ewx-pt'
make[2]: Entering directory '/tmp/B.0mZ65d/BUILD/lms/daemon/modules/ewx-stm'
i686-pld-linux-gcc -O2 -fwrapv -pipe -Wformat -Werror=format-security -gdwarf-4 -fno-debug-types-section -fvar-tracking-assignments -g2 -Wp,-D_FORTIFY_SOURCE=2 -fstack-protector-strong --param=ssp-buffer-size=4 -Werror=trampolines -fomit-frame-pointer -march=i686 -fasynchronous-unwind-tables -mtune=pentium4 -gdwarf-4 -fno-debug-types-section -fvar-tracking-assignments -g2  -fPIC -DUSE_MYSQL -DLMS_LIB_DIR=\"/usr/lib/lms/\" -I../..   -c -o ewx-stm.o ewx-stm.c
ewx-stm.c: In function 'reload':
ewx-stm.c:101:2: warning: 'remote_port' is deprecated [-Wdeprecated-declarations]
  101 |  session.remote_port = ewx->port;   // destination port
      |  ^~~~~~~
In file included from /usr/include/net-snmp/definitions.h:22,
                 from /usr/include/net-snmp/net-snmp-includes.h:24,
                 from ewx-stm.h:2,
                 from ewx-stm.c:34:
/usr/include/net-snmp/types.h:307:21: note: declared here
  307 |     u_short         remote_port NETSNMP_ATTRIBUTE_DEPRECATED;
      |                     ^~~~~~~~~~~
make[2]: Leaving directory '/tmp/B.0mZ65d/BUILD/lms/daemon/modules/ewx-stm'
make[2]: Entering directory '/tmp/B.0mZ65d/BUILD/lms/daemon/modules/ewx-stm'
gcc -shared ewx-stm.o -o ewx-stm.so -L/usr/lib `net-snmp-config --ldflags` -lmysqlclient -ldl  `net-snmp-config --libs` -lm
rm -rf ewx-stm.o
make[2]: Leaving directory '/tmp/B.0mZ65d/BUILD/lms/daemon/modules/ewx-stm'
make[2]: Entering directory '/tmp/B.0mZ65d/BUILD/lms/daemon/modules/ewx-stm-channels'
i686-pld-linux-gcc -O2 -fwrapv -pipe -Wformat -Werror=format-security -gdwarf-4 -fno-debug-types-section -fvar-tracking-assignments -g2 -Wp,-D_FORTIFY_SOURCE=2 -fstack-protector-strong --param=ssp-buffer-size=4 -Werror=trampolines -fomit-frame-pointer -march=i686 -fasynchronous-unwind-tables -mtune=pentium4 -gdwarf-4 -fno-debug-types-section -fvar-tracking-assignments -g2  -fPIC -DUSE_MYSQL -DLMS_LIB_DIR=\"/usr/lib/lms/\" -I../..   -c -o ewx-stm-channels.o ewx-stm-channels.c
ewx-stm-channels.c: In function 'reload':
ewx-stm-channels.c:101:2: warning: 'remote_port' is deprecated [-Wdeprecated-declarations]
  101 |  session.remote_port = ewx->port;   // destination port
      |  ^~~~~~~
In file included from /usr/include/net-snmp/definitions.h:22,
                 from /usr/include/net-snmp/net-snmp-includes.h:24,
                 from ewx-stm-channels.h:2,
                 from ewx-stm-channels.c:33:
/usr/include/net-snmp/types.h:307:21: note: declared here
  307 |     u_short         remote_port NETSNMP_ATTRIBUTE_DEPRECATED;
      |                     ^~~~~~~~~~~
make[2]: Leaving directory '/tmp/B.0mZ65d/BUILD/lms/daemon/modules/ewx-stm-channels'
make[2]: Entering directory '/tmp/B.0mZ65d/BUILD/lms/daemon/modules/ewx-stm-channels'
gcc -shared ewx-stm-channels.o -o ewx-stm-channels.so -L/usr/lib `net-snmp-config --ldflags` -lmysqlclient -ldl  `net-snmp-config --libs`
rm -rf ewx-stm-channels.o
make[2]: Leaving directory '/tmp/B.0mZ65d/BUILD/lms/daemon/modules/ewx-stm-channels'
make[2]: Entering directory '/tmp/B.0mZ65d/BUILD/lms/daemon/modules/ggnotify'
i686-pld-linux-gcc -O2 -fwrapv -pipe -Wformat -Werror=format-security -gdwarf-4 -fno-debug-types-section -fvar-tracking-assignments -g2 -Wp,-D_FORTIFY_SOURCE=2 -fstack-protector-strong --param=ssp-buffer-size=4 -Werror=trampolines -fomit-frame-pointer -march=i686 -fasynchronous-unwind-tables -mtune=pentium4 -gdwarf-4 -fno-debug-types-section -fvar-tracking-assignments -g2  -fPIC -DUSE_MYSQL -DLMS_LIB_DIR=\"/usr/lib/lms/\" -I../..   -c -o ggnotify.o ggnotify.c
make[2]: Leaving directory '/tmp/B.0mZ65d/BUILD/lms/daemon/modules/ggnotify'
make[2]: Entering directory '/tmp/B.0mZ65d/BUILD/lms/daemon/modules/ggnotify'
gcc -shared ggnotify.o -o ggnotify.so -L/usr/lib -L/usr/lib -lmysqlclient -ldl  -lgadu
rm -rf ggnotify.o
make[2]: Leaving directory '/tmp/B.0mZ65d/BUILD/lms/daemon/modules/ggnotify'
make[2]: Entering directory '/tmp/B.0mZ65d/BUILD/lms/daemon/modules/hostfile'
i686-pld-linux-gcc -O2 -fwrapv -pipe -Wformat -Werror=format-security -gdwarf-4 -fno-debug-types-section -fvar-tracking-assignments -g2 -Wp,-D_FORTIFY_SOURCE=2 -fstack-protector-strong --param=ssp-buffer-size=4 -Werror=trampolines -fomit-frame-pointer -march=i686 -fasynchronous-unwind-tables -mtune=pentium4 -gdwarf-4 -fno-debug-types-section -fvar-tracking-assignments -g2  -fPIC -DUSE_MYSQL -DLMS_LIB_DIR=\"/usr/lib/lms/\" -I../..   -c -o hostfile.o hostfile.c
hostfile.c: In function 'reload':
hostfile.c:470:3: warning: ignoring return value of 'system' declared with attribute 'warn_unused_result' [-Wunused-result]
  470 |   system(hm->command);
      |   ^~~~~~~~~~~~~~~~~~~
make[2]: Leaving directory '/tmp/B.0mZ65d/BUILD/lms/daemon/modules/hostfile'
make[2]: Entering directory '/tmp/B.0mZ65d/BUILD/lms/daemon/modules/hostfile'
gcc -shared hostfile.o -o hostfile.so -L/usr/lib -lmysqlclient -ldl 
rm -rf hostfile.o
make[2]: Leaving directory '/tmp/B.0mZ65d/BUILD/lms/daemon/modules/hostfile'
make[2]: Entering directory '/tmp/B.0mZ65d/BUILD/lms/daemon/modules/notify'
i686-pld-linux-gcc -O2 -fwrapv -pipe -Wformat -Werror=format-security -gdwarf-4 -fno-debug-types-section -fvar-tracking-assignments -g2 -Wp,-D_FORTIFY_SOURCE=2 -fstack-protector-strong --param=ssp-buffer-size=4 -Werror=trampolines -fomit-frame-pointer -march=i686 -fasynchronous-unwind-tables -mtune=pentium4 -gdwarf-4 -fno-debug-types-section -fvar-tracking-assignments -g2  -fPIC -DUSE_MYSQL -DLMS_LIB_DIR=\"/usr/lib/lms/\" -I../..   -c -o notify.o notify.c
notify.c: In function 'reload':
notify.c:174:6: warning: ignoring return value of 'system' declared with attribute 'warn_unused_result' [-Wunused-result]
  174 |      system(command);
      |      ^~~~~~~~~~~~~~~
make[2]: Leaving directory '/tmp/B.0mZ65d/BUILD/lms/daemon/modules/notify'
make[2]: Entering directory '/tmp/B.0mZ65d/BUILD/lms/daemon/modules/notify'
gcc -shared notify.o -o notify.so -L/usr/lib -lmysqlclient -ldl 
rm -rf notify.o
make[2]: Leaving directory '/tmp/B.0mZ65d/BUILD/lms/daemon/modules/notify'
make[2]: Entering directory '/tmp/B.0mZ65d/BUILD/lms/daemon/modules/oident'
i686-pld-linux-gcc -O2 -fwrapv -pipe -Wformat -Werror=format-security -gdwarf-4 -fno-debug-types-section -fvar-tracking-assignments -g2 -Wp,-D_FORTIFY_SOURCE=2 -fstack-protector-strong --param=ssp-buffer-size=4 -Werror=trampolines -fomit-frame-pointer -march=i686 -fasynchronous-unwind-tables -mtune=pentium4 -gdwarf-4 -fno-debug-types-section -fvar-tracking-assignments -g2  -fPIC -DUSE_MYSQL -DLMS_LIB_DIR=\"/usr/lib/lms/\" -I../..   -c -o oident.o oident.c
oident.c: In function 'reload':
oident.c:123:3: warning: ignoring return value of 'system' declared with attribute 'warn_unused_result' [-Wunused-result]
  123 |   system(o->command);
      |   ^~~~~~~~~~~~~~~~~~
make[2]: Leaving directory '/tmp/B.0mZ65d/BUILD/lms/daemon/modules/oident'
make[2]: Entering directory '/tmp/B.0mZ65d/BUILD/lms/daemon/modules/oident'
gcc -shared oident.o -o oident.so -L/usr/lib -lmysqlclient -ldl 
rm -rf oident.o
make[2]: Leaving directory '/tmp/B.0mZ65d/BUILD/lms/daemon/modules/oident'
/usr/bin/make -C lib
/usr/bin/make -C extensions
make[2]: *** No rule to make target 'lib/libtscript.a', needed by 'parser.so'.  Stop.
make[2]: *** Waiting for unfinished jobs....
make[3]: Circular tscript_parser.h <- tscript_parser.h dependency dropped.
make[3]: Entering directory '/tmp/B.0mZ65d/BUILD/lms/daemon/modules/parser/lib'
yacc  tscript_parser.y 
yacc: e - line 45 of "tscript_parser.y", syntax error
%error-verbose
^
make[3]: *** [<builtin>: tscript_parser.c] Error 1
make[3]: Leaving directory '/tmp/B.0mZ65d/BUILD/lms/daemon/modules/parser/lib'
make[3]: *** Waiting for unfinished jobs....
make[3]: Entering directory '/tmp/B.0mZ65d/BUILD/lms/daemon/modules/parser/extensions'
gcc -c tscript_exec.c -O2 -fwrapv -pipe -Wformat -Werror=format-security -gdwarf-4 -fno-debug-types-section -fvar-tracking-assignments -g2 -Wp,-D_FORTIFY_SOURCE=2 -fstack-protector-strong --param=ssp-buffer-size=4 -Werror=trampolines -fomit-frame-pointer -march=i686 -fasynchronous-unwind-tables -mtune=pentium4 -gdwarf-4 -fno-debug-types-section -fvar-tracking-assignments -g2  -fPIC -DUSE_MYSQL -DLMS_LIB_DIR=\"/usr/lib/lms/\" -I../..
In file included from tscript_exec.c:32:
tscript_exec.h:4:10: fatal error: tscript_context.h: No such file or directory
    4 | #include "tscript_context.h"
      |          ^~~~~~~~~~~~~~~~~~~
compilation terminated.
make[3]: *** [Makefile:14: tscript_exec.o] Error 1
make[3]: Leaving directory '/tmp/B.0mZ65d/BUILD/lms/daemon/modules/parser/extensions'
make[3]: *** Waiting for unfinished jobs....
make[3]: Entering directory '/tmp/B.0mZ65d/BUILD/lms/daemon/modules/parser/extensions'
gcc -c tscript_string.c -O2 -fwrapv -pipe -Wformat -Werror=format-security -gdwarf-4 -fno-debug-types-section -fvar-tracking-assignments -g2 -Wp,-D_FORTIFY_SOURCE=2 -fstack-protector-strong --param=ssp-buffer-size=4 -Werror=trampolines -fomit-frame-pointer -march=i686 -fasynchronous-unwind-tables -mtune=pentium4 -gdwarf-4 -fno-debug-types-section -fvar-tracking-assignments -g2  -fPIC -DUSE_MYSQL -DLMS_LIB_DIR=\"/usr/lib/lms/\" -I../..
In file included from tscript_string.c:32:
tscript_string.h:4:10: fatal error: tscript_context.h: No such file or directory
    4 | #include "tscript_context.h"
      |          ^~~~~~~~~~~~~~~~~~~
compilation terminated.
make[3]: *** [Makefile:14: tscript_string.o] Error 1
make[3]: Leaving directory '/tmp/B.0mZ65d/BUILD/lms/daemon/modules/parser/extensions'
make[3]: Entering directory '/tmp/B.0mZ65d/BUILD/lms/daemon/modules/parser/extensions'
gcc -c sql.c -O2 -fwrapv -pipe -Wformat -Werror=format-security -gdwarf-4 -fno-debug-types-section -fvar-tracking-assignments -g2 -Wp,-D_FORTIFY_SOURCE=2 -fstack-protector-strong --param=ssp-buffer-size=4 -Werror=trampolines -fomit-frame-pointer -march=i686 -fasynchronous-unwind-tables -mtune=pentium4 -gdwarf-4 -fno-debug-types-section -fvar-tracking-assignments -g2  -fPIC -DUSE_MYSQL -DLMS_LIB_DIR=\"/usr/lib/lms/\" -I../..
In file included from sql.c:25:
sql.h:4:10: fatal error: tscript_context.h: No such file or directory
    4 | #include "tscript_context.h"
      |          ^~~~~~~~~~~~~~~~~~~
compilation terminated.
make[3]: *** [Makefile:14: sql.o] Error 1
make[3]: Leaving directory '/tmp/B.0mZ65d/BUILD/lms/daemon/modules/parser/extensions'
make[3]: Entering directory '/tmp/B.0mZ65d/BUILD/lms/daemon/modules/parser/extensions'
gcc -c tscript_sysinfo.c -O2 -fwrapv -pipe -Wformat -Werror=format-security -gdwarf-4 -fno-debug-types-section -fvar-tracking-assignments -g2 -Wp,-D_FORTIFY_SOURCE=2 -fstack-protector-strong --param=ssp-buffer-size=4 -Werror=trampolines -fomit-frame-pointer -march=i686 -fasynchronous-unwind-tables -mtune=pentium4 -gdwarf-4 -fno-debug-types-section -fvar-tracking-assignments -g2  -fPIC -DUSE_MYSQL -DLMS_LIB_DIR=\"/usr/lib/lms/\" -I../..
In file included from tscript_sysinfo.c:32:
tscript_sysinfo.h:4:10: fatal error: tscript_context.h: No such file or directory
    4 | #include "tscript_context.h"
      |          ^~~~~~~~~~~~~~~~~~~
compilation terminated.
make[3]: *** [Makefile:14: tscript_sysinfo.o] Error 1
make[3]: Leaving directory '/tmp/B.0mZ65d/BUILD/lms/daemon/modules/parser/extensions'
make[3]: Entering directory '/tmp/B.0mZ65d/BUILD/lms/daemon/modules/parser/extensions'
gcc -c tscript_file.c -O2 -fwrapv -pipe -Wformat -Werror=format-security -gdwarf-4 -fno-debug-types-section -fvar-tracking-assignments -g2 -Wp,-D_FORTIFY_SOURCE=2 -fstack-protector-strong --param=ssp-buffer-size=4 -Werror=trampolines -fomit-frame-pointer -march=i686 -fasynchronous-unwind-tables -mtune=pentium4 -gdwarf-4 -fno-debug-types-section -fvar-tracking-assignments -g2  -fPIC -DUSE_MYSQL -DLMS_LIB_DIR=\"/usr/lib/lms/\" -I../..
In file included from tscript_file.c:32:
tscript_file.h:4:10: fatal error: tscript_context.h: No such file or directory
    4 | #include "tscript_context.h"
      |          ^~~~~~~~~~~~~~~~~~~
compilation terminated.
make[3]: *** [Makefile:14: tscript_file.o] Error 1
make[3]: Leaving directory '/tmp/B.0mZ65d/BUILD/lms/daemon/modules/parser/extensions'
make[2]: Entering directory '/tmp/B.0mZ65d/BUILD/lms/daemon/modules/parser'
i686-pld-linux-gcc -O2 -fwrapv -pipe -Wformat -Werror=format-security -gdwarf-4 -fno-debug-types-section -fvar-tracking-assignments -g2 -Wp,-D_FORTIFY_SOURCE=2 -fstack-protector-strong --param=ssp-buffer-size=4 -Werror=trampolines -fomit-frame-pointer -march=i686 -fasynchronous-unwind-tables -mtune=pentium4 -gdwarf-4 -fno-debug-types-section -fvar-tracking-assignments -g2  -fPIC -DUSE_MYSQL -DLMS_LIB_DIR=\"/usr/lib/lms/\" -I../..   -c -o parser.o parser.c
parser.c:32:10: fatal error: tscript_context.h: No such file or directory
   32 | #include "tscript_context.h"
      |          ^~~~~~~~~~~~~~~~~~~
compilation terminated.
make[2]: *** [<builtin>: parser.o] Error 1
make[2]: Leaving directory '/tmp/B.0mZ65d/BUILD/lms/daemon/modules/parser'
make[3]: Entering directory '/tmp/B.0mZ65d/BUILD/lms/daemon/modules/parser/extensions'
gcc -c syslog.c -O2 -fwrapv -pipe -Wformat -Werror=format-security -gdwarf-4 -fno-debug-types-section -fvar-tracking-assignments -g2 -Wp,-D_FORTIFY_SOURCE=2 -fstack-protector-strong --param=ssp-buffer-size=4 -Werror=trampolines -fomit-frame-pointer -march=i686 -fasynchronous-unwind-tables -mtune=pentium4 -gdwarf-4 -fno-debug-types-section -fvar-tracking-assignments -g2  -fPIC -DUSE_MYSQL -DLMS_LIB_DIR=\"/usr/lib/lms/\" -I../..
In file included from syslog.c:28:
syslog.h:4:10: fatal error: tscript_context.h: No such file or directory
    4 | #include "tscript_context.h"
      |          ^~~~~~~~~~~~~~~~~~~
compilation terminated.
make[3]: *** [Makefile:14: syslog.o] Error 1
make[3]: Leaving directory '/tmp/B.0mZ65d/BUILD/lms/daemon/modules/parser/extensions'
make[3]: Entering directory '/tmp/B.0mZ65d/BUILD/lms/daemon/modules/parser/extensions'
gcc -c net.c -O2 -fwrapv -pipe -Wformat -Werror=format-security -gdwarf-4 -fno-debug-types-section -fvar-tracking-assignments -g2 -Wp,-D_FORTIFY_SOURCE=2 -fstack-protector-strong --param=ssp-buffer-size=4 -Werror=trampolines -fomit-frame-pointer -march=i686 -fasynchronous-unwind-tables -mtune=pentium4 -gdwarf-4 -fno-debug-types-section -fvar-tracking-assignments -g2  -fPIC -DUSE_MYSQL -DLMS_LIB_DIR=\"/usr/lib/lms/\" -I../..
In file included from net.c:31:
net.h:4:10: fatal error: tscript_context.h: No such file or directory
    4 | #include "tscript_context.h"
      |          ^~~~~~~~~~~~~~~~~~~
compilation terminated.
make[3]: *** [Makefile:14: net.o] Error 1
make[3]: Leaving directory '/tmp/B.0mZ65d/BUILD/lms/daemon/modules/parser/extensions'
make[2]: *** [Makefile:20: ext] Error 2
make[3]: Entering directory '/tmp/B.0mZ65d/BUILD/lms/daemon/modules/parser/lib'
bison -o tscript_parser.c -d tscript_parser.y -p tscript_yy -r lookahead
tscript_parser.y:45.1-14: warning: deprecated directive: '%error-verbose', use '%define parse.error verbose' [-Wdeprecated]
   45 | %error-verbose
      | ^~~~~~~~~~~~~~
      | %define parse.error verbose
tscript_parser.y: warning: 32 shift/reduce conflicts [-Wconflicts-sr]
tscript_parser.y: warning: 1 reduce/reduce conflict [-Wconflicts-rr]
tscript_parser.y: note: rerun with option '-Wcounterexamples' to generate conflict counterexamples
tscript_parser.y: warning: fix-its can be applied.  Rerun with option '--update'. [-Wother]
make[3]: Leaving directory '/tmp/B.0mZ65d/BUILD/lms/daemon/modules/parser/lib'
make[2]: *** [Makefile:17: libs] Error 2
make[2]: Entering directory '/tmp/B.0mZ65d/BUILD/lms/daemon/modules/payments'
i686-pld-linux-gcc -O2 -fwrapv -pipe -Wformat -Werror=format-security -gdwarf-4 -fno-debug-types-section -fvar-tracking-assignments -g2 -Wp,-D_FORTIFY_SOURCE=2 -fstack-protector-strong --param=ssp-buffer-size=4 -Werror=trampolines -fomit-frame-pointer -march=i686 -fasynchronous-unwind-tables -mtune=pentium4 -gdwarf-4 -fno-debug-types-section -fvar-tracking-assignments -g2  -fPIC -DUSE_MYSQL -DLMS_LIB_DIR=\"/usr/lib/lms/\" -I../..   -c -o payments.o payments.c
make[2]: Leaving directory '/tmp/B.0mZ65d/BUILD/lms/daemon/modules/payments'
make[2]: Entering directory '/tmp/B.0mZ65d/BUILD/lms/daemon/modules/payments'
gcc -shared payments.o -o payments.so -L/usr/lib -lmysqlclient -ldl 
rm -rf payments.o
make[2]: Leaving directory '/tmp/B.0mZ65d/BUILD/lms/daemon/modules/payments'
make[2]: Entering directory '/tmp/B.0mZ65d/BUILD/lms/daemon/modules/pinger'
i686-pld-linux-gcc -O2 -fwrapv -pipe -Wformat -Werror=format-security -gdwarf-4 -fno-debug-types-section -fvar-tracking-assignments -g2 -Wp,-D_FORTIFY_SOURCE=2 -fstack-protector-strong --param=ssp-buffer-size=4 -Werror=trampolines -fomit-frame-pointer -march=i686 -fasynchronous-unwind-tables -mtune=pentium4 -gdwarf-4 -fno-debug-types-section -fvar-tracking-assignments -g2  -fPIC -DUSE_MYSQL -DLMS_LIB_DIR=\"/usr/lib/lms/\" -I../..   -c -o pinger.o pinger.c
make[2]: Leaving directory '/tmp/B.0mZ65d/BUILD/lms/daemon/modules/pinger'
make[2]: Entering directory '/tmp/B.0mZ65d/BUILD/lms/daemon/modules/pinger'
gcc -shared pinger.o -o pinger.so -L/usr/lib -lmysqlclient -ldl 
rm -rf pinger.o
make[2]: Leaving directory '/tmp/B.0mZ65d/BUILD/lms/daemon/modules/pinger'
make[2]: Entering directory '/tmp/B.0mZ65d/BUILD/lms/daemon/modules/system'
i686-pld-linux-gcc -O2 -fwrapv -pipe -Wformat -Werror=format-security -gdwarf-4 -fno-debug-types-section -fvar-tracking-assignments -g2 -Wp,-D_FORTIFY_SOURCE=2 -fstack-protector-strong --param=ssp-buffer-size=4 -Werror=trampolines -fomit-frame-pointer -march=i686 -fasynchronous-unwind-tables -mtune=pentium4 -gdwarf-4 -fno-debug-types-section -fvar-tracking-assignments -g2  -fPIC -DUSE_MYSQL -DLMS_LIB_DIR=\"/usr/lib/lms/\" -I../..   -c -o system.o system.c
system.c: In function 'reload':
system.c:42:3: warning: ignoring return value of 'system' declared with attribute 'warn_unused_result' [-Wunused-result]
   42 |   system(s->command);
      |   ^~~~~~~~~~~~~~~~~~
make[2]: Leaving directory '/tmp/B.0mZ65d/BUILD/lms/daemon/modules/system'
make[2]: Entering directory '/tmp/B.0mZ65d/BUILD/lms/daemon/modules/system'
gcc -shared system.o -o system.so -L/usr/lib -lmysqlclient -ldl 
rm -rf system.o
make[2]: Leaving directory '/tmp/B.0mZ65d/BUILD/lms/daemon/modules/system'
make[2]: Entering directory '/tmp/B.0mZ65d/BUILD/lms/daemon/modules/tc'
i686-pld-linux-gcc -O2 -fwrapv -pipe -Wformat -Werror=format-security -gdwarf-4 -fno-debug-types-section -fvar-tracking-assignments -g2 -Wp,-D_FORTIFY_SOURCE=2 -fstack-protector-strong --param=ssp-buffer-size=4 -Werror=trampolines -fomit-frame-pointer -march=i686 -fasynchronous-unwind-tables -mtune=pentium4 -gdwarf-4 -fno-debug-types-section -fvar-tracking-assignments -g2  -fPIC -DUSE_MYSQL -DLMS_LIB_DIR=\"/usr/lib/lms/\" -I../..   -c -o tc.o tc.c
tc.c: In function 'reload':
tc.c:443:3: warning: ignoring return value of 'system' declared with attribute 'warn_unused_result' [-Wunused-result]
  443 |   system(tc->command);
      |   ^~~~~~~~~~~~~~~~~~~
make[2]: Leaving directory '/tmp/B.0mZ65d/BUILD/lms/daemon/modules/tc'
make[2]: Entering directory '/tmp/B.0mZ65d/BUILD/lms/daemon/modules/tc'
gcc -shared tc.o -o tc.so -L/usr/lib -lmysqlclient -ldl 
rm -rf tc.o
make[2]: Leaving directory '/tmp/B.0mZ65d/BUILD/lms/daemon/modules/tc'
make[2]: Entering directory '/tmp/B.0mZ65d/BUILD/lms/daemon/modules/tc-new'
i686-pld-linux-gcc -O2 -fwrapv -pipe -Wformat -Werror=format-security -gdwarf-4 -fno-debug-types-section -fvar-tracking-assignments -g2 -Wp,-D_FORTIFY_SOURCE=2 -fstack-protector-strong --param=ssp-buffer-size=4 -Werror=trampolines -fomit-frame-pointer -march=i686 -fasynchronous-unwind-tables -mtune=pentium4 -gdwarf-4 -fno-debug-types-section -fvar-tracking-assignments -g2  -fPIC -DUSE_MYSQL -DLMS_LIB_DIR=\"/usr/lib/lms/\" -I../..   -c -o tc-new.o tc-new.c
tc-new.c: In function 'reload':
tc-new.c:513:3: warning: ignoring return value of 'system' declared with attribute 'warn_unused_result' [-Wunused-result]
  513 |   system(tc->command);
      |   ^~~~~~~~~~~~~~~~~~~
make[2]: Leaving directory '/tmp/B.0mZ65d/BUILD/lms/daemon/modules/tc-new'
make[2]: Entering directory '/tmp/B.0mZ65d/BUILD/lms/daemon/modules/tc-new'
gcc -shared tc-new.o -o tc-new.so -L/usr/lib -lmysqlclient -ldl 
rm -rf tc-new.o
make[2]: Leaving directory '/tmp/B.0mZ65d/BUILD/lms/daemon/modules/tc-new'
make[2]: Entering directory '/tmp/B.0mZ65d/BUILD/lms/daemon/modules/traffic'
i686-pld-linux-gcc -O2 -fwrapv -pipe -Wformat -Werror=format-security -gdwarf-4 -fno-debug-types-section -fvar-tracking-assignments -g2 -Wp,-D_FORTIFY_SOURCE=2 -fstack-protector-strong --param=ssp-buffer-size=4 -Werror=trampolines -fomit-frame-pointer -march=i686 -fasynchronous-unwind-tables -mtune=pentium4 -gdwarf-4 -fno-debug-types-section -fvar-tracking-assignments -g2  -fPIC -DUSE_MYSQL -DLMS_LIB_DIR=\"/usr/lib/lms/\" -I../..   -c -o traffic.o traffic.c
traffic.c: In function 'reload':
traffic.c:65:4: warning: ignoring return value of 'system' declared with attribute 'warn_unused_result' [-Wunused-result]
   65 |    system(traffic->begin_command);
      |    ^~~~~~~~~~~~~~~~~~~~~~~~~~~~~~
traffic.c:119:3: warning: ignoring return value of 'system' declared with attribute 'warn_unused_result' [-Wunused-result]
  119 |   system(traffic->end_command);
      |   ^~~~~~~~~~~~~~~~~~~~~~~~~~~~
make[2]: Leaving directory '/tmp/B.0mZ65d/BUILD/lms/daemon/modules/traffic'
make[2]: Entering directory '/tmp/B.0mZ65d/BUILD/lms/daemon/modules/traffic'
gcc -shared traffic.o -o traffic.so -L/usr/lib -lmysqlclient -ldl 
rm -rf traffic.o
make[2]: Leaving directory '/tmp/B.0mZ65d/BUILD/lms/daemon/modules/traffic'
+ mv lmsd lmsd-mysql
+ ./configure --with-pgsql
OS Type... Linux
Database type... PostgreSQL
Library location... /usr/lib
Includes location... /usr/include
SQL queries debugging... no
Events debugging... no
Configuration file... no
Daemon install directory... /usr/local/lms/bin
Modules install directory... /usr/local/lms/lib
Create Makefile for main program... done
Create Makefile for mod_cutoff... done
Create Makefile for mod_dhcp... done
Create Makefile for mod_dns... done
Create Makefile for mod_ethers... done
Create Makefile for mod_ewx-pt... done
Create Makefile for mod_ewx-stm... done
Create Makefile for mod_ewx-stm-channels... done
Create Makefile for mod_ggnotify... done
Create Makefile for mod_hostfile... done
Create Makefile for mod_notify... done
Create Makefile for mod_oident... done
Create Makefile for mod_parser... done
Create Makefile for mod_payments... done
Create Makefile for mod_pinger... done
Create Makefile for mod_system... done
Create Makefile for mod_tc... done
Create Makefile for mod_tc-new... done
Create Makefile for mod_traffic... done
Create Makefile for mod_parser extensions... done
***************************************************************
Configuration finished. Now You can type 'make && make install'
+ /usr/bin/make -Otarget -j9 lmsd 'CC=i686-pld-linux-gcc' 'CFLAGS=-O2 -fwrapv -pipe -Wformat -Werror=format-security -gdwarf-4 -fno-debug-types-section -fvar-tracking-assignments -g2 -Wp,-D_FORTIFY_SOURCE=2 -fstack-protector-strong --param=ssp-buffer-size=4 -Werror=trampolines -fomit-frame-pointer -march=i686 -fasynchronous-unwind-tables -mtune=pentium4 -gdwarf-4 -fno-debug-types-section -fvar-tracking-assignments -g2  -fPIC -DUSE_PGSQL -DLMS_LIB_DIR=\"/usr/lib/lms/\" -I../..'
i686-pld-linux-gcc -O2 -fwrapv -pipe -Wformat -Werror=format-security -gdwarf-4 -fno-debug-types-section -fvar-tracking-assignments -g2 -Wp,-D_FORTIFY_SOURCE=2 -fstack-protector-strong --param=ssp-buffer-size=4 -Werror=trampolines -fomit-frame-pointer -march=i686 -fasynchronous-unwind-tables -mtune=pentium4 -gdwarf-4 -fno-debug-types-section -fvar-tracking-assignments -g2  -fPIC -DUSE_PGSQL -DLMS_LIB_DIR=\"/usr/lib/lms/\" -I../..   -c -o dbdrivers/pgsql/db.o dbdrivers/pgsql/db.c
gcc dbdrivers/pgsql/db.o util.o cron/cronparse.o cron/cron.o config/dictionary.o config/config.o lmsd.o -o lmsd -L/usr/lib -lpq -ldl
+ mv lmsd lmsd-pgsql
+ CFLAGS='-O2 -fwrapv -pipe -Wformat -Werror=format-security -gdwarf-4 -fno-debug-types-section -fvar-tracking-assignments -g2 -Wp,-D_FORTIFY_SOURCE=2 -fstack-protector-strong --param=ssp-buffer-size=4 -Werror=trampolines -fomit-frame-pointer -march=i686 -fasynchronous-unwind-tables -mtune=pentium4 -gdwarf-4 -fno-debug-types-section -fvar-tracking-assignments -g2 ' /usr/bin/make -Otarget -j9 -j1 -C modules/parser 'CC=i686-pld-linux-gcc'
make: Entering directory '/tmp/B.0mZ65d/BUILD/lms/daemon/modules/parser'
/usr/bin/make -C lib
make[1]: Entering directory '/tmp/B.0mZ65d/BUILD/lms/daemon/modules/parser/lib'
make[1]: Circular tscript_parser.h <- tscript_parser.h dependency dropped.
i686-pld-linux-gcc -c tscript_ast.c -O2 -fPIC
i686-pld-linux-gcc -c tscript_context.c -O2 -fPIC
i686-pld-linux-gcc -c tscript_compiler.c -O2 -fPIC
tscript_compiler.c: In function 'tscript_compile_stream':
tscript_compiler.c:42:2: warning: implicit declaration of function 'tscript_init_lexical' [-Wimplicit-function-declaration]
   42 |  tscript_init_lexical();
      |  ^~~~~~~~~~~~~~~~~~~~
tscript_compiler.c:43:25: warning: passing argument 1 of 'tscript_yyparse' from incompatible pointer type [-Wincompatible-pointer-types]
   43 |  return tscript_yyparse(&context->ast);
      |                         ^~~~~~~~~~~~~
      |                         |
      |                         struct tscript_ast_node **
In file included from tscript_compiler.c:33:
tscript_parser.h:123:39: note: expected 'tscript_context *' but argument is of type 'struct tscript_ast_node **'
  123 | int tscript_yyparse (tscript_context* context);
      |                      ~~~~~~~~~~~~~~~~~^~~~~~~
tscript_compiler.c: In function 'tscript_compile_string':
tscript_compiler.c:51:22: warning: passing argument 1 of 'tscript_yyparse' from incompatible pointer type [-Wincompatible-pointer-types]
   51 |  r = tscript_yyparse(&context->ast);
      |                      ^~~~~~~~~~~~~
      |                      |
      |                      struct tscript_ast_node **
In file included from tscript_compiler.c:33:
tscript_parser.h:123:39: note: expected 'tscript_context *' but argument is of type 'struct tscript_ast_node **'
  123 | int tscript_yyparse (tscript_context* context);
      |                      ~~~~~~~~~~~~~~~~~^~~~~~~
i686-pld-linux-gcc -c tscript_interpreter.c -O2 -fPIC
tscript_interpreter.c: In function 'tscript_interprete_sub':
tscript_interpreter.c:125:2: warning: implicit declaration of function 'tscript_debug' [-Wimplicit-function-declaration]
  125 |  tscript_debug(context, "Interpretting %s\n", ast->type);
      |  ^~~~~~~~~~~~~
tscript_interpreter.c:580:4: warning: implicit declaration of function 'tscript_internal_error' [-Wimplicit-function-declaration]
  580 |    tscript_internal_error("Incorrect conversion");
      |    ^~~~~~~~~~~~~~~~~~~~~~
i686-pld-linux-gcc -c tscript_variables.c -O2 -fPIC
tscript_variables.c: In function 'tscript_variable_get_reference':
tscript_variables.c:47:2: warning: implicit declaration of function 'tscript_debug' [-Wimplicit-function-declaration]
   47 |  tscript_debug(context, "Getting reference for variable %s\n", name);
      |  ^~~~~~~~~~~~~
i686-pld-linux-gcc -c tscript_parser.c -O2 -fPIC
tscript_parser.c: In function 'tscript_yyparse':
tscript_parser.c:69:25: warning: implicit declaration of function 'tscript_yylex'; did you mean 'tscript_yyparse'? [-Wimplicit-function-declaration]
   69 | #define yylex           tscript_yylex
      |                         ^~~~~~~~~~~~~
tscript_parser.c:1691:16: note: in expansion of macro 'yylex'
 1691 |       yychar = yylex (context);
      |                ^~~~~
tscript_parser.y:151:9: warning: implicit declaration of function 'strcmp' [-Wimplicit-function-declaration]
  151 |     if (strcmp(tscript_value_as_string($1->value),
      |         ^~~~~~
tscript_parser.c:70:25: warning: implicit declaration of function 'tscript_yyerror'; did you mean 'tscript_yyparse'? [-Wimplicit-function-declaration]
   70 | #define yyerror         tscript_yyerror
      |                         ^~~~~~~~~~~~~~~
tscript_parser.y:154:6: note: in expansion of macro 'yyerror'
  154 |      yyerror(context,
      |      ^~~~~~~
i686-pld-linux-gcc -c tscript_values.c -O2 -fPIC
tscript_values.c: In function 'tscript_value_create':
tscript_values.c:50:3: warning: implicit declaration of function 'asprintf' [-Wimplicit-function-declaration]
   50 |   asprintf(&v->data, "%s", data);
      |   ^~~~~~~~
tscript_values.c: In function 'tscript_value_create_error':
tscript_values.c:69:2: warning: implicit declaration of function 'vasprintf' [-Wimplicit-function-declaration]
   69 |  vasprintf(&msg, format, va);
      |  ^~~~~~~~~
tscript_values.c: In function 'tscript_value_dereference':
tscript_values.c:200:4: warning: implicit declaration of function 'tscript_internal_error'; did you mean 'tscript_value_create_error'? [-Wimplicit-function-declaration]
  200 |    tscript_internal_error("Reference pointer is NULL!\n");
      |    ^~~~~~~~~~~~~~~~~~~~~~
      |    tscript_value_create_error
i686-pld-linux-gcc -c tscript_extensions.c -O2 -fPIC
tscript_extensions.c: In function 'tscript_run_extension':
tscript_extensions.c:113:3: warning: implicit declaration of function 'tscript_internal_error'; did you mean 'tscript_value_create_error'? [-Wimplicit-function-declaration]
  113 |   tscript_internal_error("Cannot find extension\n");
      |   ^~~~~~~~~~~~~~~~~~~~~~
      |   tscript_value_create_error
i686-pld-linux-gcc -c tscript_debug.c -O2 -fPIC
tscript_debug.c: In function 'tscript_yyerror':
tscript_debug.c:70:2: warning: implicit declaration of function 'asprintf'; did you mean 'vsprintf'? [-Wimplicit-function-declaration]
   70 |  asprintf(&context->error, "(line: %i, col: %i): %s",
      |  ^~~~~~~~
      |  vsprintf
flex -otscript_lexical.c -Ptscript_yy tscript_lexical.yy 
i686-pld-linux-gcc -c tscript_lexical.c -O2 -fPIC
tscript_lexical.yy: In function 'tscript_yylex':
tscript_lexical.yy:282:11: warning: implicit declaration of function 'tscript_has_extension' [-Wimplicit-function-declaration]
  282 |       if (tscript_has_extension(context, yytext))
      |           ^~~~~~~~~~~~~~~~~~~~~
tscript_lexical.yy:286:12: warning: implicit declaration of function 'tscript_extension_is_block'; did you mean 'tscript_extension_map_count'? [-Wimplicit-function-declaration]
  286 |        if (tscript_extension_is_block(context,
      |            ^~~~~~~~~~~~~~~~~~~~~~~~~~
      |            tscript_extension_map_count
tscript_lexical.yy:291:11: warning: implicit declaration of function 'tscript_has_constant'; did you mean 'tscript_yy_scan_string'? [-Wimplicit-function-declaration]
  291 |       if (tscript_has_constant(context, yytext))
      |           ^~~~~~~~~~~~~~~~~~~~
      |           tscript_yy_scan_string
ar rs libtscript.a tscript_ast.o tscript_context.o tscript_compiler.o tscript_interpreter.o tscript_variables.o tscript_parser.o tscript_values.o tscript_extensions.o tscript_debug.o tscript_lexical.o
ar: creating libtscript.a
i686-pld-linux-gcc -shared -o libtscript.so tscript_ast.o tscript_context.o tscript_compiler.o tscript_interpreter.o tscript_variables.o tscript_parser.o tscript_values.o tscript_extensions.o tscript_debug.o tscript_lexical.o 
strip libtscript.so
make[1]: Leaving directory '/tmp/B.0mZ65d/BUILD/lms/daemon/modules/parser/lib'
/usr/bin/make -C extensions
make[1]: Entering directory '/tmp/B.0mZ65d/BUILD/lms/daemon/modules/parser/extensions'
gcc -c tscript_exec.c -I/usr/include -Wall -O2 -fPIC -DGNU -DUSE_PGSQL -I../.. -I../lib -D_GNU_SOURCE
gcc -c tscript_string.c -I/usr/include -Wall -O2 -fPIC -DGNU -DUSE_PGSQL -I../.. -I../lib -D_GNU_SOURCE
gcc -c tscript_file.c -I/usr/include -Wall -O2 -fPIC -DGNU -DUSE_PGSQL -I../.. -I../lib -D_GNU_SOURCE
gcc -c tscript_sysinfo.c -I/usr/include -Wall -O2 -fPIC -DGNU -DUSE_PGSQL -I../.. -I../lib -D_GNU_SOURCE
gcc -c sql.c -I/usr/include -Wall -O2 -fPIC -DGNU -DUSE_PGSQL -I../.. -I../lib -D_GNU_SOURCE
gcc -c net.c -I/usr/include -Wall -O2 -fPIC -DGNU -DUSE_PGSQL -I../.. -I../lib -D_GNU_SOURCE
gcc -c syslog.c -I/usr/include -Wall -O2 -fPIC -DGNU -DUSE_PGSQL -I../.. -I../lib -D_GNU_SOURCE
ar rs tscript_extensions.a ../../../dbdrivers/pgsql/db.o ../../../util.o tscript_exec.o tscript_string.o tscript_file.o tscript_sysinfo.o sql.o net.o syslog.o
ar: creating tscript_extensions.a
make[1]: Leaving directory '/tmp/B.0mZ65d/BUILD/lms/daemon/modules/parser/extensions'
i686-pld-linux-gcc -I/usr/include -Wall -O2 -fPIC -DGNU -DUSE_PGSQL -I../.. -I./lib   -c -o parser.o parser.c
gcc -shared parser.o lib/libtscript.a extensions/tscript_extensions.a -o parser.so -L/usr/lib -lfl -lm -lpq -ldl  
rm -rf parser.o lib/libtscript.a extensions/tscript_extensions.a
make: Leaving directory '/tmp/B.0mZ65d/BUILD/lms/daemon/modules/parser'
+ cd ..
+ exit 0
Executing(%install): /bin/sh -e /tmp/B.0mZ65d/BUILD/tmp/rpm-tmp.96948
TMP=/home/users/builder/tmp
HOME=/home/users/builder
PATH=/home/users/builder/GNUstep/Tools:/bin:/usr/bin:/usr/local/bin:/home/users/builder/bin
TMPDIR=/tmp/B.0mZ65d/BUILD/tmp
+ umask 022
+ cd /tmp/B.0mZ65d/BUILD
+ /bin/rm '--interactive=never' -rf /tmp/B.0mZ65d/BUILD/tmp/lms-1.11.13-root-builder
+ /bin/mkdir -p /tmp/B.0mZ65d/BUILD/tmp/lms-1.11.13-root-builder
+ cd lms
+ rm -rf /tmp/B.0mZ65d/BUILD/tmp/lms-1.11.13-root-builder
+ install -d /tmp/B.0mZ65d/BUILD/tmp/lms-1.11.13-root-builder/usr/sbin /tmp/B.0mZ65d/BUILD/tmp/lms-1.11.13-root-builder/usr/lib/lms /tmp/B.0mZ65d/BUILD/tmp/lms-1.11.13-root-builder/etc/webapps/lms /tmp/B.0mZ65d/BUILD/tmp/lms-1.11.13-root-builder/etc/rc.d/init.d /tmp/B.0mZ65d/BUILD/tmp/lms-1.11.13-root-builder/etc/sysconfig /tmp/B.0mZ65d/BUILD/tmp/lms-1.11.13-root-builder/etc/lms/modules /tmp/B.0mZ65d/BUILD/tmp/lms-1.11.13-root-builder/usr/share/php/Smarty/plugins /tmp/B.0mZ65d/BUILD/tmp/lms-1.11.13-root-builder/usr/share/lms/lms /tmp/B.0mZ65d/BUILD/tmp/lms-1.11.13-root-builder/usr/share/lms/userpanel /tmp/B.0mZ65d/BUILD/tmp/lms-1.11.13-root-builder/usr/share/lms/www/doc /tmp/B.0mZ65d/BUILD/tmp/lms-1.11.13-root-builder/usr/share/lms/www/user /tmp/B.0mZ65d/BUILD/tmp/lms-1.11.13-root-builder/usr/share/lms/www/userpanel/modules /tmp/B.0mZ65d/BUILD/tmp/lms-1.11.13-root-builder/var/lib/lms/backups /tmp/B.0mZ65d/BUILD/tmp/lms-1.11.13-root-builder/var/lib/lms/documents /tmp/B.0mZ65d/BUILD/tmp/lms-1.11.13-root-builder/var/lib/lms/templates_c /tmp/B.0mZ65d/BUILD/tmp/lms-1.11.13-root-builder/var/lib/lms/userpanel/templates_c
+ cp -a index.php img /tmp/B.0mZ65d/BUILD/tmp/lms-1.11.13-root-builder/usr/share/lms/www
+ cp -a doc/html /tmp/B.0mZ65d/BUILD/tmp/lms-1.11.13-root-builder/usr/share/lms/www/doc
+ cp -a contrib lib modules sample templates /tmp/B.0mZ65d/BUILD/tmp/lms-1.11.13-root-builder/usr/share/lms
+ cp -a smarty-plugins/block.t.php smarty-plugins/function.bankaccount.php smarty-plugins/function.gentime.php smarty-plugins/function.handle.php smarty-plugins/function.memory.php smarty-plugins/function.number.php smarty-plugins/function.size.php smarty-plugins/function.sum.php smarty-plugins/function.tip.php smarty-plugins/modifier.money_format.php smarty-plugins/modifier.striphtml.php smarty-plugins/modifier.to_words.php /tmp/B.0mZ65d/BUILD/tmp/lms-1.11.13-root-builder/usr/share/php/Smarty/plugins
+ cp -a bin/lms-arpd bin/lms-arping bin/lms-cutoff bin/lms-etherdesc bin/lms-fping bin/lms-ipfw bin/lms-makearp bin/lms-makedhcpconf bin/lms-makehosts bin/lms-makeipchains bin/lms-makeiptables bin/lms-makemacs bin/lms-makemessages bin/lms-makeoidentconf bin/lms-makeon bin/lms-makeopenbsdpf bin/lms-makewarnings bin/lms-mgc bin/lms-notify bin/lms-notify-messages bin/lms-notify-sms bin/lms-payments bin/lms-reminder bin/lms-rtparser bin/lms-sendinvoices bin/lms-smstools bin/lms-traffic bin/lms-traffic-htbiptlimits bin/lms-traffic-logiptables /tmp/B.0mZ65d/BUILD/tmp/lms-1.11.13-root-builder/usr/sbin
+ /bin/mv /tmp/B.0mZ65d/BUILD/tmp/lms-1.11.13-root-builder/usr/share/lms/sample/lms.ini /tmp/B.0mZ65d/BUILD/tmp/lms-1.11.13-root-builder/etc/lms
+ install /tmp/B.0mZ65d/lms-apache.conf /tmp/B.0mZ65d/BUILD/tmp/lms-1.11.13-root-builder/etc/webapps/lms/apache.conf
+ install /tmp/B.0mZ65d/lms-httpd.conf /tmp/B.0mZ65d/BUILD/tmp/lms-1.11.13-root-builder/etc/webapps/lms/httpd.conf
+ /bin/mv /tmp/B.0mZ65d/BUILD/tmp/lms-1.11.13-root-builder/usr/share/lms/contrib/sqlpanel/sql.php /tmp/B.0mZ65d/BUILD/tmp/lms-1.11.13-root-builder/usr/share/lms/contrib/sqlpanel/sqllang.php /tmp/B.0mZ65d/BUILD/tmp/lms-1.11.13-root-builder/usr/share/lms/modules
+ /bin/mv /tmp/B.0mZ65d/BUILD/tmp/lms-1.11.13-root-builder/usr/share/lms/contrib/sqlpanel/sql.html /tmp/B.0mZ65d/BUILD/tmp/lms-1.11.13-root-builder/usr/share/lms/contrib/sqlpanel/sqlprint.html /tmp/B.0mZ65d/BUILD/tmp/lms-1.11.13-root-builder/usr/share/lms/templates
+ /bin/mv /tmp/B.0mZ65d/BUILD/tmp/lms-1.11.13-root-builder/usr/share/lms/contrib/customer/customer.html /tmp/B.0mZ65d/BUILD/tmp/lms-1.11.13-root-builder/usr/share/lms/contrib/customer/index.php /tmp/B.0mZ65d/BUILD/tmp/lms-1.11.13-root-builder/usr/share/lms/contrib/customer/lms-powered.png /tmp/B.0mZ65d/BUILD/tmp/lms-1.11.13-root-builder/usr/share/lms/contrib/customer/locale /tmp/B.0mZ65d/BUILD/tmp/lms-1.11.13-root-builder/usr/share/lms/www/user
+ install daemon/lmsd-mysql daemon/lmsd-pgsql /tmp/B.0mZ65d/BUILD/tmp/lms-1.11.13-root-builder/usr/sbin
+ install daemon/modules/cutoff/cutoff.so daemon/modules/dhcp/dhcp.so daemon/modules/dns/dns.so daemon/modules/ethers/ethers.so daemon/modules/ewx-pt/ewx-pt.so daemon/modules/ewx-stm-channels/ewx-stm-channels.so daemon/modules/ewx-stm/ewx-stm.so daemon/modules/ggnotify/ggnotify.so daemon/modules/hostfile/hostfile.so daemon/modules/notify/notify.so daemon/modules/oident/oident.so daemon/modules/parser/parser.so daemon/modules/payments/payments.so daemon/modules/pinger/pinger.so daemon/modules/system/system.so daemon/modules/tc-new/tc-new.so daemon/modules/tc/tc.so daemon/modules/traffic/traffic.so /tmp/B.0mZ65d/BUILD/tmp/lms-1.11.13-root-builder/usr/lib/lms
+ cp -a daemon/modules/dns/sample /tmp/B.0mZ65d/BUILD/tmp/lms-1.11.13-root-builder/etc/lms/modules/dns
+ cp -a daemon/modules/ggnotify/sample /tmp/B.0mZ65d/BUILD/tmp/lms-1.11.13-root-builder/etc/lms/modules/ggnotify
+ cp -a daemon/modules/notify/sample /tmp/B.0mZ65d/BUILD/tmp/lms-1.11.13-root-builder/etc/lms/modules/notify
+ install /tmp/B.0mZ65d/lms.init /tmp/B.0mZ65d/BUILD/tmp/lms-1.11.13-root-builder/etc/rc.d/init.d/lmsd
+ install /tmp/B.0mZ65d/lms.sysconfig /tmp/B.0mZ65d/BUILD/tmp/lms-1.11.13-root-builder/etc/sysconfig/lms
+ cp -a userpanel/lib userpanel/modules userpanel/templates /tmp/B.0mZ65d/BUILD/tmp/lms-1.11.13-root-builder/usr/share/lms/userpanel
+ cp -a userpanel/index.php userpanel/style /tmp/B.0mZ65d/BUILD/tmp/lms-1.11.13-root-builder/usr/share/lms/www/userpanel
+ ln -s /usr/share/lms/www/userpanel/style /tmp/B.0mZ65d/BUILD/tmp/lms-1.11.13-root-builder/usr/share/lms/userpanel
+ ln -s /var/lib/lms/userpanel/templates_c /tmp/B.0mZ65d/BUILD/tmp/lms-1.11.13-root-builder/usr/share/lms/userpanel
+ basename /tmp/B.0mZ65d/BUILD/tmp/lms-1.11.13-root-builder/usr/share/lms/userpanel/modules/finances
+ MODULE=finances 
+ mkdir /tmp/B.0mZ65d/BUILD/tmp/lms-1.11.13-root-builder/usr/share/lms/www/userpanel/modules/finances
+ ln -s /usr/share/lms/userpanel/modules/finances/style /tmp/B.0mZ65d/BUILD/tmp/lms-1.11.13-root-builder/usr/share/lms/www/userpanel/modules/finances
+ basename /tmp/B.0mZ65d/BUILD/tmp/lms-1.11.13-root-builder/usr/share/lms/userpanel/modules/help
+ MODULE=help 
+ mkdir /tmp/B.0mZ65d/BUILD/tmp/lms-1.11.13-root-builder/usr/share/lms/www/userpanel/modules/help
+ ln -s /usr/share/lms/userpanel/modules/help/style /tmp/B.0mZ65d/BUILD/tmp/lms-1.11.13-root-builder/usr/share/lms/www/userpanel/modules/help
+ basename /tmp/B.0mZ65d/BUILD/tmp/lms-1.11.13-root-builder/usr/share/lms/userpanel/modules/helpdesk
+ MODULE=helpdesk 
+ mkdir /tmp/B.0mZ65d/BUILD/tmp/lms-1.11.13-root-builder/usr/share/lms/www/userpanel/modules/helpdesk
+ ln -s /usr/share/lms/userpanel/modules/helpdesk/style /tmp/B.0mZ65d/BUILD/tmp/lms-1.11.13-root-builder/usr/share/lms/www/userpanel/modules/helpdesk
+ basename /tmp/B.0mZ65d/BUILD/tmp/lms-1.11.13-root-builder/usr/share/lms/userpanel/modules/info
+ MODULE=info 
+ mkdir /tmp/B.0mZ65d/BUILD/tmp/lms-1.11.13-root-builder/usr/share/lms/www/userpanel/modules/info
+ ln -s /usr/share/lms/userpanel/modules/info/style /tmp/B.0mZ65d/BUILD/tmp/lms-1.11.13-root-builder/usr/share/lms/www/userpanel/modules/info
+ basename /tmp/B.0mZ65d/BUILD/tmp/lms-1.11.13-root-builder/usr/share/lms/userpanel/modules/logout
+ MODULE=logout 
+ mkdir /tmp/B.0mZ65d/BUILD/tmp/lms-1.11.13-root-builder/usr/share/lms/www/userpanel/modules/logout
+ ln -s /usr/share/lms/userpanel/modules/logout/style /tmp/B.0mZ65d/BUILD/tmp/lms-1.11.13-root-builder/usr/share/lms/www/userpanel/modules/logout
+ basename /tmp/B.0mZ65d/BUILD/tmp/lms-1.11.13-root-builder/usr/share/lms/userpanel/modules/messages
+ MODULE=messages 
+ mkdir /tmp/B.0mZ65d/BUILD/tmp/lms-1.11.13-root-builder/usr/share/lms/www/userpanel/modules/messages
+ ln -s /usr/share/lms/userpanel/modules/messages/style /tmp/B.0mZ65d/BUILD/tmp/lms-1.11.13-root-builder/usr/share/lms/www/userpanel/modules/messages
+ basename /tmp/B.0mZ65d/BUILD/tmp/lms-1.11.13-root-builder/usr/share/lms/userpanel/modules/modules
+ MODULE=modules 
+ mkdir /tmp/B.0mZ65d/BUILD/tmp/lms-1.11.13-root-builder/usr/share/lms/www/userpanel/modules/modules
+ ln -s /usr/share/lms/userpanel/modules/modules/style /tmp/B.0mZ65d/BUILD/tmp/lms-1.11.13-root-builder/usr/share/lms/www/userpanel/modules/modules
+ basename /tmp/B.0mZ65d/BUILD/tmp/lms-1.11.13-root-builder/usr/share/lms/userpanel/modules/stats
+ MODULE=stats 
+ mkdir /tmp/B.0mZ65d/BUILD/tmp/lms-1.11.13-root-builder/usr/share/lms/www/userpanel/modules/stats
+ ln -s /usr/share/lms/userpanel/modules/stats/style /tmp/B.0mZ65d/BUILD/tmp/lms-1.11.13-root-builder/usr/share/lms/www/userpanel/modules/stats
+ /usr/lib/rpm/find-debuginfo.sh /tmp/B.0mZ65d/BUILD/lms
RPM_BUILD_DIR=/tmp/B.0mZ65d/BUILD

extracting debug info from /tmp/B.0mZ65d/BUILD/tmp/lms-1.11.13-root-builder/usr/lib/lms/cutoff.so
extracting debug info from /tmp/B.0mZ65d/BUILD/tmp/lms-1.11.13-root-builder/usr/lib/lms/dhcp.so
extracting debug info from /tmp/B.0mZ65d/BUILD/tmp/lms-1.11.13-root-builder/usr/lib/lms/dns.so
extracting debug info from /tmp/B.0mZ65d/BUILD/tmp/lms-1.11.13-root-builder/usr/lib/lms/ethers.so
extracting debug info from /tmp/B.0mZ65d/BUILD/tmp/lms-1.11.13-root-builder/usr/lib/lms/ewx-pt.so
extracting debug info from /tmp/B.0mZ65d/BUILD/tmp/lms-1.11.13-root-builder/usr/lib/lms/ewx-stm-channels.so
extracting debug info from /tmp/B.0mZ65d/BUILD/tmp/lms-1.11.13-root-builder/usr/lib/lms/ewx-stm.so
extracting debug info from /tmp/B.0mZ65d/BUILD/tmp/lms-1.11.13-root-builder/usr/lib/lms/ggnotify.so
extracting debug info from /tmp/B.0mZ65d/BUILD/tmp/lms-1.11.13-root-builder/usr/lib/lms/hostfile.so
extracting debug info from /tmp/B.0mZ65d/BUILD/tmp/lms-1.11.13-root-builder/usr/lib/lms/notify.so
extracting debug info from /tmp/B.0mZ65d/BUILD/tmp/lms-1.11.13-root-builder/usr/lib/lms/oident.so
extracting debug info from /tmp/B.0mZ65d/BUILD/tmp/lms-1.11.13-root-builder/usr/lib/lms/parser.so
extracting debug info from /tmp/B.0mZ65d/BUILD/tmp/lms-1.11.13-root-builder/usr/lib/lms/payments.so
extracting debug info from /tmp/B.0mZ65d/BUILD/tmp/lms-1.11.13-root-builder/usr/lib/lms/pinger.so
extracting debug info from /tmp/B.0mZ65d/BUILD/tmp/lms-1.11.13-root-builder/usr/lib/lms/system.so
extracting debug info from /tmp/B.0mZ65d/BUILD/tmp/lms-1.11.13-root-builder/usr/lib/lms/tc-new.so
extracting debug info from /tmp/B.0mZ65d/BUILD/tmp/lms-1.11.13-root-builder/usr/lib/lms/tc.so
extracting debug info from /tmp/B.0mZ65d/BUILD/tmp/lms-1.11.13-root-builder/usr/lib/lms/traffic.so
extracting debug info from /tmp/B.0mZ65d/BUILD/tmp/lms-1.11.13-root-builder/usr/sbin/lmsd-mysql
extracting debug info from /tmp/B.0mZ65d/BUILD/tmp/lms-1.11.13-root-builder/usr/sbin/lmsd-pgsql
cpio: /tmp/B.DP8Yi8/BUILD/glibc-2.32/csu: Cannot stat: No such file or directory
798 blocks
+ __spec_install_post_strip
+ set +x
Stripping 2 ELF executables...DONE
Stripping 18 ELF shared libraries...DONE
+ __spec_install_post_chrpath
+ set +x
Remove RPATH/RUNPATH from 20 executable binaries and shared object files.
+ __spec_install_post_compress_modules
+ set +x
+ __spec_install_post_check_so
+ set +x
Searching for shared objects with unresolved symbols... DONE
+ __spec_install_post_check_tmpfiles
+ set +x
Checking /var/run <-> tmpfiles.d completeness...
 DONE
+ __spec_install_post_check_shebangs
+ set +x
Checking script shebangs...
/usr/share/lms/contrib/LMS2Nagios/nagios-v6-check.py starts with '#!/usr/bin/python', should be '#!/usr/bin/python2' or '#!/usr/bin/python3'
/usr/share/lms/contrib/LMS2Nagios/nagios-v6-gen.py starts with '#!/usr/bin/python', should be '#!/usr/bin/python2' or '#!/usr/bin/python3'
 DONE
error: Bad exit status from /tmp/B.0mZ65d/BUILD/tmp/rpm-tmp.96948 (%install)


RPM build errors:
    Bad exit status from /tmp/B.0mZ65d/BUILD/tmp/rpm-tmp.96948 (%install)
ended at: Thu Oct  8 21:10:16 2020, done in 0:00:16.110198
error: No files produced.
+ chmod -R u+rwX /tmp/B.0mZ65d/BUILD
+ rm -rf /tmp/B.0mZ65d/tmp /tmp/B.0mZ65d/BUILD
+ rm -rf /tmp/B.0mZ65d
Begin-PLD-Builder-Info
Build-Time: user:16.12s sys:1.55s real:20.12s (faults io:20 non-io:492414)

End-PLD-Builder-Info
[Back to list of logs] [View rpm -qa of builder]