FailedOk

th/SRPMS[OK]
th/x32[OK]
th/i686[OK]
th/x86_64[OK]

ac/SRPMS[OK]
ac/i386[OK]
ac/i586[OK]
ac/i686[OK]
ac/alpha[OK]
ac/amd64[OK]
ac/athlon[OK]
ac/ppc[OK]
ac/sparc[OK]
ac/sparc64[OK]

Advanced Search
main()
Powered by PLD Linux
(c) 2002-2017 PLD Team
$Revision: 1.37 $
Powered by GNU antilope.
Your IP: 107.22.30.57

lttng-modules c2ec1a6b-d27e-4f2e-92c5-49fff1bbd4f0

Status:Failed
Source URL:ftp://buildlogs.pld-linux.org/th/i686/FAIL/lttng-modules,c2ec1a6b-d27e-4f2e-92c5-49fff1bbd4f0.bz2
text/plain URL:View!
full text:View!
rpm -qa of builder:View!
Date:2017/07/31 19:42:33
Runtime:0:00:21.941031

Toc:

  • error 1
  • /tmp/B.4rZhKW/BUILD/lttng-modules-2.9.2/lib/ringbuffer/ring_buffer_splice.c:98:3: error: unknown field 'flags' specified in initializer
  • error 2
  • /tmp/B.4rZhKW/BUILD/lttng-modules-2.9.2/probes/../probes/lttng-tracepoint-event-impl.h:142:6: error: conflicting types for 'trace_sched_pi_setprio'
  • error 3
  • error: Bad exit status from /tmp/B.4rZhKW/BUILD/tmp/rpm-tmp.20784 (%build)
  • error 4
  • RPM build errors:
  • error 5
  • error: No files produced.

Content:

* Mon Oct 10 2016 Jan Rękorajski <baggins@pld-linux.org> ee2a962
- more files updates * Mon Oct 10 2016 Jan Rękorajski <baggins@pld-linux.org> de7ed10
- updated files * Mon Oct 10 2016 Jan Rękorajski <baggins@pld-linux.org> 8efb93e
- up to 2.8.2 + rpm -Uhv --nodeps --define '_topdir /tmp/B.4rZhKW' --define '_specdir %{_topdir}' --define '_sourcedir %{_specdir}' --define '_rpmdir %{_topdir}/RPMS' --define '_builddir %{_topdir}/BUILD' --without userspace --define 'build_kernels head,4.9,4.4,4.1' lttng-modules-2.9.2-1@4.12.4_1.src.rpm Preparing... ################################################## lttng-modules ################################################## + rm -f lttng-modules-2.9.2-1@4.12.4_1.src.rpm + install -m 700 -d /tmp/B.4rZhKW/BUILD/tmp + TMPDIR=/tmp/B.4rZhKW/BUILD/tmp + exec nice -n 0 rpmbuild -bp --short-circuit --nodeps --define '_topdir /tmp/B.4rZhKW' --define '_specdir %{_topdir}' --define '_sourcedir %{_specdir}' --define '_rpmdir %{_topdir}/RPMS' --define '_builddir %{_topdir}/BUILD' --without userspace --target i686-pld-linux --define 'build_kernels head,4.9,4.4,4.1' --define 'prep exit 0' /tmp/B.4rZhKW/lttng-modules.spec Building target platforms: i686-pld-linux checking BuildConflict-ing packages no BuildConflicts found checking BR rpm: Building target platforms: i686-pld-linux no BR needed building RPM using: set -ex; : build-id: c2ec1a6b-d27e-4f2e-92c5-49fff1bbd4f0; TMPDIR=/tmp/B.4rZhKW/BUILD/tmp exec nice -n 0 rpmbuild -bb --define '_smp_mflags -j9' --define '_make_opts -Otarget' --define '_pld_builder 1' --define '_topdir /tmp/B.4rZhKW' --define '_specdir %{_topdir}' --define '_sourcedir %{_specdir}' --define '_rpmdir %{_topdir}/RPMS' --define '_builddir %{_topdir}/BUILD' --without userspace --target i686-pld-linux --define 'build_kernels head,4.9,4.4,4.1' /tmp/B.4rZhKW/lttng-modules.spec + : build-id: c2ec1a6b-d27e-4f2e-92c5-49fff1bbd4f0 + TMPDIR=/tmp/B.4rZhKW/BUILD/tmp + exec nice -n 0 rpmbuild -bb --define '_smp_mflags -j9' --define '_make_opts -Otarget' --define '_pld_builder 1' --define '_topdir /tmp/B.4rZhKW' --define '_specdir %{_topdir}' --define '_sourcedir %{_specdir}' --define '_rpmdir %{_topdir}/RPMS' --define '_builddir %{_topdir}/BUILD' --without userspace --target i686-pld-linux --define 'build_kernels head,4.9,4.4,4.1' /tmp/B.4rZhKW/lttng-modules.spec Building target platforms: i686-pld-linux Executing(%prep): /bin/sh -e /tmp/B.4rZhKW/BUILD/tmp/rpm-tmp.20784 + umask 022 + cd /tmp/B.4rZhKW/BUILD + cd /tmp/B.4rZhKW/BUILD + rm -rf lttng-modules-2.9.2 + /usr/bin/bzip2 -dc /tmp/B.4rZhKW/lttng-modules-2.9.2.tar.bz2 + /bin/tar -xf - + STATUS=0 + '[' 0 -ne 0 ']' + cd lttng-modules-2.9.2 + /bin/id -u + '[' 1001 '=' 0 ']' + /bin/id -u + '[' 1001 '=' 0 ']' + /bin/chmod -Rf a+rX,u+w,g-w,o-w . + echo 'Patch #0 (build.patch):' Patch #0 (build.patch): + '[' -f /tmp/B.4rZhKW/build.patch ']' + /bin/cat /tmp/B.4rZhKW/build.patch + /usr/bin/patch -s -p1 + exit 0 Executing(%build): /bin/sh -e /tmp/B.4rZhKW/BUILD/tmp/rpm-tmp.20784 TMP=/home/users/builder/tmp HOME=/home/users/builder PATH=/home/users/builder/GNUstep/Tools:/usr/local/bin:/usr/bin:/bin:/home/users/builder/bin TMPDIR=/tmp/B.4rZhKW/BUILD/tmp + umask 022 + cd /tmp/B.4rZhKW/BUILD + cd lttng-modules-2.9.2 + /usr/bin/make -Otarget -j9 'KERNELDIR=/usr/src/linux' /usr/bin/make -C /usr/src/linux M=/tmp/B.4rZhKW/BUILD/lttng-modules-2.9.2 CONFIG_LTTNG=m CONFIG_LTTNG_CLOCK_PLUGIN_TEST=m modules CC [M] /tmp/B.4rZhKW/BUILD/lttng-modules-2.9.2/lttng-clock.o CC [M] /tmp/B.4rZhKW/BUILD/lttng-modules-2.9.2/lttng-ring-buffer-metadata-mmap-client.o CC [M] /tmp/B.4rZhKW/BUILD/lttng-modules-2.9.2/lttng-ring-buffer-metadata-client.o CC [M] /tmp/B.4rZhKW/BUILD/lttng-modules-2.9.2/lttng-abi.o CC [M] /tmp/B.4rZhKW/BUILD/lttng-modules-2.9.2/lttng-ring-buffer-client-mmap-discard.o CC [M] /tmp/B.4rZhKW/BUILD/lttng-modules-2.9.2/lttng-ring-buffer-client-overwrite.o CC [M] /tmp/B.4rZhKW/BUILD/lttng-modules-2.9.2/lttng-ring-buffer-client-discard.o CC [M] /tmp/B.4rZhKW/BUILD/lttng-modules-2.9.2/lttng-ring-buffer-client-mmap-overwrite.o CC [M] /tmp/B.4rZhKW/BUILD/lttng-modules-2.9.2/lttng-context-pid.o CC [M] /tmp/B.4rZhKW/BUILD/lttng-modules-2.9.2/lttng-probes.o CC [M] /tmp/B.4rZhKW/BUILD/lttng-modules-2.9.2/lttng-context.o CC [M] /tmp/B.4rZhKW/BUILD/lttng-modules-2.9.2/lttng-context-procname.o CC [M] /tmp/B.4rZhKW/BUILD/lttng-modules-2.9.2/lttng-context-prio.o CC [M] /tmp/B.4rZhKW/BUILD/lttng-modules-2.9.2/lttng-context-nice.o CC [M] /tmp/B.4rZhKW/BUILD/lttng-modules-2.9.2/lttng-events.o CC [M] /tmp/B.4rZhKW/BUILD/lttng-modules-2.9.2/lttng-context-tid.o CC [M] /tmp/B.4rZhKW/BUILD/lttng-modules-2.9.2/lttng-context-vpid.o CC [M] /tmp/B.4rZhKW/BUILD/lttng-modules-2.9.2/lttng-context-vtid.o CC [M] /tmp/B.4rZhKW/BUILD/lttng-modules-2.9.2/lttng-context-ppid.o CC [M] /tmp/B.4rZhKW/BUILD/lttng-modules-2.9.2/lttng-context-cpu-id.o CC [M] /tmp/B.4rZhKW/BUILD/lttng-modules-2.9.2/lttng-context-need-reschedule.o CC [M] /tmp/B.4rZhKW/BUILD/lttng-modules-2.9.2/lttng-context-vppid.o CC [M] /tmp/B.4rZhKW/BUILD/lttng-modules-2.9.2/lttng-context-interruptible.o CC [M] /tmp/B.4rZhKW/BUILD/lttng-modules-2.9.2/lttng-calibrate.o CC [M] /tmp/B.4rZhKW/BUILD/lttng-modules-2.9.2/wrapper/random.o CC [M] /tmp/B.4rZhKW/BUILD/lttng-modules-2.9.2/lttng-context-hostname.o CC [M] /tmp/B.4rZhKW/BUILD/lttng-modules-2.9.2/wrapper/trace-clock.o CC [M] /tmp/B.4rZhKW/BUILD/lttng-modules-2.9.2/wrapper/page_alloc.o CC [M] /tmp/B.4rZhKW/BUILD/lttng-modules-2.9.2/probes/lttng-probe-user.o CC [M] /tmp/B.4rZhKW/BUILD/lttng-modules-2.9.2/lttng-filter.o CC [M] /tmp/B.4rZhKW/BUILD/lttng-modules-2.9.2/probes/lttng.o CC [M] /tmp/B.4rZhKW/BUILD/lttng-modules-2.9.2/lttng-tracker-pid.o CC [M] /tmp/B.4rZhKW/BUILD/lttng-modules-2.9.2/lttng-filter-interpreter.o CC [M] /tmp/B.4rZhKW/BUILD/lttng-modules-2.9.2/lttng-filter-validator.o CC [M] /tmp/B.4rZhKW/BUILD/lttng-modules-2.9.2/lttng-filter-specialize.o CC [M] /tmp/B.4rZhKW/BUILD/lttng-modules-2.9.2/lttng-context-perf-counters.o CC [M] /tmp/B.4rZhKW/BUILD/lttng-modules-2.9.2/lttng-tracepoint.o CC [M] /tmp/B.4rZhKW/BUILD/lttng-modules-2.9.2/wrapper/irqdesc.o CC [M] /tmp/B.4rZhKW/BUILD/lttng-modules-2.9.2/wrapper/fdtable.o CC [M] /tmp/B.4rZhKW/BUILD/lttng-modules-2.9.2/lib/ringbuffer/ring_buffer_splice.o /tmp/B.4rZhKW/BUILD/lttng-modules-2.9.2/lib/ringbuffer/ring_buffer_splice.c: In function 'subbuf_splice_actor': /tmp/B.4rZhKW/BUILD/lttng-modules-2.9.2/lib/ringbuffer/ring_buffer_splice.c:98:3: error: unknown field 'flags' specified in initializer .flags = flags, ^ make[3]: *** [scripts/Makefile.build:302: /tmp/B.4rZhKW/BUILD/lttng-modules-2.9.2/lib/ringbuffer/ring_buffer_splice.o] Error 1 make[3]: *** Waiting for unfinished jobs.... CC [M] /tmp/B.4rZhKW/BUILD/lttng-modules-2.9.2/lttng-statedump-impl.o LD [M] /tmp/B.4rZhKW/BUILD/lttng-modules-2.9.2/lttng-statedump.o CC [M] /tmp/B.4rZhKW/BUILD/lttng-modules-2.9.2/lib/ringbuffer/ring_buffer_vfs.o CC [M] /tmp/B.4rZhKW/BUILD/lttng-modules-2.9.2/lib/ringbuffer/ring_buffer_backend.o CC [M] /tmp/B.4rZhKW/BUILD/lttng-modules-2.9.2/lib/ringbuffer/ring_buffer_iterator.o CC [M] /tmp/B.4rZhKW/BUILD/lttng-modules-2.9.2/tests/probes/lttng-test.o LD [M] /tmp/B.4rZhKW/BUILD/lttng-modules-2.9.2/tests/lttng-test.o CC [M] /tmp/B.4rZhKW/BUILD/lttng-modules-2.9.2/probes/lttng-probe-sched.o In file included from /tmp/B.4rZhKW/BUILD/lttng-modules-2.9.2/probes/../probes/define_trace.h:100:0, from /tmp/B.4rZhKW/BUILD/lttng-modules-2.9.2/probes/../instrumentation/events/lttng-module/sched.h:566, from /tmp/B.4rZhKW/BUILD/lttng-modules-2.9.2/probes/lttng-probe-sched.c:41: /tmp/B.4rZhKW/BUILD/lttng-modules-2.9.2/probes/../probes/lttng-tracepoint-event-impl.h:142:6: error: conflicting types for 'trace_sched_pi_setprio' void trace_##_name(_proto); ^ /tmp/B.4rZhKW/BUILD/lttng-modules-2.9.2/probes/../probes/lttng-tracepoint-event-impl.h:54:2: note: in expansion of macro 'LTTNG_TRACEPOINT_EVENT_INSTANCE_MAP' LTTNG_TRACEPOINT_EVENT_INSTANCE_MAP(map, name, map, PARAMS(proto), PARAMS(args)) ^~~~~~~~~~~~~~~~~~~~~~~~~~~~~~~~~~~ /tmp/B.4rZhKW/BUILD/lttng-modules-2.9.2/probes/../probes/lttng-tracepoint-event-impl.h:96:2: note: in expansion of macro 'LTTNG_TRACEPOINT_EVENT_MAP' LTTNG_TRACEPOINT_EVENT_MAP(name, name, \ ^~~~~~~~~~~~~~~~~~~~~~~~~~ /tmp/B.4rZhKW/BUILD/lttng-modules-2.9.2/probes/../instrumentation/events/lttng-module/sched.h:548:1: note: in expansion of macro 'LTTNG_TRACEPOINT_EVENT' LTTNG_TRACEPOINT_EVENT(sched_pi_setprio, ^~~~~~~~~~~~~~~~~~~~~~ In file included from ./include/trace/events/sched.h:8:0, from /tmp/B.4rZhKW/BUILD/lttng-modules-2.9.2/probes/lttng-probe-sched.c:30: ./include/linux/tracepoint.h:186:21: note: previous definition of 'trace_sched_pi_setprio' was here static inline void trace_##name(proto) \ ^ ./include/linux/tracepoint.h:351:2: note: in expansion of macro '__DECLARE_TRACE' __DECLARE_TRACE(name, PARAMS(proto), PARAMS(args), \ ^~~~~~~~~~~~~~~ ./include/linux/tracepoint.h:487:2: note: in expansion of macro 'DECLARE_TRACE' DECLARE_TRACE(name, PARAMS(proto), PARAMS(args)) ^~~~~~~~~~~~~ ./include/trace/events/sched.h:415:1: note: in expansion of macro 'TRACE_EVENT' TRACE_EVENT(sched_pi_setprio, ^~~~~~~~~~~ make[3]: *** [scripts/Makefile.build:308: /tmp/B.4rZhKW/BUILD/lttng-modules-2.9.2/probes/lttng-probe-sched.o] Error 1 make[3]: *** Waiting for unfinished jobs.... CC [M] /tmp/B.4rZhKW/BUILD/lttng-modules-2.9.2/lib/ringbuffer/ring_buffer_frontend.o make[2]: *** [scripts/Makefile.build:561: /tmp/B.4rZhKW/BUILD/lttng-modules-2.9.2/lib] Error 2 make[2]: *** Waiting for unfinished jobs.... CC [M] /tmp/B.4rZhKW/BUILD/lttng-modules-2.9.2/probes/lttng-probe-irq.o CC [M] /tmp/B.4rZhKW/BUILD/lttng-modules-2.9.2/probes/lttng-probe-module.o CC [M] /tmp/B.4rZhKW/BUILD/lttng-modules-2.9.2/probes/lttng-probe-timer.o CC [M] /tmp/B.4rZhKW/BUILD/lttng-modules-2.9.2/probes/lttng-probe-kmem.o CC [M] /tmp/B.4rZhKW/BUILD/lttng-modules-2.9.2/probes/lttng-probe-power.o make[2]: *** [scripts/Makefile.build:561: /tmp/B.4rZhKW/BUILD/lttng-modules-2.9.2/probes] Error 2 CC [M] /tmp/B.4rZhKW/BUILD/lttng-modules-2.9.2/tests/clock-plugin/lttng-clock-plugin-test.o LD [M] /tmp/B.4rZhKW/BUILD/lttng-modules-2.9.2/tests/lttng-clock-plugin-test.o CC [M] /tmp/B.4rZhKW/BUILD/lttng-modules-2.9.2/lttng-syscalls.o make[1]: *** [Makefile:1515: _module_/tmp/B.4rZhKW/BUILD/lttng-modules-2.9.2] Error 2 make: *** [Makefile:110: modules] Error 2 error: Bad exit status from /tmp/B.4rZhKW/BUILD/tmp/rpm-tmp.20784 (%build) RPM build errors: Bad exit status from /tmp/B.4rZhKW/BUILD/tmp/rpm-tmp.20784 (%build) ended at: Mon Jul 31 19:42:33 2017, done in 0:00:21.941031 error: No files produced. + chmod -R u+rwX /tmp/B.4rZhKW/BUILD + rm -rf /tmp/B.4rZhKW/tmp /tmp/B.4rZhKW/BUILD + rm -rf /tmp/B.4rZhKW Begin-PLD-Builder-Info Build-Time: user:44.30s sys:3.29s real:32.15s (faults io:0 non-io:1051878) End-PLD-Builder-Info
[Back to list of logs] [View rpm -qa of builder]