FailedOk

th/SRPMS[OK]
th/x32[OK]
th/i686[OK]
th/x86_64[OK]

ac/SRPMS[OK]
ac/i386[OK]
ac/i586[OK]
ac/i686[OK]
ac/alpha[OK]
ac/amd64[OK]
ac/athlon[OK]
ac/ppc[OK]
ac/sparc[OK]
ac/sparc64[OK]

Advanced Search
main()
Powered by PLD Linux
(c) 2002-2021 PLD Team
$Revision: 1.37 $
Powered by sfistak.
Your IP: 3.237.97.64

lttng-modules d18b7222-1aa9-405d-9a22-dc58f4644c80

Status:Failed
Source URL:https://buildlogs.pld-linux.org/pld/th/i686/FAIL/lttng-modules,d18b7222-1aa9-405d-9a22-dc58f4644c80.bz2
text/plain URL:View!
rpm -qa of builder:View!
Date:2021/02/23 13:11:20
Runtime:0:01:52.438962

Toc:

  • error 1
  • rpm: error: Failed build dependencies:
  • error 2
  • rpm: error: Failed build dependencies:
  • prep
  • Executing(%prep): /bin/sh -e /tmp/B.tmfHCy/BUILD/tmp/rpm-tmp.fMK7Mb
  • build
  • Executing(%build): /bin/sh -e /tmp/B.tmfHCy/BUILD/tmp/rpm-tmp.rI3uXy
  • error 3
  • - SSL error:02001002:system library:fopen:No such file or directory: crypto/bio/bss_file.c:69
  • error 4
  • - SSL error:2006D080:BIO routines:BIO_new_file:no such file: crypto/bio/bss_file.c:76
  • error 5
  • - SSL error:02001002:system library:fopen:No such file or directory: crypto/bio/bss_file.c:69
  • error 6
  • - SSL error:2006D080:BIO routines:BIO_new_file:no such file: crypto/bio/bss_file.c:76
  • error 7
  • - SSL error:02001002:system library:fopen:No such file or directory: crypto/bio/bss_file.c:69
  • error 8
  • - SSL error:2006D080:BIO routines:BIO_new_file:no such file: crypto/bio/bss_file.c:76
  • error 9
  • - SSL error:02001002:system library:fopen:No such file or directory: crypto/bio/bss_file.c:69
  • error 10
  • - SSL error:2006D080:BIO routines:BIO_new_file:no such file: crypto/bio/bss_file.c:76
  • error 11
  • - SSL error:02001002:system library:fopen:No such file or directory: crypto/bio/bss_file.c:69
  • error 12
  • - SSL error:2006D080:BIO routines:BIO_new_file:no such file: crypto/bio/bss_file.c:76
  • error 13
  • - SSL error:02001002:system library:fopen:No such file or directory: crypto/bio/bss_file.c:69
  • error 14
  • - SSL error:2006D080:BIO routines:BIO_new_file:no such file: crypto/bio/bss_file.c:76
  • error 15
  • - SSL error:02001002:system library:fopen:No such file or directory: crypto/bio/bss_file.c:69
  • error 16
  • - SSL error:2006D080:BIO routines:BIO_new_file:no such file: crypto/bio/bss_file.c:76
  • error 17
  • - SSL error:02001002:system library:fopen:No such file or directory: crypto/bio/bss_file.c:69
  • error 18
  • - SSL error:2006D080:BIO routines:BIO_new_file:no such file: crypto/bio/bss_file.c:76
  • error 19
  • - SSL error:02001002:system library:fopen:No such file or directory: crypto/bio/bss_file.c:69
  • error 20
  • - SSL error:2006D080:BIO routines:BIO_new_file:no such file: crypto/bio/bss_file.c:76
  • error 21
  • - SSL error:02001002:system library:fopen:No such file or directory: crypto/bio/bss_file.c:69
  • error 22
  • - SSL error:2006D080:BIO routines:BIO_new_file:no such file: crypto/bio/bss_file.c:76
  • error 23
  • - SSL error:02001002:system library:fopen:No such file or directory: crypto/bio/bss_file.c:69
  • error 24
  • - SSL error:2006D080:BIO routines:BIO_new_file:no such file: crypto/bio/bss_file.c:76
  • error 25
  • - SSL error:02001002:system library:fopen:No such file or directory: crypto/bio/bss_file.c:69
  • error 26
  • - SSL error:2006D080:BIO routines:BIO_new_file:no such file: crypto/bio/bss_file.c:76
  • error 27
  • - SSL error:02001002:system library:fopen:No such file or directory: crypto/bio/bss_file.c:69
  • error 28
  • - SSL error:2006D080:BIO routines:BIO_new_file:no such file: crypto/bio/bss_file.c:76
  • error 29
  • - SSL error:02001002:system library:fopen:No such file or directory: crypto/bio/bss_file.c:69
  • error 30
  • - SSL error:2006D080:BIO routines:BIO_new_file:no such file: crypto/bio/bss_file.c:76
  • error 31
  • - SSL error:02001002:system library:fopen:No such file or directory: crypto/bio/bss_file.c:69
  • error 32
  • - SSL error:2006D080:BIO routines:BIO_new_file:no such file: crypto/bio/bss_file.c:76
  • error 33
  • - SSL error:02001002:system library:fopen:No such file or directory: crypto/bio/bss_file.c:69
  • error 34
  • - SSL error:2006D080:BIO routines:BIO_new_file:no such file: crypto/bio/bss_file.c:76
  • error 35
  • - SSL error:02001002:system library:fopen:No such file or directory: crypto/bio/bss_file.c:69
  • error 36
  • - SSL error:2006D080:BIO routines:BIO_new_file:no such file: crypto/bio/bss_file.c:76
  • error 37
  • - SSL error:02001002:system library:fopen:No such file or directory: crypto/bio/bss_file.c:69
  • error 38
  • - SSL error:2006D080:BIO routines:BIO_new_file:no such file: crypto/bio/bss_file.c:76
  • error 39
  • - SSL error:02001002:system library:fopen:No such file or directory: crypto/bio/bss_file.c:69
  • error 40
  • - SSL error:2006D080:BIO routines:BIO_new_file:no such file: crypto/bio/bss_file.c:76
  • error 41
  • - SSL error:02001002:system library:fopen:No such file or directory: crypto/bio/bss_file.c:69
  • error 42
  • - SSL error:2006D080:BIO routines:BIO_new_file:no such file: crypto/bio/bss_file.c:76
  • error 43
  • - SSL error:02001002:system library:fopen:No such file or directory: crypto/bio/bss_file.c:69
  • error 44
  • - SSL error:2006D080:BIO routines:BIO_new_file:no such file: crypto/bio/bss_file.c:76
  • error 45
  • - SSL error:02001002:system library:fopen:No such file or directory: crypto/bio/bss_file.c:69
  • error 46
  • - SSL error:2006D080:BIO routines:BIO_new_file:no such file: crypto/bio/bss_file.c:76
  • error 47
  • - SSL error:02001002:system library:fopen:No such file or directory: crypto/bio/bss_file.c:69
  • error 48
  • - SSL error:2006D080:BIO routines:BIO_new_file:no such file: crypto/bio/bss_file.c:76
  • error 49
  • - SSL error:02001002:system library:fopen:No such file or directory: crypto/bio/bss_file.c:69
  • error 50
  • - SSL error:2006D080:BIO routines:BIO_new_file:no such file: crypto/bio/bss_file.c:76
  • error 51
  • - SSL error:02001002:system library:fopen:No such file or directory: crypto/bio/bss_file.c:69
  • error 52
  • - SSL error:2006D080:BIO routines:BIO_new_file:no such file: crypto/bio/bss_file.c:76
  • error 53
  • - SSL error:02001002:system library:fopen:No such file or directory: crypto/bio/bss_file.c:69
  • error 54
  • - SSL error:2006D080:BIO routines:BIO_new_file:no such file: crypto/bio/bss_file.c:76
  • error 55
  • - SSL error:02001002:system library:fopen:No such file or directory: crypto/bio/bss_file.c:69
  • error 56
  • - SSL error:2006D080:BIO routines:BIO_new_file:no such file: crypto/bio/bss_file.c:76
  • error 57
  • - SSL error:02001002:system library:fopen:No such file or directory: crypto/bio/bss_file.c:69
  • error 58
  • - SSL error:2006D080:BIO routines:BIO_new_file:no such file: crypto/bio/bss_file.c:76
  • error 59
  • - SSL error:02001002:system library:fopen:No such file or directory: crypto/bio/bss_file.c:69
  • error 60
  • - SSL error:2006D080:BIO routines:BIO_new_file:no such file: crypto/bio/bss_file.c:76
  • error 61
  • - SSL error:02001002:system library:fopen:No such file or directory: crypto/bio/bss_file.c:69
  • error 62
  • - SSL error:2006D080:BIO routines:BIO_new_file:no such file: crypto/bio/bss_file.c:76
  • error 63
  • - SSL error:02001002:system library:fopen:No such file or directory: crypto/bio/bss_file.c:69
  • error 64
  • - SSL error:2006D080:BIO routines:BIO_new_file:no such file: crypto/bio/bss_file.c:76
  • error 65
  • - SSL error:02001002:system library:fopen:No such file or directory: crypto/bio/bss_file.c:69
  • error 66
  • - SSL error:2006D080:BIO routines:BIO_new_file:no such file: crypto/bio/bss_file.c:76
  • error 67
  • - SSL error:02001002:system library:fopen:No such file or directory: crypto/bio/bss_file.c:69
  • error 68
  • - SSL error:2006D080:BIO routines:BIO_new_file:no such file: crypto/bio/bss_file.c:76
  • error 69
  • - SSL error:02001002:system library:fopen:No such file or directory: crypto/bio/bss_file.c:69
  • error 70
  • - SSL error:2006D080:BIO routines:BIO_new_file:no such file: crypto/bio/bss_file.c:76
  • error 71
  • - SSL error:02001002:system library:fopen:No such file or directory: crypto/bio/bss_file.c:69
  • error 72
  • - SSL error:2006D080:BIO routines:BIO_new_file:no such file: crypto/bio/bss_file.c:76
  • error 73
  • - SSL error:02001002:system library:fopen:No such file or directory: crypto/bio/bss_file.c:69
  • error 74
  • - SSL error:2006D080:BIO routines:BIO_new_file:no such file: crypto/bio/bss_file.c:76
  • error 75
  • - SSL error:02001002:system library:fopen:No such file or directory: crypto/bio/bss_file.c:69
  • error 76
  • - SSL error:2006D080:BIO routines:BIO_new_file:no such file: crypto/bio/bss_file.c:76
  • error 77
  • - SSL error:02001002:system library:fopen:No such file or directory: crypto/bio/bss_file.c:69
  • error 78
  • - SSL error:2006D080:BIO routines:BIO_new_file:no such file: crypto/bio/bss_file.c:76
  • error 79
  • - SSL error:02001002:system library:fopen:No such file or directory: crypto/bio/bss_file.c:69
  • error 80
  • - SSL error:2006D080:BIO routines:BIO_new_file:no such file: crypto/bio/bss_file.c:76
  • error 81
  • - SSL error:02001002:system library:fopen:No such file or directory: crypto/bio/bss_file.c:69
  • error 82
  • - SSL error:2006D080:BIO routines:BIO_new_file:no such file: crypto/bio/bss_file.c:76
  • error 83
  • - SSL error:02001002:system library:fopen:No such file or directory: crypto/bio/bss_file.c:69
  • error 84
  • - SSL error:2006D080:BIO routines:BIO_new_file:no such file: crypto/bio/bss_file.c:76
  • error 85
  • - SSL error:02001002:system library:fopen:No such file or directory: crypto/bio/bss_file.c:69
  • error 86
  • - SSL error:2006D080:BIO routines:BIO_new_file:no such file: crypto/bio/bss_file.c:76
  • error 87
  • - SSL error:02001002:system library:fopen:No such file or directory: crypto/bio/bss_file.c:69
  • error 88
  • - SSL error:2006D080:BIO routines:BIO_new_file:no such file: crypto/bio/bss_file.c:76
  • error 89
  • - SSL error:02001002:system library:fopen:No such file or directory: crypto/bio/bss_file.c:69
  • error 90
  • - SSL error:2006D080:BIO routines:BIO_new_file:no such file: crypto/bio/bss_file.c:76
  • error 91
  • - SSL error:02001002:system library:fopen:No such file or directory: crypto/bio/bss_file.c:69
  • error 92
  • - SSL error:2006D080:BIO routines:BIO_new_file:no such file: crypto/bio/bss_file.c:76
  • error 93
  • - SSL error:02001002:system library:fopen:No such file or directory: crypto/bio/bss_file.c:69
  • error 94
  • - SSL error:2006D080:BIO routines:BIO_new_file:no such file: crypto/bio/bss_file.c:76
  • error 95
  • - SSL error:02001002:system library:fopen:No such file or directory: crypto/bio/bss_file.c:69
  • error 96
  • - SSL error:2006D080:BIO routines:BIO_new_file:no such file: crypto/bio/bss_file.c:76
  • error 97
  • - SSL error:02001002:system library:fopen:No such file or directory: crypto/bio/bss_file.c:69
  • error 98
  • - SSL error:2006D080:BIO routines:BIO_new_file:no such file: crypto/bio/bss_file.c:76
  • error 99
  • - SSL error:02001002:system library:fopen:No such file or directory: crypto/bio/bss_file.c:69
  • error 100
  • - SSL error:2006D080:BIO routines:BIO_new_file:no such file: crypto/bio/bss_file.c:76
  • error 101
  • - SSL error:02001002:system library:fopen:No such file or directory: crypto/bio/bss_file.c:69
  • error 102
  • - SSL error:2006D080:BIO routines:BIO_new_file:no such file: crypto/bio/bss_file.c:76
  • error 103
  • - SSL error:02001002:system library:fopen:No such file or directory: crypto/bio/bss_file.c:69
  • error 104
  • - SSL error:2006D080:BIO routines:BIO_new_file:no such file: crypto/bio/bss_file.c:76
  • error 105
  • - SSL error:02001002:system library:fopen:No such file or directory: crypto/bio/bss_file.c:69
  • error 106
  • - SSL error:2006D080:BIO routines:BIO_new_file:no such file: crypto/bio/bss_file.c:76
  • error 107
  • - SSL error:02001002:system library:fopen:No such file or directory: crypto/bio/bss_file.c:69
  • error 108
  • - SSL error:2006D080:BIO routines:BIO_new_file:no such file: crypto/bio/bss_file.c:76
  • error 109
  • - SSL error:02001002:system library:fopen:No such file or directory: crypto/bio/bss_file.c:69
  • error 110
  • - SSL error:2006D080:BIO routines:BIO_new_file:no such file: crypto/bio/bss_file.c:76
  • error 111
  • /tmp/B.tmfHCy/BUILD/lttng-modules-2.12.3/lttng-modules-2.12.3/probes/../probes/lttng-tracepoint-event-impl.h:131:6: error: conflicting types for 'trace_block_rq_requeue'
  • error 112
  • /tmp/B.tmfHCy/BUILD/lttng-modules-2.12.3/lttng-modules-2.12.3/probes/../probes/lttng-tracepoint-event-impl.h:131:6: error: conflicting types for 'trace_block_rq_insert'
  • error 113
  • /tmp/B.tmfHCy/BUILD/lttng-modules-2.12.3/lttng-modules-2.12.3/probes/../probes/lttng-tracepoint-event-impl.h:131:6: error: conflicting types for 'trace_block_rq_issue'
  • error 114
  • /tmp/B.tmfHCy/BUILD/lttng-modules-2.12.3/lttng-modules-2.12.3/probes/../probes/lttng-tracepoint-event-impl.h:131:6: error: conflicting types for 'trace_block_bio_bounce'
  • error 115
  • /tmp/B.tmfHCy/BUILD/lttng-modules-2.12.3/lttng-modules-2.12.3/probes/../probes/lttng-tracepoint-event-impl.h:131:6: error: conflicting types for 'trace_block_bio_backmerge'
  • error 116
  • /tmp/B.tmfHCy/BUILD/lttng-modules-2.12.3/lttng-modules-2.12.3/probes/../probes/lttng-tracepoint-event-impl.h:131:6: error: conflicting types for 'trace_block_bio_frontmerge'
  • error 117
  • /tmp/B.tmfHCy/BUILD/lttng-modules-2.12.3/lttng-modules-2.12.3/probes/../probes/lttng-tracepoint-event-impl.h:131:6: error: conflicting types for 'trace_block_bio_queue'
  • error 118
  • /tmp/B.tmfHCy/BUILD/lttng-modules-2.12.3/lttng-modules-2.12.3/probes/../probes/lttng-tracepoint-event-impl.h:131:6: error: conflicting types for 'trace_block_getrq'
  • error 119
  • /tmp/B.tmfHCy/BUILD/lttng-modules-2.12.3/lttng-modules-2.12.3/probes/../probes/lttng-tracepoint-event-impl.h:131:6: error: conflicting types for 'trace_block_split'
  • error 120
  • /tmp/B.tmfHCy/BUILD/lttng-modules-2.12.3/lttng-modules-2.12.3/probes/../probes/lttng-tracepoint-event-impl.h:131:6: error: conflicting types for 'trace_block_bio_remap'
  • error 121
  • /tmp/B.tmfHCy/BUILD/lttng-modules-2.12.3/lttng-modules-2.12.3/probes/../probes/lttng-tracepoint-event-impl.h:131:6: error: conflicting types for 'trace_block_rq_remap'
  • error 122
  • make[3]: *** [scripts/Makefile.build:279: /tmp/B.tmfHCy/BUILD/lttng-modules-2.12.3/lttng-modules-2.12.3/probes/lttng-probe-block.o] Error 1
  • error 123
  • make[2]: *** [scripts/Makefile.build:496: /tmp/B.tmfHCy/BUILD/lttng-modules-2.12.3/lttng-modules-2.12.3/probes] Error 2
  • error 124
  • make[1]: *** [Makefile:1800: /tmp/B.tmfHCy/BUILD/lttng-modules-2.12.3/lttng-modules-2.12.3] Error 2
  • error 125
  • error: Bad exit status from /tmp/B.tmfHCy/BUILD/tmp/rpm-tmp.rI3uXy (%build)
  • error 126
  • RPM build errors:
  • error 127
  • error: No files produced.

Content:

request from: baggins
checking if we should skip the build
started at: Tue Feb 23 13:07:57 2021
killing old processes on a builder
sending signal 9 to pid -1
cleaning up /tmp
fetching https://srcbuilder.pld-linux.org/th//srpms/d18b7222-1aa9-405d-9a22-dc58f4644c80/lttng-modules-2.12.3-2%405.11.0_1.src.rpm
fetched 344521 bytes, 739.6 K/s
installing srpm: lttng-modules-2.12.3-2@5.11.0_1.src.rpm
+ install -d /tmp/B.tmfHCy/BUILD /tmp/B.tmfHCy/RPMS
+ LC_ALL=en_US.UTF-8
+ rpm -qp --changelog lttng-modules-2.12.3-2@5.11.0_1.src.rpm
* Tue Feb 23 2021 PLD Linux Team <feedback@pld-linux.org>
- For complete changelog see: http://git.pld-linux.org/?p=packages/lttng-modules.git;a=log;h=master
* Sat Feb 06 2021 Jan Rękorajski <baggins@pld-linux.org> abf0d8a
- fix building with kernel 4.9.256 - rel 2 * Sat Nov 28 2020 Jan Rękorajski <baggins@pld-linux.org> b704ebb
- up to 2.2.13 + latest fixes * Sat Sep 26 2020 Jan Rękorajski <baggins@pld-linux.org> f9dfa75
- add fixes from upstream git with fixes to build modules on recent kernels - rel 2 * Sun Aug 16 2020 Jan Rękorajski <baggins@pld-linux.org> aa9cd3d
- up to 2.12.2 * Fri Jun 05 2020 Jan Rękorajski <baggins@pld-linux.org> 10babb8
- up to 2.12.1 * Tue Apr 14 2020 Jakub Bogusz <qboosh@pld-linux.org> 9a3ded0
- updated to 2.12.0 (for Linux 3.0+; ftrace integration dropped) - removed obsolete kernel-5.5.3 patch * Sat Apr 04 2020 Jan Rękorajski <baggins@pld-linux.org> 3efbae2
- up to 2.11.2 * Sun Feb 23 2020 Jan Rękorajski <baggins@pld-linux.org> 87b6b5d
- fix version macro * Sun Feb 23 2020 Jan Rękorajski <baggins@pld-linux.org> e66d568
- 4.14 doesn't need this * Sun Feb 23 2020 Jan Rękorajski <baggins@pld-linux.org> 50a7834
- enable fix on all kernels * Sun Feb 23 2020 Jan Rękorajski <baggins@pld-linux.org> 0c8875f
- 5.4 also needs this * Sun Feb 23 2020 Jan Rękorajski <baggins@pld-linux.org> bbbacb5
- fix paths in patch * Sun Feb 23 2020 Jan Rękorajski <baggins@pld-linux.org> d4618bf
- fix building with kernel 5.5.3+ - rel 2 * Wed Jan 29 2020 Jan Rękorajski <baggins@pld-linux.org> 4144a1b
- up to 2.11.1 * Sun Dec 01 2019 Jan Rękorajski <baggins@pld-linux.org> b91196d
- rework build dirs to make sure we clean them between building for different kernels - rel 2 * Sat Nov 30 2019 Jan Rękorajski <baggins@pld-linux.org> 04f5de0
- up to 2.11.0 * Sat Oct 26 2019 Jakub Bogusz <qboosh@pld-linux.org> e3bbd49
- updated to 2.10.12 * Fri Jul 12 2019 Jan Rękorajski <baggins@pld-linux.org> 882dfc8
- up to 2.10.10 * Tue May 07 2019 Jan Rękorajski <baggins@pld-linux.org> 8cdc335
- fix building with kernel 5.1 - rel 2 * Fri Mar 29 2019 Jakub Bogusz <qboosh@pld-linux.org> c281bdf
- updated to 2.10.9 - removed obsolete kernel-4.20,kernel-5.0 patches + rpm -Uhv --nodeps --define '_topdir /tmp/B.tmfHCy' --define '_specdir %{_topdir}' --define '_sourcedir %{_specdir}' --define '_rpmdir %{_topdir}/RPMS' --define '_builddir %{_topdir}/BUILD' --without userspace --define 'build_kernels 4.9,5.10,head,4.14,4.19,5.4' lttng-modules-2.12.3-2@5.11.0_1.src.rpm Updating / installing... lttng-modules-2.12.3-2@5.11.0_1 ######################################## + rm -f lttng-modules-2.12.3-2@5.11.0_1.src.rpm + install -m 700 -d /tmp/B.tmfHCy/BUILD/tmp + TMPDIR=/tmp/B.tmfHCy/BUILD/tmp + exec nice -n 0 rpmbuild -bp --short-circuit --nodeps --define '_topdir /tmp/B.tmfHCy' --define '_specdir %{_topdir}' --define '_sourcedir %{_specdir}' --define '_rpmdir %{_topdir}/RPMS' --define '_builddir %{_topdir}/BUILD' --without userspace --target i686-pld-linux --define 'build_kernels 4.9,5.10,head,4.14,4.19,5.4' --define 'prep exit 0' /tmp/B.tmfHCy/lttng-modules.spec warning: Could not canonicalize hostname: nereid Building target platforms: i686-pld-linux Building for target i686-pld-linux checking BuildConflict-ing packages no BuildConflicts found checking BR rpm: warning: Could not canonicalize hostname: nereid rpm: error: Failed build dependencies: rpm: kernel-5.10-source >= 3:3.0 is needed by lttng-modules-2.12.3-2@5.11.0_1.i686 rpm: Building target platforms: i686-pld-linux rpm: Building for target i686-pld-linux updating poldek cache... ready is up to date th is up to date th is up to date th-ready is up to date th-ready is up to date th-test is up to date th-test is up to date checking conflicting packages in BRed packages poldek: Loading [pndir]ready... poldek: Loading [pndir]th-test... poldek: Loading [pndir]th-test... poldek: Loading [pndir]th-ready... poldek: Loading [pndir]th-ready... poldek: Loading [pndir]th... poldek: Loading [pndir]th... poldek: 29895 packages read poldek: Removed 885 duplicate packages from available set poldek: Processing dependencies... poldek: There are 1 package to install: poldek: A kernel-5.10-source-5.10.17-1 poldek: This operation will use 832.0MB of disk space. poldek: Need to get 104.2MB of archives. poldek: kernel-5.10-source-5.10.17-1.noarch.rpm: digests OK poldek: Executing pm-command.sh --upgrade -vh --test --root / --define _check_dirname_deps 0... poldek: Verifying... ######################################## poldek: Preparing... ######################################## no conflicts found checking BR rpm: warning: Could not canonicalize hostname: nereid rpm: error: Failed build dependencies: rpm: kernel-5.10-source >= 3:3.0 is needed by lttng-modules-2.12.3-2@5.11.0_1.i686 rpm: Building target platforms: i686-pld-linux rpm: Building for target i686-pld-linux installing BR: kernel\-5\.10\-source + poldek --noask --caplookup -Q -v '--ignore=hhvm-*' '--ignore=php4-*' '--ignore=php52-*' '--ignore=php54-*' '--ignore=php55-*' '--ignore=php56-*' '--ignore=php70-*' '--ignore=php71-*' '--ignore=php72-*' '--ignore=php73-*' '--ignore=php74-*' '--ignore=php80-*' --upgrade kernel-5.10-source Loading [pndir]ready... Loading [pndir]th-test... Loading [pndir]th-test... Loading [pndir]th-ready... Loading [pndir]th-ready... Loading [pndir]th... Loading [pndir]th... 29895 packages read Removed 885 duplicate packages from available set Processing dependencies... There are 1 package to install: A kernel-5.10-source-5.10.17-1 This operation will use 832.0MB of disk space. Need to get 104.2MB of archives. kernel-5.10-source-5.10.17-1.noarch.rpm: digests OK Executing pm-command.sh --upgrade -vh --root / --define _check_dirname_deps 0... Verifying... ######################################## Preparing... ######################################## Updating / installing... kernel-5.10-source-3:5.10.17-1 ######################################## building RPM using: set -ex; : build-id: d18b7222-1aa9-405d-9a22-dc58f4644c80; TMPDIR=/tmp/B.tmfHCy/BUILD/tmp exec nice -n 0 rpmbuild -bb --define '_smp_mflags -j9' --define '_make_opts -Otarget' --define '_pld_builder 1' --define '_topdir /tmp/B.tmfHCy' --define '_specdir %{_topdir}' --define '_sourcedir %{_specdir}' --define '_rpmdir %{_topdir}/RPMS' --define '_builddir %{_topdir}/BUILD' --without userspace --target i686-pld-linux --define 'build_kernels 4.9,5.10,head,4.14,4.19,5.4' /tmp/B.tmfHCy/lttng-modules.spec + : build-id: d18b7222-1aa9-405d-9a22-dc58f4644c80 + TMPDIR=/tmp/B.tmfHCy/BUILD/tmp + exec nice -n 0 rpmbuild -bb --define '_smp_mflags -j9' --define '_make_opts -Otarget' --define '_pld_builder 1' --define '_topdir /tmp/B.tmfHCy' --define '_specdir %{_topdir}' --define '_sourcedir %{_specdir}' --define '_rpmdir %{_topdir}/RPMS' --define '_builddir %{_topdir}/BUILD' --without userspace --target i686-pld-linux --define 'build_kernels 4.9,5.10,head,4.14,4.19,5.4' /tmp/B.tmfHCy/lttng-modules.spec warning: Could not canonicalize hostname: nereid Building target platforms: i686-pld-linux Building for target i686-pld-linux Executing(%prep): /bin/sh -e /tmp/B.tmfHCy/BUILD/tmp/rpm-tmp.fMK7Mb + umask 022 + cd /tmp/B.tmfHCy/BUILD + cd /tmp/B.tmfHCy/BUILD + rm -rf lttng-modules-2.12.3 + /bin/mkdir -p lttng-modules-2.12.3 + cd lttng-modules-2.12.3 + /usr/bin/bzip2 -dc /tmp/B.tmfHCy/lttng-modules-2.12.3.tar.bz2 + /bin/tar -xof - + STATUS=0 + '[' 0 -ne 0 ']' + /bin/chmod -Rf a+rX,u+w,g-w,o-w . + cd lttng-modules-2.12.3 + echo 'Patch #0 (build.patch):' Patch #0 (build.patch): + </tmp/B.tmfHCy/build.patch + /usr/bin/patch -s -p1 '--fuzz=0' + echo 'Patch #1 (git.patch):' Patch #1 (git.patch): + </tmp/B.tmfHCy/git.patch + /usr/bin/patch -s -p1 '--fuzz=0' + echo 'Patch #2 (kernel-4.9.256.patch):' Patch #2 (kernel-4.9.256.patch): + </tmp/B.tmfHCy/kernel-4.9.256.patch + /usr/bin/patch -s -p1 '--fuzz=0' + RPM_EC=0 + jobs -p + exit 0 Executing(%build): /bin/sh -e /tmp/B.tmfHCy/BUILD/tmp/rpm-tmp.rI3uXy TMP=/home/users/builder/tmp HOME=/home/users/builder PATH=/home/users/builder/GNUstep/Tools:/bin:/usr/bin:/usr/local/bin:/home/users/builder/bin TMPDIR=/tmp/B.tmfHCy/BUILD/tmp + umask 022 + cd /tmp/B.tmfHCy/BUILD + cd lttng-modules-2.12.3 + cd lttng-modules-2.12.3 + /usr/bin/make -Otarget -j9 clean 'KERNELDIR=/usr/src/linux-4.9' /usr/bin/make -C /usr/src/linux-4.9 M=/tmp/B.tmfHCy/BUILD/lttng-modules-2.12.3/lttng-modules-2.12.3 clean find: '/tmp/B.tmfHCy/BUILD/lttng-modules-2.12.3/lttng-modules-2.12.3/extra_version/patches/': No such file or directory find: '/tmp/B.tmfHCy/BUILD/lttng-modules-2.12.3/lttng-modules-2.12.3/lib/../extra_version/patches/': No such file or directory find: '/tmp/B.tmfHCy/BUILD/lttng-modules-2.12.3/lttng-modules-2.12.3/tests/../extra_version/patches/': No such file or directory find: '/tmp/B.tmfHCy/BUILD/lttng-modules-2.12.3/lttng-modules-2.12.3/probes/../extra_version/patches/': No such file or directory + /usr/bin/make -Otarget -j9 'KERNELDIR=/usr/src/linux-4.9' /usr/bin/make -C /usr/src/linux-4.9 M=/tmp/B.tmfHCy/BUILD/lttng-modules-2.12.3/lttng-modules-2.12.3 CONFIG_LTTNG=m CONFIG_LTTNG_CLOCK_PLUGIN_TEST=m modules find: '/tmp/B.tmfHCy/BUILD/lttng-modules-2.12.3/lttng-modules-2.12.3/extra_version/patches/': No such file or directory CC [M] /tmp/B.tmfHCy/BUILD/lttng-modules-2.12.3/lttng-modules-2.12.3/lttng-clock.o CC [M] /tmp/B.tmfHCy/BUILD/lttng-modules-2.12.3/lttng-modules-2.12.3/lttng-ring-buffer-metadata-client.o CC [M] /tmp/B.tmfHCy/BUILD/lttng-modules-2.12.3/lttng-modules-2.12.3/lttng-string-utils.o CC [M] /tmp/B.tmfHCy/BUILD/lttng-modules-2.12.3/lttng-modules-2.12.3/lttng-abi.o CC [M] /tmp/B.tmfHCy/BUILD/lttng-modules-2.12.3/lttng-modules-2.12.3/lttng-ring-buffer-metadata-mmap-client.o CC [M] /tmp/B.tmfHCy/BUILD/lttng-modules-2.12.3/lttng-modules-2.12.3/lttng-ring-buffer-client-overwrite.o CC [M] /tmp/B.tmfHCy/BUILD/lttng-modules-2.12.3/lttng-modules-2.12.3/lttng-ring-buffer-client-mmap-overwrite.o CC [M] /tmp/B.tmfHCy/BUILD/lttng-modules-2.12.3/lttng-modules-2.12.3/lttng-ring-buffer-client-mmap-discard.o CC [M] /tmp/B.tmfHCy/BUILD/lttng-modules-2.12.3/lttng-modules-2.12.3/lttng-ring-buffer-client-discard.o CC [M] /tmp/B.tmfHCy/BUILD/lttng-modules-2.12.3/lttng-modules-2.12.3/lttng-probes.o CC [M] /tmp/B.tmfHCy/BUILD/lttng-modules-2.12.3/lttng-modules-2.12.3/lttng-context.o CC [M] /tmp/B.tmfHCy/BUILD/lttng-modules-2.12.3/lttng-modules-2.12.3/lttng-context-pid.o CC [M] /tmp/B.tmfHCy/BUILD/lttng-modules-2.12.3/lttng-modules-2.12.3/lttng-context-prio.o CC [M] /tmp/B.tmfHCy/BUILD/lttng-modules-2.12.3/lttng-modules-2.12.3/lttng-context-procname.o CC [M] /tmp/B.tmfHCy/BUILD/lttng-modules-2.12.3/lttng-modules-2.12.3/lttng-context-nice.o CC [M] /tmp/B.tmfHCy/BUILD/lttng-modules-2.12.3/lttng-modules-2.12.3/lttng-events.o CC [M] /tmp/B.tmfHCy/BUILD/lttng-modules-2.12.3/lttng-modules-2.12.3/lttng-context-vpid.o CC [M] /tmp/B.tmfHCy/BUILD/lttng-modules-2.12.3/lttng-modules-2.12.3/lttng-context-tid.o CC [M] /tmp/B.tmfHCy/BUILD/lttng-modules-2.12.3/lttng-modules-2.12.3/lttng-context-vtid.o CC [M] /tmp/B.tmfHCy/BUILD/lttng-modules-2.12.3/lttng-modules-2.12.3/lttng-context-cpu-id.o CC [M] /tmp/B.tmfHCy/BUILD/lttng-modules-2.12.3/lttng-modules-2.12.3/lttng-context-ppid.o CC [M] /tmp/B.tmfHCy/BUILD/lttng-modules-2.12.3/lttng-modules-2.12.3/lttng-context-vppid.o CC [M] /tmp/B.tmfHCy/BUILD/lttng-modules-2.12.3/lttng-modules-2.12.3/lttng-context-euid.o CC [M] /tmp/B.tmfHCy/BUILD/lttng-modules-2.12.3/lttng-modules-2.12.3/lttng-context-uid.o CC [M] /tmp/B.tmfHCy/BUILD/lttng-modules-2.12.3/lttng-modules-2.12.3/lttng-context-suid.o CC [M] /tmp/B.tmfHCy/BUILD/lttng-modules-2.12.3/lttng-modules-2.12.3/lttng-context-gid.o CC [M] /tmp/B.tmfHCy/BUILD/lttng-modules-2.12.3/lttng-modules-2.12.3/lttng-context-egid.o CC [M] /tmp/B.tmfHCy/BUILD/lttng-modules-2.12.3/lttng-modules-2.12.3/lttng-context-sgid.o CC [M] /tmp/B.tmfHCy/BUILD/lttng-modules-2.12.3/lttng-modules-2.12.3/lttng-context-vuid.o CC [M] /tmp/B.tmfHCy/BUILD/lttng-modules-2.12.3/lttng-modules-2.12.3/lttng-context-veuid.o CC [M] /tmp/B.tmfHCy/BUILD/lttng-modules-2.12.3/lttng-modules-2.12.3/lttng-context-vsuid.o CC [M] /tmp/B.tmfHCy/BUILD/lttng-modules-2.12.3/lttng-modules-2.12.3/lttng-context-vegid.o CC [M] /tmp/B.tmfHCy/BUILD/lttng-modules-2.12.3/lttng-modules-2.12.3/lttng-context-vgid.o CC [M] /tmp/B.tmfHCy/BUILD/lttng-modules-2.12.3/lttng-modules-2.12.3/lttng-context-vsgid.o CC [M] /tmp/B.tmfHCy/BUILD/lttng-modules-2.12.3/lttng-modules-2.12.3/lttng-context-interruptible.o CC [M] /tmp/B.tmfHCy/BUILD/lttng-modules-2.12.3/lttng-modules-2.12.3/lttng-context-need-reschedule.o CC [M] /tmp/B.tmfHCy/BUILD/lttng-modules-2.12.3/lttng-modules-2.12.3/lttng-calibrate.o CC [M] /tmp/B.tmfHCy/BUILD/lttng-modules-2.12.3/lttng-modules-2.12.3/lttng-context-hostname.o CC [M] /tmp/B.tmfHCy/BUILD/lttng-modules-2.12.3/lttng-modules-2.12.3/lttng-tracker-id.o CC [M] /tmp/B.tmfHCy/BUILD/lttng-modules-2.12.3/lttng-modules-2.12.3/probes/lttng.o CC [M] /tmp/B.tmfHCy/BUILD/lttng-modules-2.12.3/lttng-modules-2.12.3/lttng-context-callstack.o CC [M] /tmp/B.tmfHCy/BUILD/lttng-modules-2.12.3/lttng-modules-2.12.3/lttng-filter.o CC [M] /tmp/B.tmfHCy/BUILD/lttng-modules-2.12.3/lttng-modules-2.12.3/lttng-tp-mempool.o CC [M] /tmp/B.tmfHCy/BUILD/lttng-modules-2.12.3/lttng-modules-2.12.3/probes/lttng-probe-user.o CC [M] /tmp/B.tmfHCy/BUILD/lttng-modules-2.12.3/lttng-modules-2.12.3/lttng-filter-specialize.o CC [M] /tmp/B.tmfHCy/BUILD/lttng-modules-2.12.3/lttng-modules-2.12.3/lttng-filter-interpreter.o CC [M] /tmp/B.tmfHCy/BUILD/lttng-modules-2.12.3/lttng-modules-2.12.3/lttng-context-perf-counters.o CC [M] /tmp/B.tmfHCy/BUILD/lttng-modules-2.12.3/lttng-modules-2.12.3/lttng-tracepoint.o CC [M] /tmp/B.tmfHCy/BUILD/lttng-modules-2.12.3/lttng-modules-2.12.3/lttng-filter-validator.o CC [M] /tmp/B.tmfHCy/BUILD/lttng-modules-2.12.3/lttng-modules-2.12.3/lttng-context-cgroup-ns.o CC [M] /tmp/B.tmfHCy/BUILD/lttng-modules-2.12.3/lttng-modules-2.12.3/lttng-context-mnt-ns.o CC [M] /tmp/B.tmfHCy/BUILD/lttng-modules-2.12.3/lttng-modules-2.12.3/lttng-context-ipc-ns.o CC [M] /tmp/B.tmfHCy/BUILD/lttng-modules-2.12.3/lttng-modules-2.12.3/wrapper/trace-clock.o CC [M] /tmp/B.tmfHCy/BUILD/lttng-modules-2.12.3/lttng-modules-2.12.3/wrapper/page_alloc.o CC [M] /tmp/B.tmfHCy/BUILD/lttng-modules-2.12.3/lttng-modules-2.12.3/wrapper/random.o CC [M] /tmp/B.tmfHCy/BUILD/lttng-modules-2.12.3/lttng-modules-2.12.3/lttng-context-net-ns.o CC [M] /tmp/B.tmfHCy/BUILD/lttng-modules-2.12.3/lttng-modules-2.12.3/lttng-context-user-ns.o CC [M] /tmp/B.tmfHCy/BUILD/lttng-modules-2.12.3/lttng-modules-2.12.3/lttng-context-pid-ns.o CC [M] /tmp/B.tmfHCy/BUILD/lttng-modules-2.12.3/lttng-modules-2.12.3/lttng-context-uts-ns.o find: '/tmp/B.tmfHCy/BUILD/lttng-modules-2.12.3/lttng-modules-2.12.3/lib/../extra_version/patches/': No such file or directory find: '/tmp/B.tmfHCy/BUILD/lttng-modules-2.12.3/lttng-modules-2.12.3/probes/../extra_version/patches/': No such file or directory CC [M] /tmp/B.tmfHCy/BUILD/lttng-modules-2.12.3/lttng-modules-2.12.3/wrapper/irqdesc.o find: '/tmp/B.tmfHCy/BUILD/lttng-modules-2.12.3/lttng-modules-2.12.3/tests/../extra_version/patches/': No such file or directory CC [M] /tmp/B.tmfHCy/BUILD/lttng-modules-2.12.3/lttng-modules-2.12.3/wrapper/kallsyms.o CC [M] /tmp/B.tmfHCy/BUILD/lttng-modules-2.12.3/lttng-modules-2.12.3/wrapper/fdtable.o CC [M] /tmp/B.tmfHCy/BUILD/lttng-modules-2.12.3/lttng-modules-2.12.3/lttng-wrapper-impl.o CC [M] /tmp/B.tmfHCy/BUILD/lttng-modules-2.12.3/lttng-modules-2.12.3/lib/ringbuffer/ring_buffer_vfs.o LD [M] /tmp/B.tmfHCy/BUILD/lttng-modules-2.12.3/lttng-modules-2.12.3/lttng-wrapper.o CC [M] /tmp/B.tmfHCy/BUILD/lttng-modules-2.12.3/lttng-modules-2.12.3/tests/probes/lttng-test.o CC [M] /tmp/B.tmfHCy/BUILD/lttng-modules-2.12.3/lttng-modules-2.12.3/lib/ringbuffer/ring_buffer_iterator.o CC [M] /tmp/B.tmfHCy/BUILD/lttng-modules-2.12.3/lttng-modules-2.12.3/lib/ringbuffer/ring_buffer_splice.o CC [M] /tmp/B.tmfHCy/BUILD/lttng-modules-2.12.3/lttng-modules-2.12.3/lib/ringbuffer/ring_buffer_backend.o CC [M] /tmp/B.tmfHCy/BUILD/lttng-modules-2.12.3/lttng-modules-2.12.3/lttng-statedump-impl.o CC [M] /tmp/B.tmfHCy/BUILD/lttng-modules-2.12.3/lttng-modules-2.12.3/lib/ringbuffer/ring_buffer_mmap.o CC [M] /tmp/B.tmfHCy/BUILD/lttng-modules-2.12.3/lttng-modules-2.12.3/lib/ringbuffer/ring_buffer_frontend.o CC [M] /tmp/B.tmfHCy/BUILD/lttng-modules-2.12.3/lttng-modules-2.12.3/tests/clock-plugin/lttng-clock-plugin-test.o LD [M] /tmp/B.tmfHCy/BUILD/lttng-modules-2.12.3/lttng-modules-2.12.3/tests/lttng-test.o LD [M] /tmp/B.tmfHCy/BUILD/lttng-modules-2.12.3/lttng-modules-2.12.3/tests/lttng-clock-plugin-test.o CC [M] /tmp/B.tmfHCy/BUILD/lttng-modules-2.12.3/lttng-modules-2.12.3/probes/lttng-probe-sched.o LD [M] /tmp/B.tmfHCy/BUILD/lttng-modules-2.12.3/lttng-modules-2.12.3/lttng-statedump.o CC [M] /tmp/B.tmfHCy/BUILD/lttng-modules-2.12.3/lttng-modules-2.12.3/lib/../wrapper/splice.o CC [M] /tmp/B.tmfHCy/BUILD/lttng-modules-2.12.3/lttng-modules-2.12.3/probes/lttng-probe-irq.o CC [M] /tmp/B.tmfHCy/BUILD/lttng-modules-2.12.3/lttng-modules-2.12.3/lib/prio_heap/lttng_prio_heap.o LD [M] /tmp/B.tmfHCy/BUILD/lttng-modules-2.12.3/lttng-modules-2.12.3/lib/lttng-lib-ring-buffer.o CC [M] /tmp/B.tmfHCy/BUILD/lttng-modules-2.12.3/lttng-modules-2.12.3/probes/lttng-probe-module.o CC [M] /tmp/B.tmfHCy/BUILD/lttng-modules-2.12.3/lttng-modules-2.12.3/probes/lttng-probe-timer.o CC [M] /tmp/B.tmfHCy/BUILD/lttng-modules-2.12.3/lttng-modules-2.12.3/probes/lttng-probe-kmem.o CC [M] /tmp/B.tmfHCy/BUILD/lttng-modules-2.12.3/lttng-modules-2.12.3/probes/lttng-probe-power.o CC [M] /tmp/B.tmfHCy/BUILD/lttng-modules-2.12.3/lttng-modules-2.12.3/probes/lttng-probe-9p.o CC [M] /tmp/B.tmfHCy/BUILD/lttng-modules-2.12.3/lttng-modules-2.12.3/probes/lttng-probe-i2c.o CC [M] /tmp/B.tmfHCy/BUILD/lttng-modules-2.12.3/lttng-modules-2.12.3/probes/lttng-probe-x86-exceptions.o CC [M] /tmp/B.tmfHCy/BUILD/lttng-modules-2.12.3/lttng-modules-2.12.3/probes/lttng-probe-x86-irq-vectors.o CC [M] /tmp/B.tmfHCy/BUILD/lttng-modules-2.12.3/lttng-modules-2.12.3/probes/lttng-probe-signal.o CC [M] /tmp/B.tmfHCy/BUILD/lttng-modules-2.12.3/lttng-modules-2.12.3/probes/lttng-probe-kvm.o CC [M] /tmp/B.tmfHCy/BUILD/lttng-modules-2.12.3/lttng-modules-2.12.3/probes/lttng-probe-statedump.o CC [M] /tmp/B.tmfHCy/BUILD/lttng-modules-2.12.3/lttng-modules-2.12.3/probes/lttng-probe-kvm-x86-mmu.o CC [M] /tmp/B.tmfHCy/BUILD/lttng-modules-2.12.3/lttng-modules-2.12.3/probes/lttng-probe-napi.o CC [M] /tmp/B.tmfHCy/BUILD/lttng-modules-2.12.3/lttng-modules-2.12.3/probes/lttng-probe-skb.o CC [M] /tmp/B.tmfHCy/BUILD/lttng-modules-2.12.3/lttng-modules-2.12.3/probes/lttng-probe-net.o CC [M] /tmp/B.tmfHCy/BUILD/lttng-modules-2.12.3/lttng-modules-2.12.3/probes/lttng-probe-sock.o CC [M] /tmp/B.tmfHCy/BUILD/lttng-modules-2.12.3/lttng-modules-2.12.3/probes/lttng-probe-gpio.o CC [M] /tmp/B.tmfHCy/BUILD/lttng-modules-2.12.3/lttng-modules-2.12.3/probes/lttng-probe-kvm-x86.o CC [M] /tmp/B.tmfHCy/BUILD/lttng-modules-2.12.3/lttng-modules-2.12.3/probes/lttng-probe-udp.o CC [M] /tmp/B.tmfHCy/BUILD/lttng-modules-2.12.3/lttng-modules-2.12.3/probes/lttng-probe-block.o CC [M] /tmp/B.tmfHCy/BUILD/lttng-modules-2.12.3/lttng-modules-2.12.3/probes/lttng-probe-asoc.o CC [M] /tmp/B.tmfHCy/BUILD/lttng-modules-2.12.3/lttng-modules-2.12.3/probes/lttng-probe-regulator.o CC [M] /tmp/B.tmfHCy/BUILD/lttng-modules-2.12.3/lttng-modules-2.12.3/probes/lttng-probe-jbd2.o CC [M] /tmp/B.tmfHCy/BUILD/lttng-modules-2.12.3/lttng-modules-2.12.3/probes/lttng-probe-compaction.o CC [M] /tmp/B.tmfHCy/BUILD/lttng-modules-2.12.3/lttng-modules-2.12.3/probes/lttng-probe-scsi.o CC [M] /tmp/B.tmfHCy/BUILD/lttng-modules-2.12.3/lttng-modules-2.12.3/probes/lttng-probe-printk.o CC [M] /tmp/B.tmfHCy/BUILD/lttng-modules-2.12.3/lttng-modules-2.12.3/probes/lttng-probe-vmscan.o CC [M] /tmp/B.tmfHCy/BUILD/lttng-modules-2.12.3/lttng-modules-2.12.3/probes/lttng-probe-rcu.o CC [M] /tmp/B.tmfHCy/BUILD/lttng-modules-2.12.3/lttng-modules-2.12.3/probes/lttng-probe-random.o CC [M] /tmp/B.tmfHCy/BUILD/lttng-modules-2.12.3/lttng-modules-2.12.3/probes/lttng-probe-regmap.o CC [M] /tmp/B.tmfHCy/BUILD/lttng-modules-2.12.3/lttng-modules-2.12.3/probes/lttng-probe-v4l2.o CC [M] /tmp/B.tmfHCy/BUILD/lttng-modules-2.12.3/lttng-modules-2.12.3/probes/lttng-probe-workqueue.o CC [M] /tmp/B.tmfHCy/BUILD/lttng-modules-2.12.3/lttng-modules-2.12.3/probes/lttng-kprobes.o CC [M] /tmp/B.tmfHCy/BUILD/lttng-modules-2.12.3/lttng-modules-2.12.3/probes/lttng-probe-sunrpc.o CC [M] /tmp/B.tmfHCy/BUILD/lttng-modules-2.12.3/lttng-modules-2.12.3/probes/lttng-uprobes.o CC [M] /tmp/B.tmfHCy/BUILD/lttng-modules-2.12.3/lttng-modules-2.12.3/probes/lttng-probe-btrfs.o CC [M] /tmp/B.tmfHCy/BUILD/lttng-modules-2.12.3/lttng-modules-2.12.3/probes/lttng-kretprobes.o CC [M] /tmp/B.tmfHCy/BUILD/lttng-modules-2.12.3/lttng-modules-2.12.3/probes/lttng-probe-writeback.o CC [M] /tmp/B.tmfHCy/BUILD/lttng-modules-2.12.3/lttng-modules-2.12.3/probes/lttng-probe-ext4.o CC [M] /tmp/B.tmfHCy/BUILD/lttng-modules-2.12.3/lttng-modules-2.12.3/lttng-syscalls.o LD [M] /tmp/B.tmfHCy/BUILD/lttng-modules-2.12.3/lttng-modules-2.12.3/lttng-tracer.o make[1]: Entering directory '/usr/src/linux-4.9-4.9.257' Building modules, stage 2. make[1]: Leaving directory '/usr/src/linux-4.9-4.9.257' find: '/tmp/B.tmfHCy/BUILD/lttng-modules-2.12.3/lttng-modules-2.12.3/extra_version/patches/': No such file or directory MODPOST 54 modules CC /tmp/B.tmfHCy/BUILD/lttng-modules-2.12.3/lttng-modules-2.12.3/lttng-ring-buffer-metadata-mmap-client.mod.o CC /tmp/B.tmfHCy/BUILD/lttng-modules-2.12.3/lttng-modules-2.12.3/lttng-ring-buffer-client-discard.mod.o CC /tmp/B.tmfHCy/BUILD/lttng-modules-2.12.3/lttng-modules-2.12.3/lttng-ring-buffer-client-mmap-discard.mod.o CC /tmp/B.tmfHCy/BUILD/lttng-modules-2.12.3/lttng-modules-2.12.3/lttng-ring-buffer-client-mmap-overwrite.mod.o CC /tmp/B.tmfHCy/BUILD/lttng-modules-2.12.3/lttng-modules-2.12.3/lttng-ring-buffer-client-overwrite.mod.o CC /tmp/B.tmfHCy/BUILD/lttng-modules-2.12.3/lttng-modules-2.12.3/lttng-ring-buffer-metadata-client.mod.o CC /tmp/B.tmfHCy/BUILD/lttng-modules-2.12.3/lttng-modules-2.12.3/lib/lttng-lib-ring-buffer.mod.o CC /tmp/B.tmfHCy/BUILD/lttng-modules-2.12.3/lttng-modules-2.12.3/lttng-clock.mod.o CC /tmp/B.tmfHCy/BUILD/lttng-modules-2.12.3/lttng-modules-2.12.3/lttng-statedump.mod.o CC /tmp/B.tmfHCy/BUILD/lttng-modules-2.12.3/lttng-modules-2.12.3/probes/lttng-probe-asoc.mod.o CC /tmp/B.tmfHCy/BUILD/lttng-modules-2.12.3/lttng-modules-2.12.3/lttng-tracer.mod.o CC /tmp/B.tmfHCy/BUILD/lttng-modules-2.12.3/lttng-modules-2.12.3/probes/lttng-probe-9p.mod.o CC /tmp/B.tmfHCy/BUILD/lttng-modules-2.12.3/lttng-modules-2.12.3/probes/lttng-kprobes.mod.o CC /tmp/B.tmfHCy/BUILD/lttng-modules-2.12.3/lttng-modules-2.12.3/lttng-wrapper.mod.o CC /tmp/B.tmfHCy/BUILD/lttng-modules-2.12.3/lttng-modules-2.12.3/probes/lttng-kretprobes.mod.o CC /tmp/B.tmfHCy/BUILD/lttng-modules-2.12.3/lttng-modules-2.12.3/probes/lttng-probe-btrfs.mod.o CC /tmp/B.tmfHCy/BUILD/lttng-modules-2.12.3/lttng-modules-2.12.3/probes/lttng-probe-block.mod.o CC /tmp/B.tmfHCy/BUILD/lttng-modules-2.12.3/lttng-modules-2.12.3/probes/lttng-probe-compaction.mod.o CC /tmp/B.tmfHCy/BUILD/lttng-modules-2.12.3/lttng-modules-2.12.3/probes/lttng-probe-ext4.mod.o CC /tmp/B.tmfHCy/BUILD/lttng-modules-2.12.3/lttng-modules-2.12.3/probes/lttng-probe-irq.mod.o CC /tmp/B.tmfHCy/BUILD/lttng-modules-2.12.3/lttng-modules-2.12.3/probes/lttng-probe-jbd2.mod.o CC /tmp/B.tmfHCy/BUILD/lttng-modules-2.12.3/lttng-modules-2.12.3/probes/lttng-probe-i2c.mod.o CC /tmp/B.tmfHCy/BUILD/lttng-modules-2.12.3/lttng-modules-2.12.3/probes/lttng-probe-gpio.mod.o CC /tmp/B.tmfHCy/BUILD/lttng-modules-2.12.3/lttng-modules-2.12.3/probes/lttng-probe-kmem.mod.o CC /tmp/B.tmfHCy/BUILD/lttng-modules-2.12.3/lttng-modules-2.12.3/probes/lttng-probe-kvm-x86-mmu.mod.o CC /tmp/B.tmfHCy/BUILD/lttng-modules-2.12.3/lttng-modules-2.12.3/probes/lttng-probe-kvm.mod.o CC /tmp/B.tmfHCy/BUILD/lttng-modules-2.12.3/lttng-modules-2.12.3/probes/lttng-probe-kvm-x86.mod.o CC /tmp/B.tmfHCy/BUILD/lttng-modules-2.12.3/lttng-modules-2.12.3/probes/lttng-probe-module.mod.o CC /tmp/B.tmfHCy/BUILD/lttng-modules-2.12.3/lttng-modules-2.12.3/probes/lttng-probe-napi.mod.o CC /tmp/B.tmfHCy/BUILD/lttng-modules-2.12.3/lttng-modules-2.12.3/probes/lttng-probe-net.mod.o CC /tmp/B.tmfHCy/BUILD/lttng-modules-2.12.3/lttng-modules-2.12.3/probes/lttng-probe-power.mod.o CC /tmp/B.tmfHCy/BUILD/lttng-modules-2.12.3/lttng-modules-2.12.3/probes/lttng-probe-printk.mod.o CC /tmp/B.tmfHCy/BUILD/lttng-modules-2.12.3/lttng-modules-2.12.3/probes/lttng-probe-rcu.mod.o CC /tmp/B.tmfHCy/BUILD/lttng-modules-2.12.3/lttng-modules-2.12.3/probes/lttng-probe-regmap.mod.o CC /tmp/B.tmfHCy/BUILD/lttng-modules-2.12.3/lttng-modules-2.12.3/probes/lttng-probe-random.mod.o CC /tmp/B.tmfHCy/BUILD/lttng-modules-2.12.3/lttng-modules-2.12.3/probes/lttng-probe-sched.mod.o CC /tmp/B.tmfHCy/BUILD/lttng-modules-2.12.3/lttng-modules-2.12.3/probes/lttng-probe-regulator.mod.o CC /tmp/B.tmfHCy/BUILD/lttng-modules-2.12.3/lttng-modules-2.12.3/probes/lttng-probe-signal.mod.o CC /tmp/B.tmfHCy/BUILD/lttng-modules-2.12.3/lttng-modules-2.12.3/probes/lttng-probe-scsi.mod.o CC /tmp/B.tmfHCy/BUILD/lttng-modules-2.12.3/lttng-modules-2.12.3/probes/lttng-probe-skb.mod.o CC /tmp/B.tmfHCy/BUILD/lttng-modules-2.12.3/lttng-modules-2.12.3/probes/lttng-probe-sock.mod.o CC /tmp/B.tmfHCy/BUILD/lttng-modules-2.12.3/lttng-modules-2.12.3/probes/lttng-probe-statedump.mod.o CC /tmp/B.tmfHCy/BUILD/lttng-modules-2.12.3/lttng-modules-2.12.3/probes/lttng-probe-timer.mod.o CC /tmp/B.tmfHCy/BUILD/lttng-modules-2.12.3/lttng-modules-2.12.3/probes/lttng-probe-sunrpc.mod.o CC /tmp/B.tmfHCy/BUILD/lttng-modules-2.12.3/lttng-modules-2.12.3/probes/lttng-probe-v4l2.mod.o CC /tmp/B.tmfHCy/BUILD/lttng-modules-2.12.3/lttng-modules-2.12.3/probes/lttng-probe-vmscan.mod.o CC /tmp/B.tmfHCy/BUILD/lttng-modules-2.12.3/lttng-modules-2.12.3/probes/lttng-probe-udp.mod.o LD [M] /tmp/B.tmfHCy/BUILD/lttng-modules-2.12.3/lttng-modules-2.12.3/lib/lttng-lib-ring-buffer.ko LD [M] /tmp/B.tmfHCy/BUILD/lttng-modules-2.12.3/lttng-modules-2.12.3/lttng-clock.ko LD [M] /tmp/B.tmfHCy/BUILD/lttng-modules-2.12.3/lttng-modules-2.12.3/lttng-ring-buffer-client-discard.ko CC /tmp/B.tmfHCy/BUILD/lttng-modules-2.12.3/lttng-modules-2.12.3/probes/lttng-probe-writeback.mod.o LD [M] /tmp/B.tmfHCy/BUILD/lttng-modules-2.12.3/lttng-modules-2.12.3/lttng-ring-buffer-client-mmap-discard.ko LD [M] /tmp/B.tmfHCy/BUILD/lttng-modules-2.12.3/lttng-modules-2.12.3/lttng-ring-buffer-client-mmap-overwrite.ko CC /tmp/B.tmfHCy/BUILD/lttng-modules-2.12.3/lttng-modules-2.12.3/probes/lttng-probe-workqueue.mod.o LD [M] /tmp/B.tmfHCy/BUILD/lttng-modules-2.12.3/lttng-modules-2.12.3/lttng-ring-buffer-client-overwrite.ko LD [M] /tmp/B.tmfHCy/BUILD/lttng-modules-2.12.3/lttng-modules-2.12.3/lttng-ring-buffer-metadata-client.ko LD [M] /tmp/B.tmfHCy/BUILD/lttng-modules-2.12.3/lttng-modules-2.12.3/lttng-ring-buffer-metadata-mmap-client.ko LD [M] /tmp/B.tmfHCy/BUILD/lttng-modules-2.12.3/lttng-modules-2.12.3/lttng-statedump.ko LD [M] /tmp/B.tmfHCy/BUILD/lttng-modules-2.12.3/lttng-modules-2.12.3/lttng-tracer.ko LD [M] /tmp/B.tmfHCy/BUILD/lttng-modules-2.12.3/lttng-modules-2.12.3/lttng-wrapper.ko LD [M] /tmp/B.tmfHCy/BUILD/lttng-modules-2.12.3/lttng-modules-2.12.3/probes/lttng-kprobes.ko LD [M] /tmp/B.tmfHCy/BUILD/lttng-modules-2.12.3/lttng-modules-2.12.3/probes/lttng-kretprobes.ko LD [M] /tmp/B.tmfHCy/BUILD/lttng-modules-2.12.3/lttng-modules-2.12.3/probes/lttng-probe-9p.ko LD [M] /tmp/B.tmfHCy/BUILD/lttng-modules-2.12.3/lttng-modules-2.12.3/probes/lttng-probe-asoc.ko CC /tmp/B.tmfHCy/BUILD/lttng-modules-2.12.3/lttng-modules-2.12.3/probes/lttng-probe-x86-exceptions.mod.o LD [M] /tmp/B.tmfHCy/BUILD/lttng-modules-2.12.3/lttng-modules-2.12.3/probes/lttng-probe-block.ko LD [M] /tmp/B.tmfHCy/BUILD/lttng-modules-2.12.3/lttng-modules-2.12.3/probes/lttng-probe-btrfs.ko LD [M] /tmp/B.tmfHCy/BUILD/lttng-modules-2.12.3/lttng-modules-2.12.3/probes/lttng-probe-compaction.ko LD [M] /tmp/B.tmfHCy/BUILD/lttng-modules-2.12.3/lttng-modules-2.12.3/probes/lttng-probe-ext4.ko LD [M] /tmp/B.tmfHCy/BUILD/lttng-modules-2.12.3/lttng-modules-2.12.3/probes/lttng-probe-gpio.ko LD [M] /tmp/B.tmfHCy/BUILD/lttng-modules-2.12.3/lttng-modules-2.12.3/probes/lttng-probe-i2c.ko LD [M] /tmp/B.tmfHCy/BUILD/lttng-modules-2.12.3/lttng-modules-2.12.3/probes/lttng-probe-irq.ko LD [M] /tmp/B.tmfHCy/BUILD/lttng-modules-2.12.3/lttng-modules-2.12.3/probes/lttng-probe-jbd2.ko LD [M] /tmp/B.tmfHCy/BUILD/lttng-modules-2.12.3/lttng-modules-2.12.3/probes/lttng-probe-kmem.ko CC /tmp/B.tmfHCy/BUILD/lttng-modules-2.12.3/lttng-modules-2.12.3/probes/lttng-probe-x86-irq-vectors.mod.o LD [M] /tmp/B.tmfHCy/BUILD/lttng-modules-2.12.3/lttng-modules-2.12.3/probes/lttng-probe-kvm-x86-mmu.ko LD [M] /tmp/B.tmfHCy/BUILD/lttng-modules-2.12.3/lttng-modules-2.12.3/probes/lttng-probe-kvm-x86.ko LD [M] /tmp/B.tmfHCy/BUILD/lttng-modules-2.12.3/lttng-modules-2.12.3/probes/lttng-probe-kvm.ko LD [M] /tmp/B.tmfHCy/BUILD/lttng-modules-2.12.3/lttng-modules-2.12.3/probes/lttng-probe-module.ko LD [M] /tmp/B.tmfHCy/BUILD/lttng-modules-2.12.3/lttng-modules-2.12.3/probes/lttng-probe-napi.ko LD [M] /tmp/B.tmfHCy/BUILD/lttng-modules-2.12.3/lttng-modules-2.12.3/probes/lttng-probe-net.ko LD [M] /tmp/B.tmfHCy/BUILD/lttng-modules-2.12.3/lttng-modules-2.12.3/probes/lttng-probe-power.ko LD [M] /tmp/B.tmfHCy/BUILD/lttng-modules-2.12.3/lttng-modules-2.12.3/probes/lttng-probe-printk.ko LD [M] /tmp/B.tmfHCy/BUILD/lttng-modules-2.12.3/lttng-modules-2.12.3/probes/lttng-probe-rcu.ko LD [M] /tmp/B.tmfHCy/BUILD/lttng-modules-2.12.3/lttng-modules-2.12.3/probes/lttng-probe-random.ko LD [M] /tmp/B.tmfHCy/BUILD/lttng-modules-2.12.3/lttng-modules-2.12.3/probes/lttng-probe-regmap.ko LD [M] /tmp/B.tmfHCy/BUILD/lttng-modules-2.12.3/lttng-modules-2.12.3/probes/lttng-probe-regulator.ko LD [M] /tmp/B.tmfHCy/BUILD/lttng-modules-2.12.3/lttng-modules-2.12.3/probes/lttng-probe-sched.ko LD [M] /tmp/B.tmfHCy/BUILD/lttng-modules-2.12.3/lttng-modules-2.12.3/probes/lttng-probe-scsi.ko LD [M] /tmp/B.tmfHCy/BUILD/lttng-modules-2.12.3/lttng-modules-2.12.3/probes/lttng-probe-signal.ko LD [M] /tmp/B.tmfHCy/BUILD/lttng-modules-2.12.3/lttng-modules-2.12.3/probes/lttng-probe-skb.ko LD [M] /tmp/B.tmfHCy/BUILD/lttng-modules-2.12.3/lttng-modules-2.12.3/probes/lttng-probe-sock.ko LD [M] /tmp/B.tmfHCy/BUILD/lttng-modules-2.12.3/lttng-modules-2.12.3/probes/lttng-probe-statedump.ko LD [M] /tmp/B.tmfHCy/BUILD/lttng-modules-2.12.3/lttng-modules-2.12.3/probes/lttng-probe-sunrpc.ko LD [M] /tmp/B.tmfHCy/BUILD/lttng-modules-2.12.3/lttng-modules-2.12.3/probes/lttng-probe-timer.ko LD [M] /tmp/B.tmfHCy/BUILD/lttng-modules-2.12.3/lttng-modules-2.12.3/probes/lttng-probe-udp.ko LD [M] /tmp/B.tmfHCy/BUILD/lttng-modules-2.12.3/lttng-modules-2.12.3/probes/lttng-probe-v4l2.ko LD [M] /tmp/B.tmfHCy/BUILD/lttng-modules-2.12.3/lttng-modules-2.12.3/probes/lttng-probe-vmscan.ko LD [M] /tmp/B.tmfHCy/BUILD/lttng-modules-2.12.3/lttng-modules-2.12.3/probes/lttng-probe-workqueue.ko LD [M] /tmp/B.tmfHCy/BUILD/lttng-modules-2.12.3/lttng-modules-2.12.3/probes/lttng-probe-writeback.ko CC /tmp/B.tmfHCy/BUILD/lttng-modules-2.12.3/lttng-modules-2.12.3/probes/lttng-uprobes.mod.o LD [M] /tmp/B.tmfHCy/BUILD/lttng-modules-2.12.3/lttng-modules-2.12.3/probes/lttng-probe-x86-exceptions.ko LD [M] /tmp/B.tmfHCy/BUILD/lttng-modules-2.12.3/lttng-modules-2.12.3/probes/lttng-probe-x86-irq-vectors.ko LD [M] /tmp/B.tmfHCy/BUILD/lttng-modules-2.12.3/lttng-modules-2.12.3/probes/lttng-uprobes.ko CC /tmp/B.tmfHCy/BUILD/lttng-modules-2.12.3/lttng-modules-2.12.3/tests/lttng-test.mod.o LD [M] /tmp/B.tmfHCy/BUILD/lttng-modules-2.12.3/lttng-modules-2.12.3/tests/lttng-test.ko CC /tmp/B.tmfHCy/BUILD/lttng-modules-2.12.3/lttng-modules-2.12.3/tests/lttng-clock-plugin-test.mod.o LD [M] /tmp/B.tmfHCy/BUILD/lttng-modules-2.12.3/lttng-modules-2.12.3/tests/lttng-clock-plugin-test.ko + pwd + p=/tmp/B.tmfHCy/BUILD/lttng-modules-2.12.3/lttng-modules-2.12.3 + /usr/bin/make -Otarget -j9 modules_install 'INSTALL_MOD_PATH=/tmp/B.tmfHCy/BUILD/lttng-modules-2.12.3/lttng-modules-2.12.3/../installed' 'INSTALL_MOD_DIR=kernel/lttng' 'KERNELDIR=/usr/src/linux-4.9' /usr/bin/make -C /usr/src/linux-4.9 M=/tmp/B.tmfHCy/BUILD/lttng-modules-2.12.3/lttng-modules-2.12.3 CONFIG_LTTNG=m CONFIG_LTTNG_CLOCK_PLUGIN_TEST=m modules_install INSTALL /tmp/B.tmfHCy/BUILD/lttng-modules-2.12.3/lttng-modules-2.12.3/lttng-clock.ko INSTALL /tmp/B.tmfHCy/BUILD/lttng-modules-2.12.3/lttng-modules-2.12.3/lttng-ring-buffer-metadata-mmap-client.ko INSTALL /tmp/B.tmfHCy/BUILD/lttng-modules-2.12.3/lttng-modules-2.12.3/lttng-ring-buffer-client-mmap-discard.ko INSTALL /tmp/B.tmfHCy/BUILD/lttng-modules-2.12.3/lttng-modules-2.12.3/lttng-ring-buffer-client-overwrite.ko INSTALL /tmp/B.tmfHCy/BUILD/lttng-modules-2.12.3/lttng-modules-2.12.3/lttng-ring-buffer-metadata-client.ko INSTALL /tmp/B.tmfHCy/BUILD/lttng-modules-2.12.3/lttng-modules-2.12.3/lttng-ring-buffer-client-mmap-overwrite.ko INSTALL /tmp/B.tmfHCy/BUILD/lttng-modules-2.12.3/lttng-modules-2.12.3/lttng-ring-buffer-client-discard.ko INSTALL /tmp/B.tmfHCy/BUILD/lttng-modules-2.12.3/lttng-modules-2.12.3/lttng-statedump.ko INSTALL /tmp/B.tmfHCy/BUILD/lttng-modules-2.12.3/lttng-modules-2.12.3/lttng-wrapper.ko INSTALL /tmp/B.tmfHCy/BUILD/lttng-modules-2.12.3/lttng-modules-2.12.3/probes/lttng-probe-9p.ko INSTALL /tmp/B.tmfHCy/BUILD/lttng-modules-2.12.3/lttng-modules-2.12.3/probes/lttng-kprobes.ko INSTALL /tmp/B.tmfHCy/BUILD/lttng-modules-2.12.3/lttng-modules-2.12.3/probes/lttng-kretprobes.ko INSTALL /tmp/B.tmfHCy/BUILD/lttng-modules-2.12.3/lttng-modules-2.12.3/probes/lttng-probe-compaction.ko INSTALL /tmp/B.tmfHCy/BUILD/lttng-modules-2.12.3/lttng-modules-2.12.3/probes/lttng-probe-asoc.ko INSTALL /tmp/B.tmfHCy/BUILD/lttng-modules-2.12.3/lttng-modules-2.12.3/probes/lttng-probe-i2c.ko INSTALL /tmp/B.tmfHCy/BUILD/lttng-modules-2.12.3/lttng-modules-2.12.3/probes/lttng-probe-gpio.ko INSTALL /tmp/B.tmfHCy/BUILD/lttng-modules-2.12.3/lttng-modules-2.12.3/lib/lttng-lib-ring-buffer.ko INSTALL /tmp/B.tmfHCy/BUILD/lttng-modules-2.12.3/lttng-modules-2.12.3/probes/lttng-probe-block.ko INSTALL /tmp/B.tmfHCy/BUILD/lttng-modules-2.12.3/lttng-modules-2.12.3/probes/lttng-probe-irq.ko INSTALL /tmp/B.tmfHCy/BUILD/lttng-modules-2.12.3/lttng-modules-2.12.3/probes/lttng-probe-kmem.ko INSTALL /tmp/B.tmfHCy/BUILD/lttng-modules-2.12.3/lttng-modules-2.12.3/probes/lttng-probe-btrfs.ko INSTALL /tmp/B.tmfHCy/BUILD/lttng-modules-2.12.3/lttng-modules-2.12.3/probes/lttng-probe-jbd2.ko INSTALL /tmp/B.tmfHCy/BUILD/lttng-modules-2.12.3/lttng-modules-2.12.3/probes/lttng-probe-kvm-x86-mmu.ko INSTALL /tmp/B.tmfHCy/BUILD/lttng-modules-2.12.3/lttng-modules-2.12.3/probes/lttng-probe-module.ko INSTALL /tmp/B.tmfHCy/BUILD/lttng-modules-2.12.3/lttng-modules-2.12.3/probes/lttng-probe-kvm.ko INSTALL /tmp/B.tmfHCy/BUILD/lttng-modules-2.12.3/lttng-modules-2.12.3/probes/lttng-probe-napi.ko INSTALL /tmp/B.tmfHCy/BUILD/lttng-modules-2.12.3/lttng-modules-2.12.3/probes/lttng-probe-power.ko INSTALL /tmp/B.tmfHCy/BUILD/lttng-modules-2.12.3/lttng-modules-2.12.3/probes/lttng-probe-printk.ko INSTALL /tmp/B.tmfHCy/BUILD/lttng-modules-2.12.3/lttng-modules-2.12.3/probes/lttng-probe-net.ko INSTALL /tmp/B.tmfHCy/BUILD/lttng-modules-2.12.3/lttng-modules-2.12.3/probes/lttng-probe-rcu.ko INSTALL /tmp/B.tmfHCy/BUILD/lttng-modules-2.12.3/lttng-modules-2.12.3/probes/lttng-probe-random.ko INSTALL /tmp/B.tmfHCy/BUILD/lttng-modules-2.12.3/lttng-modules-2.12.3/probes/lttng-probe-kvm-x86.ko INSTALL /tmp/B.tmfHCy/BUILD/lttng-modules-2.12.3/lttng-modules-2.12.3/probes/lttng-probe-regmap.ko INSTALL /tmp/B.tmfHCy/BUILD/lttng-modules-2.12.3/lttng-modules-2.12.3/probes/lttng-probe-signal.ko INSTALL /tmp/B.tmfHCy/BUILD/lttng-modules-2.12.3/lttng-modules-2.12.3/probes/lttng-probe-sched.ko INSTALL /tmp/B.tmfHCy/BUILD/lttng-modules-2.12.3/lttng-modules-2.12.3/probes/lttng-probe-regulator.ko INSTALL /tmp/B.tmfHCy/BUILD/lttng-modules-2.12.3/lttng-modules-2.12.3/probes/lttng-probe-sock.ko INSTALL /tmp/B.tmfHCy/BUILD/lttng-modules-2.12.3/lttng-modules-2.12.3/probes/lttng-probe-skb.ko INSTALL /tmp/B.tmfHCy/BUILD/lttng-modules-2.12.3/lttng-modules-2.12.3/probes/lttng-probe-ext4.ko INSTALL /tmp/B.tmfHCy/BUILD/lttng-modules-2.12.3/lttng-modules-2.12.3/probes/lttng-probe-scsi.ko INSTALL /tmp/B.tmfHCy/BUILD/lttng-modules-2.12.3/lttng-modules-2.12.3/probes/lttng-probe-udp.ko INSTALL /tmp/B.tmfHCy/BUILD/lttng-modules-2.12.3/lttng-modules-2.12.3/probes/lttng-probe-sunrpc.ko INSTALL /tmp/B.tmfHCy/BUILD/lttng-modules-2.12.3/lttng-modules-2.12.3/probes/lttng-probe-v4l2.ko INSTALL /tmp/B.tmfHCy/BUILD/lttng-modules-2.12.3/lttng-modules-2.12.3/probes/lttng-probe-workqueue.ko INSTALL /tmp/B.tmfHCy/BUILD/lttng-modules-2.12.3/lttng-modules-2.12.3/probes/lttng-probe-timer.ko INSTALL /tmp/B.tmfHCy/BUILD/lttng-modules-2.12.3/lttng-modules-2.12.3/probes/lttng-probe-statedump.ko INSTALL /tmp/B.tmfHCy/BUILD/lttng-modules-2.12.3/lttng-modules-2.12.3/probes/lttng-probe-x86-irq-vectors.ko INSTALL /tmp/B.tmfHCy/BUILD/lttng-modules-2.12.3/lttng-modules-2.12.3/probes/lttng-probe-vmscan.ko INSTALL /tmp/B.tmfHCy/BUILD/lttng-modules-2.12.3/lttng-modules-2.12.3/tests/lttng-clock-plugin-test.ko INSTALL /tmp/B.tmfHCy/BUILD/lttng-modules-2.12.3/lttng-modules-2.12.3/probes/lttng-probe-x86-exceptions.ko INSTALL /tmp/B.tmfHCy/BUILD/lttng-modules-2.12.3/lttng-modules-2.12.3/probes/lttng-uprobes.ko INSTALL /tmp/B.tmfHCy/BUILD/lttng-modules-2.12.3/lttng-modules-2.12.3/tests/lttng-test.ko INSTALL /tmp/B.tmfHCy/BUILD/lttng-modules-2.12.3/lttng-modules-2.12.3/probes/lttng-probe-writeback.ko INSTALL /tmp/B.tmfHCy/BUILD/lttng-modules-2.12.3/lttng-modules-2.12.3/lttng-tracer.ko make[1]: Entering directory '/usr/src/linux-4.9-4.9.257' DEPMOD 4.9.257-1 make[1]: Leaving directory '/usr/src/linux-4.9-4.9.257' + /usr/bin/make -Otarget -j9 clean 'KERNELDIR=/usr/src/linux-5.10' /usr/bin/make -C /usr/src/linux-5.10 M=/tmp/B.tmfHCy/BUILD/lttng-modules-2.12.3/lttng-modules-2.12.3 clean find: '/tmp/B.tmfHCy/BUILD/lttng-modules-2.12.3/lttng-modules-2.12.3/extra_version/patches/': No such file or directory find: '/tmp/B.tmfHCy/BUILD/lttng-modules-2.12.3/lttng-modules-2.12.3/lib/../extra_version/patches/': No such file or directory find: '/tmp/B.tmfHCy/BUILD/lttng-modules-2.12.3/lttng-modules-2.12.3/tests/../extra_version/patches/': No such file or directory find: '/tmp/B.tmfHCy/BUILD/lttng-modules-2.12.3/lttng-modules-2.12.3/probes/../extra_version/patches/': No such file or directory make[1]: Entering directory '/usr/src/linux-5.10-5.10.17' CLEAN /tmp/B.tmfHCy/BUILD/lttng-modules-2.12.3/lttng-modules-2.12.3/Module.symvers make[1]: Leaving directory '/usr/src/linux-5.10-5.10.17' + /usr/bin/make -Otarget -j9 'KERNELDIR=/usr/src/linux-5.10' /usr/bin/make -C /usr/src/linux-5.10 M=/tmp/B.tmfHCy/BUILD/lttng-modules-2.12.3/lttng-modules-2.12.3 CONFIG_LTTNG=m CONFIG_LTTNG_CLOCK_PLUGIN_TEST=m modules find: '/tmp/B.tmfHCy/BUILD/lttng-modules-2.12.3/lttng-modules-2.12.3/extra_version/patches/': No such file or directory find: '/tmp/B.tmfHCy/BUILD/lttng-modules-2.12.3/lttng-modules-2.12.3/lib/../extra_version/patches/': No such file or directory find: '/tmp/B.tmfHCy/BUILD/lttng-modules-2.12.3/lttng-modules-2.12.3/tests/../extra_version/patches/': No such file or directory find: '/tmp/B.tmfHCy/BUILD/lttng-modules-2.12.3/lttng-modules-2.12.3/probes/../extra_version/patches/': No such file or directory CC [M] /tmp/B.tmfHCy/BUILD/lttng-modules-2.12.3/lttng-modules-2.12.3/lttng-ring-buffer-metadata-client.o CC [M] /tmp/B.tmfHCy/BUILD/lttng-modules-2.12.3/lttng-modules-2.12.3/lttng-ring-buffer-metadata-mmap-client.o CC [M] /tmp/B.tmfHCy/BUILD/lttng-modules-2.12.3/lttng-modules-2.12.3/lttng-ring-buffer-client-discard.o CC [M] /tmp/B.tmfHCy/BUILD/lttng-modules-2.12.3/lttng-modules-2.12.3/tests/probes/lttng-test.o CC [M] /tmp/B.tmfHCy/BUILD/lttng-modules-2.12.3/lttng-modules-2.12.3/lttng-ring-buffer-client-mmap-discard.o CC [M] /tmp/B.tmfHCy/BUILD/lttng-modules-2.12.3/lttng-modules-2.12.3/lttng-ring-buffer-client-overwrite.o CC [M] /tmp/B.tmfHCy/BUILD/lttng-modules-2.12.3/lttng-modules-2.12.3/lib/ringbuffer/ring_buffer_backend.o CC [M] /tmp/B.tmfHCy/BUILD/lttng-modules-2.12.3/lttng-modules-2.12.3/lttng-string-utils.o CC [M] /tmp/B.tmfHCy/BUILD/lttng-modules-2.12.3/lttng-modules-2.12.3/lttng-ring-buffer-client-mmap-overwrite.o CC [M] /tmp/B.tmfHCy/BUILD/lttng-modules-2.12.3/lttng-modules-2.12.3/tests/clock-plugin/lttng-clock-plugin-test.o LD [M] /tmp/B.tmfHCy/BUILD/lttng-modules-2.12.3/lttng-modules-2.12.3/tests/lttng-test.o CC [M] /tmp/B.tmfHCy/BUILD/lttng-modules-2.12.3/lttng-modules-2.12.3/lttng-clock.o LD [M] /tmp/B.tmfHCy/BUILD/lttng-modules-2.12.3/lttng-modules-2.12.3/tests/lttng-clock-plugin-test.o CC [M] /tmp/B.tmfHCy/BUILD/lttng-modules-2.12.3/lttng-modules-2.12.3/probes/lttng-probe-sched.o CC [M] /tmp/B.tmfHCy/BUILD/lttng-modules-2.12.3/lttng-modules-2.12.3/lttng-abi.o CC [M] /tmp/B.tmfHCy/BUILD/lttng-modules-2.12.3/lttng-modules-2.12.3/lttng-probes.o CC [M] /tmp/B.tmfHCy/BUILD/lttng-modules-2.12.3/lttng-modules-2.12.3/lttng-context.o CC [M] /tmp/B.tmfHCy/BUILD/lttng-modules-2.12.3/lttng-modules-2.12.3/lttng-context-pid.o CC [M] /tmp/B.tmfHCy/BUILD/lttng-modules-2.12.3/lttng-modules-2.12.3/probes/lttng-probe-irq.o CC [M] /tmp/B.tmfHCy/BUILD/lttng-modules-2.12.3/lttng-modules-2.12.3/lib/ringbuffer/ring_buffer_vfs.o CC [M] /tmp/B.tmfHCy/BUILD/lttng-modules-2.12.3/lttng-modules-2.12.3/lib/ringbuffer/ring_buffer_frontend.o CC [M] /tmp/B.tmfHCy/BUILD/lttng-modules-2.12.3/lttng-modules-2.12.3/lttng-events.o CC [M] /tmp/B.tmfHCy/BUILD/lttng-modules-2.12.3/lttng-modules-2.12.3/lib/ringbuffer/ring_buffer_iterator.o CC [M] /tmp/B.tmfHCy/BUILD/lttng-modules-2.12.3/lttng-modules-2.12.3/lttng-context-procname.o CC [M] /tmp/B.tmfHCy/BUILD/lttng-modules-2.12.3/lttng-modules-2.12.3/probes/lttng-probe-timer.o CC [M] /tmp/B.tmfHCy/BUILD/lttng-modules-2.12.3/lttng-modules-2.12.3/probes/lttng-probe-module.o CC [M] /tmp/B.tmfHCy/BUILD/lttng-modules-2.12.3/lttng-modules-2.12.3/probes/lttng-probe-kmem.o CC [M] /tmp/B.tmfHCy/BUILD/lttng-modules-2.12.3/lttng-modules-2.12.3/probes/lttng-probe-power.o CC [M] /tmp/B.tmfHCy/BUILD/lttng-modules-2.12.3/lttng-modules-2.12.3/lttng-context-prio.o CC [M] /tmp/B.tmfHCy/BUILD/lttng-modules-2.12.3/lttng-modules-2.12.3/lib/ringbuffer/ring_buffer_splice.o CC [M] /tmp/B.tmfHCy/BUILD/lttng-modules-2.12.3/lttng-modules-2.12.3/lttng-context-nice.o CC [M] /tmp/B.tmfHCy/BUILD/lttng-modules-2.12.3/lttng-modules-2.12.3/lttng-context-vpid.o CC [M] /tmp/B.tmfHCy/BUILD/lttng-modules-2.12.3/lttng-modules-2.12.3/lttng-context-tid.o CC [M] /tmp/B.tmfHCy/BUILD/lttng-modules-2.12.3/lttng-modules-2.12.3/probes/lttng-probe-9p.o CC [M] /tmp/B.tmfHCy/BUILD/lttng-modules-2.12.3/lttng-modules-2.12.3/probes/lttng-probe-i2c.o CC [M] /tmp/B.tmfHCy/BUILD/lttng-modules-2.12.3/lttng-modules-2.12.3/lib/ringbuffer/ring_buffer_mmap.o CC [M] /tmp/B.tmfHCy/BUILD/lttng-modules-2.12.3/lttng-modules-2.12.3/probes/lttng-probe-statedump.o CC [M] /tmp/B.tmfHCy/BUILD/lttng-modules-2.12.3/lttng-modules-2.12.3/probes/lttng-probe-x86-irq-vectors.o CC [M] /tmp/B.tmfHCy/BUILD/lttng-modules-2.12.3/lttng-modules-2.12.3/lttng-context-vtid.o CC [M] /tmp/B.tmfHCy/BUILD/lttng-modules-2.12.3/lttng-modules-2.12.3/lib/prio_heap/lttng_prio_heap.o CC [M] /tmp/B.tmfHCy/BUILD/lttng-modules-2.12.3/lttng-modules-2.12.3/probes/lttng-probe-x86-exceptions.o CC [M] /tmp/B.tmfHCy/BUILD/lttng-modules-2.12.3/lttng-modules-2.12.3/probes/lttng-probe-kvm.o CC [M] /tmp/B.tmfHCy/BUILD/lttng-modules-2.12.3/lttng-modules-2.12.3/lttng-context-ppid.o CC [M] /tmp/B.tmfHCy/BUILD/lttng-modules-2.12.3/lttng-modules-2.12.3/lib/../wrapper/splice.o LD [M] /tmp/B.tmfHCy/BUILD/lttng-modules-2.12.3/lttng-modules-2.12.3/lib/lttng-lib-ring-buffer.o CC [M] /tmp/B.tmfHCy/BUILD/lttng-modules-2.12.3/lttng-modules-2.12.3/probes/lttng-probe-signal.o CC [M] /tmp/B.tmfHCy/BUILD/lttng-modules-2.12.3/lttng-modules-2.12.3/probes/lttng-probe-kvm-x86-mmu.o CC [M] /tmp/B.tmfHCy/BUILD/lttng-modules-2.12.3/lttng-modules-2.12.3/lttng-context-vppid.o CC [M] /tmp/B.tmfHCy/BUILD/lttng-modules-2.12.3/lttng-modules-2.12.3/probes/lttng-probe-napi.o CC [M] /tmp/B.tmfHCy/BUILD/lttng-modules-2.12.3/lttng-modules-2.12.3/probes/lttng-probe-skb.o CC [M] /tmp/B.tmfHCy/BUILD/lttng-modules-2.12.3/lttng-modules-2.12.3/lttng-context-cpu-id.o CC [M] /tmp/B.tmfHCy/BUILD/lttng-modules-2.12.3/lttng-modules-2.12.3/probes/lttng-probe-kvm-x86.o CC [M] /tmp/B.tmfHCy/BUILD/lttng-modules-2.12.3/lttng-modules-2.12.3/lttng-context-uid.o CC [M] /tmp/B.tmfHCy/BUILD/lttng-modules-2.12.3/lttng-modules-2.12.3/probes/lttng-probe-gpio.o CC [M] /tmp/B.tmfHCy/BUILD/lttng-modules-2.12.3/lttng-modules-2.12.3/probes/lttng-probe-sock.o CC [M] /tmp/B.tmfHCy/BUILD/lttng-modules-2.12.3/lttng-modules-2.12.3/probes/lttng-probe-block.o CC [M] /tmp/B.tmfHCy/BUILD/lttng-modules-2.12.3/lttng-modules-2.12.3/probes/lttng-probe-net.o CC [M] /tmp/B.tmfHCy/BUILD/lttng-modules-2.12.3/lttng-modules-2.12.3/probes/lttng-probe-udp.o CC [M] /tmp/B.tmfHCy/BUILD/lttng-modules-2.12.3/lttng-modules-2.12.3/lttng-context-euid.o CC [M] /tmp/B.tmfHCy/BUILD/lttng-modules-2.12.3/lttng-modules-2.12.3/probes/lttng-probe-regulator.o CC [M] /tmp/B.tmfHCy/BUILD/lttng-modules-2.12.3/lttng-modules-2.12.3/probes/lttng-probe-jbd2.o CC [M] /tmp/B.tmfHCy/BUILD/lttng-modules-2.12.3/lttng-modules-2.12.3/probes/lttng-probe-asoc.o CC [M] /tmp/B.tmfHCy/BUILD/lttng-modules-2.12.3/lttng-modules-2.12.3/probes/lttng-probe-printk.o CC [M] /tmp/B.tmfHCy/BUILD/lttng-modules-2.12.3/lttng-modules-2.12.3/probes/lttng-probe-scsi.o CC [M] /tmp/B.tmfHCy/BUILD/lttng-modules-2.12.3/lttng-modules-2.12.3/probes/lttng-probe-rcu.o CC [M] /tmp/B.tmfHCy/BUILD/lttng-modules-2.12.3/lttng-modules-2.12.3/probes/lttng-probe-compaction.o CC [M] /tmp/B.tmfHCy/BUILD/lttng-modules-2.12.3/lttng-modules-2.12.3/lttng-context-suid.o CC [M] /tmp/B.tmfHCy/BUILD/lttng-modules-2.12.3/lttng-modules-2.12.3/probes/lttng-probe-vmscan.o CC [M] /tmp/B.tmfHCy/BUILD/lttng-modules-2.12.3/lttng-modules-2.12.3/probes/lttng-probe-random.o CC [M] /tmp/B.tmfHCy/BUILD/lttng-modules-2.12.3/lttng-modules-2.12.3/lttng-context-gid.o CC [M] /tmp/B.tmfHCy/BUILD/lttng-modules-2.12.3/lttng-modules-2.12.3/lttng-context-egid.o CC [M] /tmp/B.tmfHCy/BUILD/lttng-modules-2.12.3/lttng-modules-2.12.3/probes/lttng-probe-regmap.o CC [M] /tmp/B.tmfHCy/BUILD/lttng-modules-2.12.3/lttng-modules-2.12.3/probes/lttng-probe-v4l2.o CC [M] /tmp/B.tmfHCy/BUILD/lttng-modules-2.12.3/lttng-modules-2.12.3/probes/lttng-probe-workqueue.o CC [M] /tmp/B.tmfHCy/BUILD/lttng-modules-2.12.3/lttng-modules-2.12.3/lttng-context-sgid.o CC [M] /tmp/B.tmfHCy/BUILD/lttng-modules-2.12.3/lttng-modules-2.12.3/probes/lttng-kprobes.o CC [M] /tmp/B.tmfHCy/BUILD/lttng-modules-2.12.3/lttng-modules-2.12.3/lttng-context-vuid.o CC [M] /tmp/B.tmfHCy/BUILD/lttng-modules-2.12.3/lttng-modules-2.12.3/probes/lttng-probe-sunrpc.o CC [M] /tmp/B.tmfHCy/BUILD/lttng-modules-2.12.3/lttng-modules-2.12.3/lttng-context-veuid.o CC [M] /tmp/B.tmfHCy/BUILD/lttng-modules-2.12.3/lttng-modules-2.12.3/probes/lttng-probe-btrfs.o CC [M] /tmp/B.tmfHCy/BUILD/lttng-modules-2.12.3/lttng-modules-2.12.3/probes/lttng-uprobes.o CC [M] /tmp/B.tmfHCy/BUILD/lttng-modules-2.12.3/lttng-modules-2.12.3/lttng-context-vsuid.o CC [M] /tmp/B.tmfHCy/BUILD/lttng-modules-2.12.3/lttng-modules-2.12.3/probes/lttng-kretprobes.o CC [M] /tmp/B.tmfHCy/BUILD/lttng-modules-2.12.3/lttng-modules-2.12.3/probes/lttng-probe-writeback.o CC [M] /tmp/B.tmfHCy/BUILD/lttng-modules-2.12.3/lttng-modules-2.12.3/lttng-context-vegid.o CC [M] /tmp/B.tmfHCy/BUILD/lttng-modules-2.12.3/lttng-modules-2.12.3/lttng-context-vgid.o CC [M] /tmp/B.tmfHCy/BUILD/lttng-modules-2.12.3/lttng-modules-2.12.3/lttng-context-vsgid.o CC [M] /tmp/B.tmfHCy/BUILD/lttng-modules-2.12.3/lttng-modules-2.12.3/lttng-context-interruptible.o CC [M] /tmp/B.tmfHCy/BUILD/lttng-modules-2.12.3/lttng-modules-2.12.3/lttng-calibrate.o CC [M] /tmp/B.tmfHCy/BUILD/lttng-modules-2.12.3/lttng-modules-2.12.3/lttng-context-need-reschedule.o CC [M] /tmp/B.tmfHCy/BUILD/lttng-modules-2.12.3/lttng-modules-2.12.3/probes/lttng.o CC [M] /tmp/B.tmfHCy/BUILD/lttng-modules-2.12.3/lttng-modules-2.12.3/lttng-context-callstack.o CC [M] /tmp/B.tmfHCy/BUILD/lttng-modules-2.12.3/lttng-modules-2.12.3/lttng-filter.o CC [M] /tmp/B.tmfHCy/BUILD/lttng-modules-2.12.3/lttng-modules-2.12.3/lttng-context-hostname.o CC [M] /tmp/B.tmfHCy/BUILD/lttng-modules-2.12.3/lttng-modules-2.12.3/lttng-tracker-id.o CC [M] /tmp/B.tmfHCy/BUILD/lttng-modules-2.12.3/lttng-modules-2.12.3/lttng-tp-mempool.o CC [M] /tmp/B.tmfHCy/BUILD/lttng-modules-2.12.3/lttng-modules-2.12.3/probes/lttng-probe-user.o CC [M] /tmp/B.tmfHCy/BUILD/lttng-modules-2.12.3/lttng-modules-2.12.3/lttng-filter-interpreter.o CC [M] /tmp/B.tmfHCy/BUILD/lttng-modules-2.12.3/lttng-modules-2.12.3/lttng-filter-validator.o CC [M] /tmp/B.tmfHCy/BUILD/lttng-modules-2.12.3/lttng-modules-2.12.3/lttng-filter-specialize.o CC [M] /tmp/B.tmfHCy/BUILD/lttng-modules-2.12.3/lttng-modules-2.12.3/lttng-tracepoint.o CC [M] /tmp/B.tmfHCy/BUILD/lttng-modules-2.12.3/lttng-modules-2.12.3/lttng-context-perf-counters.o CC [M] /tmp/B.tmfHCy/BUILD/lttng-modules-2.12.3/lttng-modules-2.12.3/lttng-context-cgroup-ns.o CC [M] /tmp/B.tmfHCy/BUILD/lttng-modules-2.12.3/lttng-modules-2.12.3/lttng-context-mnt-ns.o CC [M] /tmp/B.tmfHCy/BUILD/lttng-modules-2.12.3/lttng-modules-2.12.3/lttng-context-pid-ns.o CC [M] /tmp/B.tmfHCy/BUILD/lttng-modules-2.12.3/lttng-modules-2.12.3/lttng-context-ipc-ns.o CC [M] /tmp/B.tmfHCy/BUILD/lttng-modules-2.12.3/lttng-modules-2.12.3/lttng-context-net-ns.o CC [M] /tmp/B.tmfHCy/BUILD/lttng-modules-2.12.3/lttng-modules-2.12.3/lttng-context-user-ns.o CC [M] /tmp/B.tmfHCy/BUILD/lttng-modules-2.12.3/lttng-modules-2.12.3/lttng-context-uts-ns.o CC [M] /tmp/B.tmfHCy/BUILD/lttng-modules-2.12.3/lttng-modules-2.12.3/wrapper/trace-clock.o CC [M] /tmp/B.tmfHCy/BUILD/lttng-modules-2.12.3/lttng-modules-2.12.3/wrapper/fdtable.o CC [M] /tmp/B.tmfHCy/BUILD/lttng-modules-2.12.3/lttng-modules-2.12.3/wrapper/irqdesc.o CC [M] /tmp/B.tmfHCy/BUILD/lttng-modules-2.12.3/lttng-modules-2.12.3/wrapper/page_alloc.o CC [M] /tmp/B.tmfHCy/BUILD/lttng-modules-2.12.3/lttng-modules-2.12.3/wrapper/random.o CC [M] /tmp/B.tmfHCy/BUILD/lttng-modules-2.12.3/lttng-modules-2.12.3/probes/lttng-probe-ext4.o CC [M] /tmp/B.tmfHCy/BUILD/lttng-modules-2.12.3/lttng-modules-2.12.3/lttng-wrapper-impl.o CC [M] /tmp/B.tmfHCy/BUILD/lttng-modules-2.12.3/lttng-modules-2.12.3/wrapper/kallsyms.o LD [M] /tmp/B.tmfHCy/BUILD/lttng-modules-2.12.3/lttng-modules-2.12.3/lttng-wrapper.o CC [M] /tmp/B.tmfHCy/BUILD/lttng-modules-2.12.3/lttng-modules-2.12.3/lttng-statedump-impl.o LD [M] /tmp/B.tmfHCy/BUILD/lttng-modules-2.12.3/lttng-modules-2.12.3/lttng-statedump.o CC [M] /tmp/B.tmfHCy/BUILD/lttng-modules-2.12.3/lttng-modules-2.12.3/lttng-syscalls.o LD [M] /tmp/B.tmfHCy/BUILD/lttng-modules-2.12.3/lttng-modules-2.12.3/lttng-tracer.o find: '/tmp/B.tmfHCy/BUILD/lttng-modules-2.12.3/lttng-modules-2.12.3/extra_version/patches/': No such file or directory MODPOST /tmp/B.tmfHCy/BUILD/lttng-modules-2.12.3/lttng-modules-2.12.3/Module.symvers CC [M] /tmp/B.tmfHCy/BUILD/lttng-modules-2.12.3/lttng-modules-2.12.3/lttng-ring-buffer-client-discard.mod.o CC [M] /tmp/B.tmfHCy/BUILD/lttng-modules-2.12.3/lttng-modules-2.12.3/lttng-ring-buffer-metadata-client.mod.o CC [M] /tmp/B.tmfHCy/BUILD/lttng-modules-2.12.3/lttng-modules-2.12.3/lttng-ring-buffer-client-mmap-discard.mod.o CC [M] /tmp/B.tmfHCy/BUILD/lttng-modules-2.12.3/lttng-modules-2.12.3/lttng-clock.mod.o CC [M] /tmp/B.tmfHCy/BUILD/lttng-modules-2.12.3/lttng-modules-2.12.3/lttng-ring-buffer-client-overwrite.mod.o CC [M] /tmp/B.tmfHCy/BUILD/lttng-modules-2.12.3/lttng-modules-2.12.3/lttng-statedump.mod.o CC [M] /tmp/B.tmfHCy/BUILD/lttng-modules-2.12.3/lttng-modules-2.12.3/lttng-ring-buffer-client-mmap-overwrite.mod.o CC [M] /tmp/B.tmfHCy/BUILD/lttng-modules-2.12.3/lttng-modules-2.12.3/lttng-ring-buffer-metadata-mmap-client.mod.o CC [M] /tmp/B.tmfHCy/BUILD/lttng-modules-2.12.3/lttng-modules-2.12.3/lib/lttng-lib-ring-buffer.mod.o CC [M] /tmp/B.tmfHCy/BUILD/lttng-modules-2.12.3/lttng-modules-2.12.3/probes/lttng-kprobes.mod.o CC [M] /tmp/B.tmfHCy/BUILD/lttng-modules-2.12.3/lttng-modules-2.12.3/lttng-wrapper.mod.o CC [M] /tmp/B.tmfHCy/BUILD/lttng-modules-2.12.3/lttng-modules-2.12.3/probes/lttng-kretprobes.mod.o CC [M] /tmp/B.tmfHCy/BUILD/lttng-modules-2.12.3/lttng-modules-2.12.3/probes/lttng-probe-9p.mod.o CC [M] /tmp/B.tmfHCy/BUILD/lttng-modules-2.12.3/lttng-modules-2.12.3/lttng-tracer.mod.o CC [M] /tmp/B.tmfHCy/BUILD/lttng-modules-2.12.3/lttng-modules-2.12.3/probes/lttng-probe-block.mod.o CC [M] /tmp/B.tmfHCy/BUILD/lttng-modules-2.12.3/lttng-modules-2.12.3/probes/lttng-probe-asoc.mod.o CC [M] /tmp/B.tmfHCy/BUILD/lttng-modules-2.12.3/lttng-modules-2.12.3/probes/lttng-probe-btrfs.mod.o CC [M] /tmp/B.tmfHCy/BUILD/lttng-modules-2.12.3/lttng-modules-2.12.3/probes/lttng-probe-compaction.mod.o CC [M] /tmp/B.tmfHCy/BUILD/lttng-modules-2.12.3/lttng-modules-2.12.3/probes/lttng-probe-ext4.mod.o CC [M] /tmp/B.tmfHCy/BUILD/lttng-modules-2.12.3/lttng-modules-2.12.3/probes/lttng-probe-irq.mod.o CC [M] /tmp/B.tmfHCy/BUILD/lttng-modules-2.12.3/lttng-modules-2.12.3/probes/lttng-probe-jbd2.mod.o CC [M] /tmp/B.tmfHCy/BUILD/lttng-modules-2.12.3/lttng-modules-2.12.3/probes/lttng-probe-kmem.mod.o CC [M] /tmp/B.tmfHCy/BUILD/lttng-modules-2.12.3/lttng-modules-2.12.3/probes/lttng-probe-i2c.mod.o CC [M] /tmp/B.tmfHCy/BUILD/lttng-modules-2.12.3/lttng-modules-2.12.3/probes/lttng-probe-gpio.mod.o CC [M] /tmp/B.tmfHCy/BUILD/lttng-modules-2.12.3/lttng-modules-2.12.3/probes/lttng-probe-kvm-x86.mod.o CC [M] /tmp/B.tmfHCy/BUILD/lttng-modules-2.12.3/lttng-modules-2.12.3/probes/lttng-probe-kvm.mod.o CC [M] /tmp/B.tmfHCy/BUILD/lttng-modules-2.12.3/lttng-modules-2.12.3/probes/lttng-probe-kvm-x86-mmu.mod.o CC [M] /tmp/B.tmfHCy/BUILD/lttng-modules-2.12.3/lttng-modules-2.12.3/probes/lttng-probe-module.mod.o CC [M] /tmp/B.tmfHCy/BUILD/lttng-modules-2.12.3/lttng-modules-2.12.3/probes/lttng-probe-net.mod.o CC [M] /tmp/B.tmfHCy/BUILD/lttng-modules-2.12.3/lttng-modules-2.12.3/probes/lttng-probe-napi.mod.o CC [M] /tmp/B.tmfHCy/BUILD/lttng-modules-2.12.3/lttng-modules-2.12.3/probes/lttng-probe-random.mod.o CC [M] /tmp/B.tmfHCy/BUILD/lttng-modules-2.12.3/lttng-modules-2.12.3/probes/lttng-probe-power.mod.o CC [M] /tmp/B.tmfHCy/BUILD/lttng-modules-2.12.3/lttng-modules-2.12.3/probes/lttng-probe-printk.mod.o CC [M] /tmp/B.tmfHCy/BUILD/lttng-modules-2.12.3/lttng-modules-2.12.3/probes/lttng-probe-rcu.mod.o CC [M] /tmp/B.tmfHCy/BUILD/lttng-modules-2.12.3/lttng-modules-2.12.3/probes/lttng-probe-regmap.mod.o CC [M] /tmp/B.tmfHCy/BUILD/lttng-modules-2.12.3/lttng-modules-2.12.3/probes/lttng-probe-regulator.mod.o CC [M] /tmp/B.tmfHCy/BUILD/lttng-modules-2.12.3/lttng-modules-2.12.3/probes/lttng-probe-sched.mod.o CC [M] /tmp/B.tmfHCy/BUILD/lttng-modules-2.12.3/lttng-modules-2.12.3/probes/lttng-probe-signal.mod.o CC [M] /tmp/B.tmfHCy/BUILD/lttng-modules-2.12.3/lttng-modules-2.12.3/probes/lttng-probe-scsi.mod.o CC [M] /tmp/B.tmfHCy/BUILD/lttng-modules-2.12.3/lttng-modules-2.12.3/probes/lttng-probe-skb.mod.o CC [M] /tmp/B.tmfHCy/BUILD/lttng-modules-2.12.3/lttng-modules-2.12.3/probes/lttng-probe-sock.mod.o CC [M] /tmp/B.tmfHCy/BUILD/lttng-modules-2.12.3/lttng-modules-2.12.3/probes/lttng-probe-sunrpc.mod.o CC [M] /tmp/B.tmfHCy/BUILD/lttng-modules-2.12.3/lttng-modules-2.12.3/probes/lttng-probe-timer.mod.o CC [M] /tmp/B.tmfHCy/BUILD/lttng-modules-2.12.3/lttng-modules-2.12.3/probes/lttng-probe-statedump.mod.o CC [M] /tmp/B.tmfHCy/BUILD/lttng-modules-2.12.3/lttng-modules-2.12.3/probes/lttng-probe-udp.mod.o CC [M] /tmp/B.tmfHCy/BUILD/lttng-modules-2.12.3/lttng-modules-2.12.3/probes/lttng-probe-v4l2.mod.o LD [M] /tmp/B.tmfHCy/BUILD/lttng-modules-2.12.3/lttng-modules-2.12.3/lib/lttng-lib-ring-buffer.ko CC [M] /tmp/B.tmfHCy/BUILD/lttng-modules-2.12.3/lttng-modules-2.12.3/probes/lttng-probe-vmscan.mod.o LD [M] /tmp/B.tmfHCy/BUILD/lttng-modules-2.12.3/lttng-modules-2.12.3/lttng-clock.ko LD [M] /tmp/B.tmfHCy/BUILD/lttng-modules-2.12.3/lttng-modules-2.12.3/lttng-ring-buffer-client-discard.ko LD [M] /tmp/B.tmfHCy/BUILD/lttng-modules-2.12.3/lttng-modules-2.12.3/lttng-ring-buffer-client-mmap-discard.ko CC [M] /tmp/B.tmfHCy/BUILD/lttng-modules-2.12.3/lttng-modules-2.12.3/probes/lttng-probe-workqueue.mod.o LD [M] /tmp/B.tmfHCy/BUILD/lttng-modules-2.12.3/lttng-modules-2.12.3/lttng-ring-buffer-client-mmap-overwrite.ko LD [M] /tmp/B.tmfHCy/BUILD/lttng-modules-2.12.3/lttng-modules-2.12.3/lttng-ring-buffer-client-overwrite.ko LD [M] /tmp/B.tmfHCy/BUILD/lttng-modules-2.12.3/lttng-modules-2.12.3/lttng-ring-buffer-metadata-client.ko LD [M] /tmp/B.tmfHCy/BUILD/lttng-modules-2.12.3/lttng-modules-2.12.3/lttng-ring-buffer-metadata-mmap-client.ko LD [M] /tmp/B.tmfHCy/BUILD/lttng-modules-2.12.3/lttng-modules-2.12.3/lttng-statedump.ko LD [M] /tmp/B.tmfHCy/BUILD/lttng-modules-2.12.3/lttng-modules-2.12.3/lttng-tracer.ko LD [M] /tmp/B.tmfHCy/BUILD/lttng-modules-2.12.3/lttng-modules-2.12.3/lttng-wrapper.ko LD [M] /tmp/B.tmfHCy/BUILD/lttng-modules-2.12.3/lttng-modules-2.12.3/probes/lttng-kprobes.ko LD [M] /tmp/B.tmfHCy/BUILD/lttng-modules-2.12.3/lttng-modules-2.12.3/probes/lttng-kretprobes.ko LD [M] /tmp/B.tmfHCy/BUILD/lttng-modules-2.12.3/lttng-modules-2.12.3/probes/lttng-probe-9p.ko LD [M] /tmp/B.tmfHCy/BUILD/lttng-modules-2.12.3/lttng-modules-2.12.3/probes/lttng-probe-asoc.ko CC [M] /tmp/B.tmfHCy/BUILD/lttng-modules-2.12.3/lttng-modules-2.12.3/probes/lttng-probe-writeback.mod.o LD [M] /tmp/B.tmfHCy/BUILD/lttng-modules-2.12.3/lttng-modules-2.12.3/probes/lttng-probe-block.ko LD [M] /tmp/B.tmfHCy/BUILD/lttng-modules-2.12.3/lttng-modules-2.12.3/probes/lttng-probe-btrfs.ko LD [M] /tmp/B.tmfHCy/BUILD/lttng-modules-2.12.3/lttng-modules-2.12.3/probes/lttng-probe-compaction.ko CC [M] /tmp/B.tmfHCy/BUILD/lttng-modules-2.12.3/lttng-modules-2.12.3/probes/lttng-probe-x86-exceptions.mod.o LD [M] /tmp/B.tmfHCy/BUILD/lttng-modules-2.12.3/lttng-modules-2.12.3/probes/lttng-probe-ext4.ko CC [M] /tmp/B.tmfHCy/BUILD/lttng-modules-2.12.3/lttng-modules-2.12.3/probes/lttng-probe-x86-irq-vectors.mod.o LD [M] /tmp/B.tmfHCy/BUILD/lttng-modules-2.12.3/lttng-modules-2.12.3/probes/lttng-probe-gpio.ko LD [M] /tmp/B.tmfHCy/BUILD/lttng-modules-2.12.3/lttng-modules-2.12.3/probes/lttng-probe-i2c.ko LD [M] /tmp/B.tmfHCy/BUILD/lttng-modules-2.12.3/lttng-modules-2.12.3/probes/lttng-probe-irq.ko LD [M] /tmp/B.tmfHCy/BUILD/lttng-modules-2.12.3/lttng-modules-2.12.3/probes/lttng-probe-jbd2.ko LD [M] /tmp/B.tmfHCy/BUILD/lttng-modules-2.12.3/lttng-modules-2.12.3/probes/lttng-probe-kmem.ko LD [M] /tmp/B.tmfHCy/BUILD/lttng-modules-2.12.3/lttng-modules-2.12.3/probes/lttng-probe-kvm-x86-mmu.ko LD [M] /tmp/B.tmfHCy/BUILD/lttng-modules-2.12.3/lttng-modules-2.12.3/probes/lttng-probe-kvm-x86.ko LD [M] /tmp/B.tmfHCy/BUILD/lttng-modules-2.12.3/lttng-modules-2.12.3/probes/lttng-probe-kvm.ko LD [M] /tmp/B.tmfHCy/BUILD/lttng-modules-2.12.3/lttng-modules-2.12.3/probes/lttng-probe-module.ko LD [M] /tmp/B.tmfHCy/BUILD/lttng-modules-2.12.3/lttng-modules-2.12.3/probes/lttng-probe-napi.ko LD [M] /tmp/B.tmfHCy/BUILD/lttng-modules-2.12.3/lttng-modules-2.12.3/probes/lttng-probe-net.ko LD [M] /tmp/B.tmfHCy/BUILD/lttng-modules-2.12.3/lttng-modules-2.12.3/probes/lttng-probe-printk.ko LD [M] /tmp/B.tmfHCy/BUILD/lttng-modules-2.12.3/lttng-modules-2.12.3/probes/lttng-probe-power.ko CC [M] /tmp/B.tmfHCy/BUILD/lttng-modules-2.12.3/lttng-modules-2.12.3/probes/lttng-uprobes.mod.o LD [M] /tmp/B.tmfHCy/BUILD/lttng-modules-2.12.3/lttng-modules-2.12.3/probes/lttng-probe-rcu.ko LD [M] /tmp/B.tmfHCy/BUILD/lttng-modules-2.12.3/lttng-modules-2.12.3/probes/lttng-probe-random.ko LD [M] /tmp/B.tmfHCy/BUILD/lttng-modules-2.12.3/lttng-modules-2.12.3/probes/lttng-probe-regmap.ko LD [M] /tmp/B.tmfHCy/BUILD/lttng-modules-2.12.3/lttng-modules-2.12.3/probes/lttng-probe-regulator.ko LD [M] /tmp/B.tmfHCy/BUILD/lttng-modules-2.12.3/lttng-modules-2.12.3/probes/lttng-probe-sched.ko LD [M] /tmp/B.tmfHCy/BUILD/lttng-modules-2.12.3/lttng-modules-2.12.3/probes/lttng-probe-scsi.ko LD [M] /tmp/B.tmfHCy/BUILD/lttng-modules-2.12.3/lttng-modules-2.12.3/probes/lttng-probe-signal.ko LD [M] /tmp/B.tmfHCy/BUILD/lttng-modules-2.12.3/lttng-modules-2.12.3/probes/lttng-probe-skb.ko LD [M] /tmp/B.tmfHCy/BUILD/lttng-modules-2.12.3/lttng-modules-2.12.3/probes/lttng-probe-sock.ko LD [M] /tmp/B.tmfHCy/BUILD/lttng-modules-2.12.3/lttng-modules-2.12.3/probes/lttng-probe-statedump.ko LD [M] /tmp/B.tmfHCy/BUILD/lttng-modules-2.12.3/lttng-modules-2.12.3/probes/lttng-probe-sunrpc.ko LD [M] /tmp/B.tmfHCy/BUILD/lttng-modules-2.12.3/lttng-modules-2.12.3/probes/lttng-probe-timer.ko LD [M] /tmp/B.tmfHCy/BUILD/lttng-modules-2.12.3/lttng-modules-2.12.3/probes/lttng-probe-udp.ko LD [M] /tmp/B.tmfHCy/BUILD/lttng-modules-2.12.3/lttng-modules-2.12.3/probes/lttng-probe-v4l2.ko LD [M] /tmp/B.tmfHCy/BUILD/lttng-modules-2.12.3/lttng-modules-2.12.3/probes/lttng-probe-vmscan.ko LD [M] /tmp/B.tmfHCy/BUILD/lttng-modules-2.12.3/lttng-modules-2.12.3/probes/lttng-probe-workqueue.ko LD [M] /tmp/B.tmfHCy/BUILD/lttng-modules-2.12.3/lttng-modules-2.12.3/probes/lttng-probe-writeback.ko LD [M] /tmp/B.tmfHCy/BUILD/lttng-modules-2.12.3/lttng-modules-2.12.3/probes/lttng-probe-x86-exceptions.ko LD [M] /tmp/B.tmfHCy/BUILD/lttng-modules-2.12.3/lttng-modules-2.12.3/probes/lttng-probe-x86-irq-vectors.ko LD [M] /tmp/B.tmfHCy/BUILD/lttng-modules-2.12.3/lttng-modules-2.12.3/probes/lttng-uprobes.ko CC [M] /tmp/B.tmfHCy/BUILD/lttng-modules-2.12.3/lttng-modules-2.12.3/tests/lttng-clock-plugin-test.mod.o LD [M] /tmp/B.tmfHCy/BUILD/lttng-modules-2.12.3/lttng-modules-2.12.3/tests/lttng-clock-plugin-test.ko CC [M] /tmp/B.tmfHCy/BUILD/lttng-modules-2.12.3/lttng-modules-2.12.3/tests/lttng-test.mod.o LD [M] /tmp/B.tmfHCy/BUILD/lttng-modules-2.12.3/lttng-modules-2.12.3/tests/lttng-test.ko + pwd + p=/tmp/B.tmfHCy/BUILD/lttng-modules-2.12.3/lttng-modules-2.12.3 + /usr/bin/make -Otarget -j9 modules_install 'INSTALL_MOD_PATH=/tmp/B.tmfHCy/BUILD/lttng-modules-2.12.3/lttng-modules-2.12.3/../installed' 'INSTALL_MOD_DIR=kernel/lttng' 'KERNELDIR=/usr/src/linux-5.10' /usr/bin/make -C /usr/src/linux-5.10 M=/tmp/B.tmfHCy/BUILD/lttng-modules-2.12.3/lttng-modules-2.12.3 CONFIG_LTTNG=m CONFIG_LTTNG_CLOCK_PLUGIN_TEST=m modules_install INSTALL /tmp/B.tmfHCy/BUILD/lttng-modules-2.12.3/lttng-modules-2.12.3/lttng-clock.ko At main.c:160: - SSL error:02001002:system library:fopen:No such file or directory: crypto/bio/bss_file.c:69 - SSL error:2006D080:BIO routines:BIO_new_file:no such file: crypto/bio/bss_file.c:76 sign-file: certs/signing_key.pem: No such file or directory INSTALL /tmp/B.tmfHCy/BUILD/lttng-modules-2.12.3/lttng-modules-2.12.3/lttng-ring-buffer-metadata-mmap-client.ko At main.c:160: - SSL error:02001002:system library:fopen:No such file or directory: crypto/bio/bss_file.c:69 - SSL error:2006D080:BIO routines:BIO_new_file:no such file: crypto/bio/bss_file.c:76 sign-file: certs/signing_key.pem: No such file or directory INSTALL /tmp/B.tmfHCy/BUILD/lttng-modules-2.12.3/lttng-modules-2.12.3/lttng-ring-buffer-client-mmap-discard.ko At main.c:160: - SSL error:02001002:system library:fopen:No such file or directory: crypto/bio/bss_file.c:69 - SSL error:2006D080:BIO routines:BIO_new_file:no such file: crypto/bio/bss_file.c:76 sign-file: certs/signing_key.pem: No such file or directory INSTALL /tmp/B.tmfHCy/BUILD/lttng-modules-2.12.3/lttng-modules-2.12.3/lttng-ring-buffer-client-discard.ko At main.c:160: - SSL error:02001002:system library:fopen:No such file or directory: crypto/bio/bss_file.c:69 - SSL error:2006D080:BIO routines:BIO_new_file:no such file: crypto/bio/bss_file.c:76 sign-file: certs/signing_key.pem: No such file or directory INSTALL /tmp/B.tmfHCy/BUILD/lttng-modules-2.12.3/lttng-modules-2.12.3/lttng-ring-buffer-client-mmap-overwrite.ko At main.c:160: - SSL error:02001002:system library:fopen:No such file or directory: crypto/bio/bss_file.c:69 - SSL error:2006D080:BIO routines:BIO_new_file:no such file: crypto/bio/bss_file.c:76 sign-file: certs/signing_key.pem: No such file or directory INSTALL /tmp/B.tmfHCy/BUILD/lttng-modules-2.12.3/lttng-modules-2.12.3/lttng-ring-buffer-client-overwrite.ko At main.c:160: - SSL error:02001002:system library:fopen:No such file or directory: crypto/bio/bss_file.c:69 - SSL error:2006D080:BIO routines:BIO_new_file:no such file: crypto/bio/bss_file.c:76 sign-file: certs/signing_key.pem: No such file or directory INSTALL /tmp/B.tmfHCy/BUILD/lttng-modules-2.12.3/lttng-modules-2.12.3/lttng-statedump.ko At main.c:160: - SSL error:02001002:system library:fopen:No such file or directory: crypto/bio/bss_file.c:69 - SSL error:2006D080:BIO routines:BIO_new_file:no such file: crypto/bio/bss_file.c:76 sign-file: certs/signing_key.pem: No such file or directory INSTALL /tmp/B.tmfHCy/BUILD/lttng-modules-2.12.3/lttng-modules-2.12.3/lttng-ring-buffer-metadata-client.ko At main.c:160: - SSL error:02001002:system library:fopen:No such file or directory: crypto/bio/bss_file.c:69 - SSL error:2006D080:BIO routines:BIO_new_file:no such file: crypto/bio/bss_file.c:76 sign-file: certs/signing_key.pem: No such file or directory INSTALL /tmp/B.tmfHCy/BUILD/lttng-modules-2.12.3/lttng-modules-2.12.3/lttng-wrapper.ko At main.c:160: - SSL error:02001002:system library:fopen:No such file or directory: crypto/bio/bss_file.c:69 - SSL error:2006D080:BIO routines:BIO_new_file:no such file: crypto/bio/bss_file.c:76 sign-file: certs/signing_key.pem: No such file or directory INSTALL /tmp/B.tmfHCy/BUILD/lttng-modules-2.12.3/lttng-modules-2.12.3/probes/lttng-kretprobes.ko At main.c:160: - SSL error:02001002:system library:fopen:No such file or directory: crypto/bio/bss_file.c:69 - SSL error:2006D080:BIO routines:BIO_new_file:no such file: crypto/bio/bss_file.c:76 sign-file: certs/signing_key.pem: No such file or directory INSTALL /tmp/B.tmfHCy/BUILD/lttng-modules-2.12.3/lttng-modules-2.12.3/probes/lttng-probe-9p.ko At main.c:160: - SSL error:02001002:system library:fopen:No such file or directory: crypto/bio/bss_file.c:69 - SSL error:2006D080:BIO routines:BIO_new_file:no such file: crypto/bio/bss_file.c:76 sign-file: certs/signing_key.pem: No such file or directory INSTALL /tmp/B.tmfHCy/BUILD/lttng-modules-2.12.3/lttng-modules-2.12.3/probes/lttng-kprobes.ko At main.c:160: - SSL error:02001002:system library:fopen:No such file or directory: crypto/bio/bss_file.c:69 - SSL error:2006D080:BIO routines:BIO_new_file:no such file: crypto/bio/bss_file.c:76 sign-file: certs/signing_key.pem: No such file or directory INSTALL /tmp/B.tmfHCy/BUILD/lttng-modules-2.12.3/lttng-modules-2.12.3/lib/lttng-lib-ring-buffer.ko At main.c:160: - SSL error:02001002:system library:fopen:No such file or directory: crypto/bio/bss_file.c:69 - SSL error:2006D080:BIO routines:BIO_new_file:no such file: crypto/bio/bss_file.c:76 sign-file: certs/signing_key.pem: No such file or directory INSTALL /tmp/B.tmfHCy/BUILD/lttng-modules-2.12.3/lttng-modules-2.12.3/probes/lttng-probe-block.ko At main.c:160: - SSL error:02001002:system library:fopen:No such file or directory: crypto/bio/bss_file.c:69 - SSL error:2006D080:BIO routines:BIO_new_file:no such file: crypto/bio/bss_file.c:76 sign-file: certs/signing_key.pem: No such file or directory INSTALL /tmp/B.tmfHCy/BUILD/lttng-modules-2.12.3/lttng-modules-2.12.3/probes/lttng-probe-asoc.ko At main.c:160: - SSL error:02001002:system library:fopen:No such file or directory: crypto/bio/bss_file.c:69 - SSL error:2006D080:BIO routines:BIO_new_file:no such file: crypto/bio/bss_file.c:76 sign-file: certs/signing_key.pem: No such file or directory INSTALL /tmp/B.tmfHCy/BUILD/lttng-modules-2.12.3/lttng-modules-2.12.3/probes/lttng-probe-btrfs.ko At main.c:160: - SSL error:02001002:system library:fopen:No such file or directory: crypto/bio/bss_file.c:69 - SSL error:2006D080:BIO routines:BIO_new_file:no such file: crypto/bio/bss_file.c:76 sign-file: certs/signing_key.pem: No such file or directory INSTALL /tmp/B.tmfHCy/BUILD/lttng-modules-2.12.3/lttng-modules-2.12.3/probes/lttng-probe-gpio.ko At main.c:160: - SSL error:02001002:system library:fopen:No such file or directory: crypto/bio/bss_file.c:69 - SSL error:2006D080:BIO routines:BIO_new_file:no such file: crypto/bio/bss_file.c:76 sign-file: certs/signing_key.pem: No such file or directory INSTALL /tmp/B.tmfHCy/BUILD/lttng-modules-2.12.3/lttng-modules-2.12.3/probes/lttng-probe-i2c.ko At main.c:160: - SSL error:02001002:system library:fopen:No such file or directory: crypto/bio/bss_file.c:69 - SSL error:2006D080:BIO routines:BIO_new_file:no such file: crypto/bio/bss_file.c:76 sign-file: certs/signing_key.pem: No such file or directory INSTALL /tmp/B.tmfHCy/BUILD/lttng-modules-2.12.3/lttng-modules-2.12.3/probes/lttng-probe-compaction.ko At main.c:160: - SSL error:02001002:system library:fopen:No such file or directory: crypto/bio/bss_file.c:69 - SSL error:2006D080:BIO routines:BIO_new_file:no such file: crypto/bio/bss_file.c:76 sign-file: certs/signing_key.pem: No such file or directory INSTALL /tmp/B.tmfHCy/BUILD/lttng-modules-2.12.3/lttng-modules-2.12.3/probes/lttng-probe-irq.ko At main.c:160: - SSL error:02001002:system library:fopen:No such file or directory: crypto/bio/bss_file.c:69 - SSL error:2006D080:BIO routines:BIO_new_file:no such file: crypto/bio/bss_file.c:76 sign-file: certs/signing_key.pem: No such file or directory INSTALL /tmp/B.tmfHCy/BUILD/lttng-modules-2.12.3/lttng-modules-2.12.3/probes/lttng-probe-jbd2.ko At main.c:160: - SSL error:02001002:system library:fopen:No such file or directory: crypto/bio/bss_file.c:69 - SSL error:2006D080:BIO routines:BIO_new_file:no such file: crypto/bio/bss_file.c:76 sign-file: certs/signing_key.pem: No such file or directory INSTALL /tmp/B.tmfHCy/BUILD/lttng-modules-2.12.3/lttng-modules-2.12.3/probes/lttng-probe-kvm-x86-mmu.ko At main.c:160: - SSL error:02001002:system library:fopen:No such file or directory: crypto/bio/bss_file.c:69 - SSL error:2006D080:BIO routines:BIO_new_file:no such file: crypto/bio/bss_file.c:76 sign-file: certs/signing_key.pem: No such file or directory INSTALL /tmp/B.tmfHCy/BUILD/lttng-modules-2.12.3/lttng-modules-2.12.3/probes/lttng-probe-kmem.ko At main.c:160: - SSL error:02001002:system library:fopen:No such file or directory: crypto/bio/bss_file.c:69 - SSL error:2006D080:BIO routines:BIO_new_file:no such file: crypto/bio/bss_file.c:76 sign-file: certs/signing_key.pem: No such file or directory INSTALL /tmp/B.tmfHCy/BUILD/lttng-modules-2.12.3/lttng-modules-2.12.3/probes/lttng-probe-napi.ko At main.c:160: - SSL error:02001002:system library:fopen:No such file or directory: crypto/bio/bss_file.c:69 - SSL error:2006D080:BIO routines:BIO_new_file:no such file: crypto/bio/bss_file.c:76 sign-file: certs/signing_key.pem: No such file or directory INSTALL /tmp/B.tmfHCy/BUILD/lttng-modules-2.12.3/lttng-modules-2.12.3/probes/lttng-probe-kvm.ko At main.c:160: - SSL error:02001002:system library:fopen:No such file or directory: crypto/bio/bss_file.c:69 - SSL error:2006D080:BIO routines:BIO_new_file:no such file: crypto/bio/bss_file.c:76 sign-file: certs/signing_key.pem: No such file or directory INSTALL /tmp/B.tmfHCy/BUILD/lttng-modules-2.12.3/lttng-modules-2.12.3/probes/lttng-probe-module.ko At main.c:160: - SSL error:02001002:system library:fopen:No such file or directory: crypto/bio/bss_file.c:69 - SSL error:2006D080:BIO routines:BIO_new_file:no such file: crypto/bio/bss_file.c:76 sign-file: certs/signing_key.pem: No such file or directory INSTALL /tmp/B.tmfHCy/BUILD/lttng-modules-2.12.3/lttng-modules-2.12.3/probes/lttng-probe-power.ko At main.c:160: - SSL error:02001002:system library:fopen:No such file or directory: crypto/bio/bss_file.c:69 - SSL error:2006D080:BIO routines:BIO_new_file:no such file: crypto/bio/bss_file.c:76 sign-file: certs/signing_key.pem: No such file or directory INSTALL /tmp/B.tmfHCy/BUILD/lttng-modules-2.12.3/lttng-modules-2.12.3/probes/lttng-probe-net.ko At main.c:160: - SSL error:02001002:system library:fopen:No such file or directory: crypto/bio/bss_file.c:69 - SSL error:2006D080:BIO routines:BIO_new_file:no such file: crypto/bio/bss_file.c:76 sign-file: certs/signing_key.pem: No such file or directory INSTALL /tmp/B.tmfHCy/BUILD/lttng-modules-2.12.3/lttng-modules-2.12.3/probes/lttng-probe-printk.ko At main.c:160: - SSL error:02001002:system library:fopen:No such file or directory: crypto/bio/bss_file.c:69 - SSL error:2006D080:BIO routines:BIO_new_file:no such file: crypto/bio/bss_file.c:76 sign-file: certs/signing_key.pem: No such file or directory INSTALL /tmp/B.tmfHCy/BUILD/lttng-modules-2.12.3/lttng-modules-2.12.3/probes/lttng-probe-rcu.ko At main.c:160: - SSL error:02001002:system library:fopen:No such file or directory: crypto/bio/bss_file.c:69 - SSL error:2006D080:BIO routines:BIO_new_file:no such file: crypto/bio/bss_file.c:76 sign-file: certs/signing_key.pem: No such file or directory INSTALL /tmp/B.tmfHCy/BUILD/lttng-modules-2.12.3/lttng-modules-2.12.3/probes/lttng-probe-kvm-x86.ko At main.c:160: - SSL error:02001002:system library:fopen:No such file or directory: crypto/bio/bss_file.c:69 - SSL error:2006D080:BIO routines:BIO_new_file:no such file: crypto/bio/bss_file.c:76 sign-file: certs/signing_key.pem: No such file or directory INSTALL /tmp/B.tmfHCy/BUILD/lttng-modules-2.12.3/lttng-modules-2.12.3/probes/lttng-probe-ext4.ko At main.c:160: - SSL error:02001002:system library:fopen:No such file or directory: crypto/bio/bss_file.c:69 - SSL error:2006D080:BIO routines:BIO_new_file:no such file: crypto/bio/bss_file.c:76 sign-file: certs/signing_key.pem: No such file or directory INSTALL /tmp/B.tmfHCy/BUILD/lttng-modules-2.12.3/lttng-modules-2.12.3/probes/lttng-probe-regmap.ko At main.c:160: - SSL error:02001002:system library:fopen:No such file or directory: crypto/bio/bss_file.c:69 - SSL error:2006D080:BIO routines:BIO_new_file:no such file: crypto/bio/bss_file.c:76 sign-file: certs/signing_key.pem: No such file or directory INSTALL /tmp/B.tmfHCy/BUILD/lttng-modules-2.12.3/lttng-modules-2.12.3/probes/lttng-probe-random.ko At main.c:160: - SSL error:02001002:system library:fopen:No such file or directory: crypto/bio/bss_file.c:69 - SSL error:2006D080:BIO routines:BIO_new_file:no such file: crypto/bio/bss_file.c:76 sign-file: certs/signing_key.pem: No such file or directory INSTALL /tmp/B.tmfHCy/BUILD/lttng-modules-2.12.3/lttng-modules-2.12.3/probes/lttng-probe-signal.ko At main.c:160: - SSL error:02001002:system library:fopen:No such file or directory: crypto/bio/bss_file.c:69 - SSL error:2006D080:BIO routines:BIO_new_file:no such file: crypto/bio/bss_file.c:76 sign-file: certs/signing_key.pem: No such file or directory INSTALL /tmp/B.tmfHCy/BUILD/lttng-modules-2.12.3/lttng-modules-2.12.3/probes/lttng-probe-regulator.ko At main.c:160: - SSL error:02001002:system library:fopen:No such file or directory: crypto/bio/bss_file.c:69 - SSL error:2006D080:BIO routines:BIO_new_file:no such file: crypto/bio/bss_file.c:76 sign-file: certs/signing_key.pem: No such file or directory INSTALL /tmp/B.tmfHCy/BUILD/lttng-modules-2.12.3/lttng-modules-2.12.3/probes/lttng-probe-scsi.ko At main.c:160: - SSL error:02001002:system library:fopen:No such file or directory: crypto/bio/bss_file.c:69 - SSL error:2006D080:BIO routines:BIO_new_file:no such file: crypto/bio/bss_file.c:76 sign-file: certs/signing_key.pem: No such file or directory INSTALL /tmp/B.tmfHCy/BUILD/lttng-modules-2.12.3/lttng-modules-2.12.3/probes/lttng-probe-sched.ko At main.c:160: - SSL error:02001002:system library:fopen:No such file or directory: crypto/bio/bss_file.c:69 - SSL error:2006D080:BIO routines:BIO_new_file:no such file: crypto/bio/bss_file.c:76 sign-file: certs/signing_key.pem: No such file or directory INSTALL /tmp/B.tmfHCy/BUILD/lttng-modules-2.12.3/lttng-modules-2.12.3/probes/lttng-probe-skb.ko At main.c:160: - SSL error:02001002:system library:fopen:No such file or directory: crypto/bio/bss_file.c:69 - SSL error:2006D080:BIO routines:BIO_new_file:no such file: crypto/bio/bss_file.c:76 sign-file: certs/signing_key.pem: No such file or directory INSTALL /tmp/B.tmfHCy/BUILD/lttng-modules-2.12.3/lttng-modules-2.12.3/probes/lttng-probe-sock.ko At main.c:160: - SSL error:02001002:system library:fopen:No such file or directory: crypto/bio/bss_file.c:69 - SSL error:2006D080:BIO routines:BIO_new_file:no such file: crypto/bio/bss_file.c:76 sign-file: certs/signing_key.pem: No such file or directory INSTALL /tmp/B.tmfHCy/BUILD/lttng-modules-2.12.3/lttng-modules-2.12.3/probes/lttng-probe-udp.ko At main.c:160: - SSL error:02001002:system library:fopen:No such file or directory: crypto/bio/bss_file.c:69 - SSL error:2006D080:BIO routines:BIO_new_file:no such file: crypto/bio/bss_file.c:76 sign-file: certs/signing_key.pem: No such file or directory INSTALL /tmp/B.tmfHCy/BUILD/lttng-modules-2.12.3/lttng-modules-2.12.3/probes/lttng-probe-sunrpc.ko At main.c:160: - SSL error:02001002:system library:fopen:No such file or directory: crypto/bio/bss_file.c:69 - SSL error:2006D080:BIO routines:BIO_new_file:no such file: crypto/bio/bss_file.c:76 sign-file: certs/signing_key.pem: No such file or directory INSTALL /tmp/B.tmfHCy/BUILD/lttng-modules-2.12.3/lttng-modules-2.12.3/probes/lttng-probe-timer.ko At main.c:160: - SSL error:02001002:system library:fopen:No such file or directory: crypto/bio/bss_file.c:69 - SSL error:2006D080:BIO routines:BIO_new_file:no such file: crypto/bio/bss_file.c:76 sign-file: certs/signing_key.pem: No such file or directory INSTALL /tmp/B.tmfHCy/BUILD/lttng-modules-2.12.3/lttng-modules-2.12.3/probes/lttng-probe-workqueue.ko At main.c:160: - SSL error:02001002:system library:fopen:No such file or directory: crypto/bio/bss_file.c:69 - SSL error:2006D080:BIO routines:BIO_new_file:no such file: crypto/bio/bss_file.c:76 sign-file: certs/signing_key.pem: No such file or directory INSTALL /tmp/B.tmfHCy/BUILD/lttng-modules-2.12.3/lttng-modules-2.12.3/probes/lttng-probe-statedump.ko At main.c:160: - SSL error:02001002:system library:fopen:No such file or directory: crypto/bio/bss_file.c:69 - SSL error:2006D080:BIO routines:BIO_new_file:no such file: crypto/bio/bss_file.c:76 sign-file: certs/signing_key.pem: No such file or directory INSTALL /tmp/B.tmfHCy/BUILD/lttng-modules-2.12.3/lttng-modules-2.12.3/probes/lttng-probe-v4l2.ko At main.c:160: - SSL error:02001002:system library:fopen:No such file or directory: crypto/bio/bss_file.c:69 - SSL error:2006D080:BIO routines:BIO_new_file:no such file: crypto/bio/bss_file.c:76 sign-file: certs/signing_key.pem: No such file or directory INSTALL /tmp/B.tmfHCy/BUILD/lttng-modules-2.12.3/lttng-modules-2.12.3/probes/lttng-probe-vmscan.ko At main.c:160: - SSL error:02001002:system library:fopen:No such file or directory: crypto/bio/bss_file.c:69 - SSL error:2006D080:BIO routines:BIO_new_file:no such file: crypto/bio/bss_file.c:76 sign-file: certs/signing_key.pem: No such file or directory INSTALL /tmp/B.tmfHCy/BUILD/lttng-modules-2.12.3/lttng-modules-2.12.3/tests/lttng-clock-plugin-test.ko At main.c:160: - SSL error:02001002:system library:fopen:No such file or directory: crypto/bio/bss_file.c:69 - SSL error:2006D080:BIO routines:BIO_new_file:no such file: crypto/bio/bss_file.c:76 sign-file: certs/signing_key.pem: No such file or directory INSTALL /tmp/B.tmfHCy/BUILD/lttng-modules-2.12.3/lttng-modules-2.12.3/probes/lttng-probe-x86-irq-vectors.ko At main.c:160: - SSL error:02001002:system library:fopen:No such file or directory: crypto/bio/bss_file.c:69 - SSL error:2006D080:BIO routines:BIO_new_file:no such file: crypto/bio/bss_file.c:76 sign-file: certs/signing_key.pem: No such file or directory INSTALL /tmp/B.tmfHCy/BUILD/lttng-modules-2.12.3/lttng-modules-2.12.3/probes/lttng-probe-x86-exceptions.ko At main.c:160: - SSL error:02001002:system library:fopen:No such file or directory: crypto/bio/bss_file.c:69 - SSL error:2006D080:BIO routines:BIO_new_file:no such file: crypto/bio/bss_file.c:76 sign-file: certs/signing_key.pem: No such file or directory INSTALL /tmp/B.tmfHCy/BUILD/lttng-modules-2.12.3/lttng-modules-2.12.3/probes/lttng-uprobes.ko At main.c:160: - SSL error:02001002:system library:fopen:No such file or directory: crypto/bio/bss_file.c:69 - SSL error:2006D080:BIO routines:BIO_new_file:no such file: crypto/bio/bss_file.c:76 sign-file: certs/signing_key.pem: No such file or directory INSTALL /tmp/B.tmfHCy/BUILD/lttng-modules-2.12.3/lttng-modules-2.12.3/tests/lttng-test.ko At main.c:160: - SSL error:02001002:system library:fopen:No such file or directory: crypto/bio/bss_file.c:69 - SSL error:2006D080:BIO routines:BIO_new_file:no such file: crypto/bio/bss_file.c:76 sign-file: certs/signing_key.pem: No such file or directory INSTALL /tmp/B.tmfHCy/BUILD/lttng-modules-2.12.3/lttng-modules-2.12.3/probes/lttng-probe-writeback.ko At main.c:160: - SSL error:02001002:system library:fopen:No such file or directory: crypto/bio/bss_file.c:69 - SSL error:2006D080:BIO routines:BIO_new_file:no such file: crypto/bio/bss_file.c:76 sign-file: certs/signing_key.pem: No such file or directory INSTALL /tmp/B.tmfHCy/BUILD/lttng-modules-2.12.3/lttng-modules-2.12.3/lttng-tracer.ko At main.c:160: - SSL error:02001002:system library:fopen:No such file or directory: crypto/bio/bss_file.c:69 - SSL error:2006D080:BIO routines:BIO_new_file:no such file: crypto/bio/bss_file.c:76 sign-file: certs/signing_key.pem: No such file or directory make[1]: Entering directory '/usr/src/linux-5.10-5.10.17' DEPMOD 5.10.17-1 Warning: modules_install: missing 'System.map' file. Skipping depmod. make[1]: Leaving directory '/usr/src/linux-5.10-5.10.17' + /usr/bin/make -Otarget -j9 clean 'KERNELDIR=/usr/src/linux' /usr/bin/make -C /usr/src/linux M=/tmp/B.tmfHCy/BUILD/lttng-modules-2.12.3/lttng-modules-2.12.3 clean find: '/tmp/B.tmfHCy/BUILD/lttng-modules-2.12.3/lttng-modules-2.12.3/extra_version/patches/': No such file or directory find: '/tmp/B.tmfHCy/BUILD/lttng-modules-2.12.3/lttng-modules-2.12.3/lib/../extra_version/patches/': No such file or directory find: '/tmp/B.tmfHCy/BUILD/lttng-modules-2.12.3/lttng-modules-2.12.3/tests/../extra_version/patches/': No such file or directory find: '/tmp/B.tmfHCy/BUILD/lttng-modules-2.12.3/lttng-modules-2.12.3/probes/../extra_version/patches/': No such file or directory make[1]: Entering directory '/usr/src/linux-5.11.0' CLEAN /tmp/B.tmfHCy/BUILD/lttng-modules-2.12.3/lttng-modules-2.12.3/Module.symvers make[1]: Leaving directory '/usr/src/linux-5.11.0' + /usr/bin/make -Otarget -j9 'KERNELDIR=/usr/src/linux' /usr/bin/make -C /usr/src/linux M=/tmp/B.tmfHCy/BUILD/lttng-modules-2.12.3/lttng-modules-2.12.3 CONFIG_LTTNG=m CONFIG_LTTNG_CLOCK_PLUGIN_TEST=m modules find: '/tmp/B.tmfHCy/BUILD/lttng-modules-2.12.3/lttng-modules-2.12.3/extra_version/patches/': No such file or directory find: '/tmp/B.tmfHCy/BUILD/lttng-modules-2.12.3/lttng-modules-2.12.3/tests/../extra_version/patches/': No such file or directory find: '/tmp/B.tmfHCy/BUILD/lttng-modules-2.12.3/lttng-modules-2.12.3/lib/../extra_version/patches/': No such file or directory find: '/tmp/B.tmfHCy/BUILD/lttng-modules-2.12.3/lttng-modules-2.12.3/probes/../extra_version/patches/': No such file or directory CC [M] /tmp/B.tmfHCy/BUILD/lttng-modules-2.12.3/lttng-modules-2.12.3/lttng-ring-buffer-metadata-mmap-client.o CC [M] /tmp/B.tmfHCy/BUILD/lttng-modules-2.12.3/lttng-modules-2.12.3/lttng-ring-buffer-metadata-client.o CC [M] /tmp/B.tmfHCy/BUILD/lttng-modules-2.12.3/lttng-modules-2.12.3/tests/probes/lttng-test.o CC [M] /tmp/B.tmfHCy/BUILD/lttng-modules-2.12.3/lttng-modules-2.12.3/lttng-ring-buffer-client-discard.o CC [M] /tmp/B.tmfHCy/BUILD/lttng-modules-2.12.3/lttng-modules-2.12.3/lttng-ring-buffer-client-mmap-discard.o CC [M] /tmp/B.tmfHCy/BUILD/lttng-modules-2.12.3/lttng-modules-2.12.3/lttng-ring-buffer-client-overwrite.o CC [M] /tmp/B.tmfHCy/BUILD/lttng-modules-2.12.3/lttng-modules-2.12.3/lttng-ring-buffer-client-mmap-overwrite.o LD [M] /tmp/B.tmfHCy/BUILD/lttng-modules-2.12.3/lttng-modules-2.12.3/tests/lttng-test.o CC [M] /tmp/B.tmfHCy/BUILD/lttng-modules-2.12.3/lttng-modules-2.12.3/lttng-string-utils.o CC [M] /tmp/B.tmfHCy/BUILD/lttng-modules-2.12.3/lttng-modules-2.12.3/lib/ringbuffer/ring_buffer_backend.o CC [M] /tmp/B.tmfHCy/BUILD/lttng-modules-2.12.3/lttng-modules-2.12.3/tests/clock-plugin/lttng-clock-plugin-test.o LD [M] /tmp/B.tmfHCy/BUILD/lttng-modules-2.12.3/lttng-modules-2.12.3/tests/lttng-clock-plugin-test.o CC [M] /tmp/B.tmfHCy/BUILD/lttng-modules-2.12.3/lttng-modules-2.12.3/probes/lttng-probe-irq.o CC [M] /tmp/B.tmfHCy/BUILD/lttng-modules-2.12.3/lttng-modules-2.12.3/lttng-clock.o CC [M] /tmp/B.tmfHCy/BUILD/lttng-modules-2.12.3/lttng-modules-2.12.3/probes/lttng-probe-sched.o CC [M] /tmp/B.tmfHCy/BUILD/lttng-modules-2.12.3/lttng-modules-2.12.3/lttng-abi.o CC [M] /tmp/B.tmfHCy/BUILD/lttng-modules-2.12.3/lttng-modules-2.12.3/lttng-probes.o CC [M] /tmp/B.tmfHCy/BUILD/lttng-modules-2.12.3/lttng-modules-2.12.3/lib/ringbuffer/ring_buffer_frontend.o CC [M] /tmp/B.tmfHCy/BUILD/lttng-modules-2.12.3/lttng-modules-2.12.3/lib/ringbuffer/ring_buffer_iterator.o CC [M] /tmp/B.tmfHCy/BUILD/lttng-modules-2.12.3/lttng-modules-2.12.3/probes/lttng-probe-module.o CC [M] /tmp/B.tmfHCy/BUILD/lttng-modules-2.12.3/lttng-modules-2.12.3/probes/lttng-probe-timer.o CC [M] /tmp/B.tmfHCy/BUILD/lttng-modules-2.12.3/lttng-modules-2.12.3/lttng-events.o CC [M] /tmp/B.tmfHCy/BUILD/lttng-modules-2.12.3/lttng-modules-2.12.3/lttng-context-pid.o CC [M] /tmp/B.tmfHCy/BUILD/lttng-modules-2.12.3/lttng-modules-2.12.3/probes/lttng-probe-kmem.o CC [M] /tmp/B.tmfHCy/BUILD/lttng-modules-2.12.3/lttng-modules-2.12.3/lttng-context.o CC [M] /tmp/B.tmfHCy/BUILD/lttng-modules-2.12.3/lttng-modules-2.12.3/probes/lttng-probe-power.o CC [M] /tmp/B.tmfHCy/BUILD/lttng-modules-2.12.3/lttng-modules-2.12.3/lib/ringbuffer/ring_buffer_vfs.o CC [M] /tmp/B.tmfHCy/BUILD/lttng-modules-2.12.3/lttng-modules-2.12.3/lttng-context-prio.o CC [M] /tmp/B.tmfHCy/BUILD/lttng-modules-2.12.3/lttng-modules-2.12.3/lttng-context-procname.o CC [M] /tmp/B.tmfHCy/BUILD/lttng-modules-2.12.3/lttng-modules-2.12.3/probes/lttng-probe-9p.o CC [M] /tmp/B.tmfHCy/BUILD/lttng-modules-2.12.3/lttng-modules-2.12.3/probes/lttng-probe-i2c.o CC [M] /tmp/B.tmfHCy/BUILD/lttng-modules-2.12.3/lttng-modules-2.12.3/lttng-context-vpid.o CC [M] /tmp/B.tmfHCy/BUILD/lttng-modules-2.12.3/lttng-modules-2.12.3/lttng-context-nice.o CC [M] /tmp/B.tmfHCy/BUILD/lttng-modules-2.12.3/lttng-modules-2.12.3/lttng-context-tid.o CC [M] /tmp/B.tmfHCy/BUILD/lttng-modules-2.12.3/lttng-modules-2.12.3/lib/ringbuffer/ring_buffer_splice.o CC [M] /tmp/B.tmfHCy/BUILD/lttng-modules-2.12.3/lttng-modules-2.12.3/lttng-context-vtid.o CC [M] /tmp/B.tmfHCy/BUILD/lttng-modules-2.12.3/lttng-modules-2.12.3/probes/lttng-probe-kvm.o CC [M] /tmp/B.tmfHCy/BUILD/lttng-modules-2.12.3/lttng-modules-2.12.3/probes/lttng-probe-statedump.o CC [M] /tmp/B.tmfHCy/BUILD/lttng-modules-2.12.3/lttng-modules-2.12.3/lttng-context-ppid.o CC [M] /tmp/B.tmfHCy/BUILD/lttng-modules-2.12.3/lttng-modules-2.12.3/lttng-context-vppid.o CC [M] /tmp/B.tmfHCy/BUILD/lttng-modules-2.12.3/lttng-modules-2.12.3/lib/prio_heap/lttng_prio_heap.o CC [M] /tmp/B.tmfHCy/BUILD/lttng-modules-2.12.3/lttng-modules-2.12.3/lttng-context-cpu-id.o CC [M] /tmp/B.tmfHCy/BUILD/lttng-modules-2.12.3/lttng-modules-2.12.3/lttng-context-uid.o CC [M] /tmp/B.tmfHCy/BUILD/lttng-modules-2.12.3/lttng-modules-2.12.3/lib/ringbuffer/ring_buffer_mmap.o CC [M] /tmp/B.tmfHCy/BUILD/lttng-modules-2.12.3/lttng-modules-2.12.3/probes/lttng-probe-x86-irq-vectors.o CC [M] /tmp/B.tmfHCy/BUILD/lttng-modules-2.12.3/lttng-modules-2.12.3/lib/../wrapper/splice.o LD [M] /tmp/B.tmfHCy/BUILD/lttng-modules-2.12.3/lttng-modules-2.12.3/lib/lttng-lib-ring-buffer.o CC [M] /tmp/B.tmfHCy/BUILD/lttng-modules-2.12.3/lttng-modules-2.12.3/probes/lttng-probe-x86-exceptions.o CC [M] /tmp/B.tmfHCy/BUILD/lttng-modules-2.12.3/lttng-modules-2.12.3/lttng-context-euid.o CC [M] /tmp/B.tmfHCy/BUILD/lttng-modules-2.12.3/lttng-modules-2.12.3/probes/lttng-probe-signal.o CC [M] /tmp/B.tmfHCy/BUILD/lttng-modules-2.12.3/lttng-modules-2.12.3/lttng-context-suid.o CC [M] /tmp/B.tmfHCy/BUILD/lttng-modules-2.12.3/lttng-modules-2.12.3/lttng-context-gid.o CC [M] /tmp/B.tmfHCy/BUILD/lttng-modules-2.12.3/lttng-modules-2.12.3/probes/lttng-probe-block.o In file included from /tmp/B.tmfHCy/BUILD/lttng-modules-2.12.3/lttng-modules-2.12.3/probes/../probes/define_trace.h:87, from /tmp/B.tmfHCy/BUILD/lttng-modules-2.12.3/lttng-modules-2.12.3/probes/../instrumentation/events/lttng-module/block.h:1122, from /tmp/B.tmfHCy/BUILD/lttng-modules-2.12.3/lttng-modules-2.12.3/probes/lttng-probe-block.c:30: /tmp/B.tmfHCy/BUILD/lttng-modules-2.12.3/lttng-modules-2.12.3/probes/../probes/lttng-tracepoint-event-impl.h:131:6: error: conflicting types for 'trace_block_rq_requeue' 131 | void trace_##_name(_proto); | ^~~~~~ /tmp/B.tmfHCy/BUILD/lttng-modules-2.12.3/lttng-modules-2.12.3/probes/../probes/lttng-tracepoint-event-impl.h:43:2: note: in expansion of macro 'LTTNG_TRACEPOINT_EVENT_INSTANCE_MAP' 43 | LTTNG_TRACEPOINT_EVENT_INSTANCE_MAP(map, name, map, PARAMS(proto), PARAMS(args)) | ^~~~~~~~~~~~~~~~~~~~~~~~~~~~~~~~~~~ /tmp/B.tmfHCy/BUILD/lttng-modules-2.12.3/lttng-modules-2.12.3/probes/../probes/lttng-tracepoint-event-impl.h:85:2: note: in expansion of macro 'LTTNG_TRACEPOINT_EVENT_MAP' 85 | LTTNG_TRACEPOINT_EVENT_MAP(name, name, \ | ^~~~~~~~~~~~~~~~~~~~~~~~~~ /tmp/B.tmfHCy/BUILD/lttng-modules-2.12.3/lttng-modules-2.12.3/probes/../instrumentation/events/lttng-module/block.h:279:1: note: in expansion of macro 'LTTNG_TRACEPOINT_EVENT' 279 | LTTNG_TRACEPOINT_EVENT(block_rq_requeue, | ^~~~~~~~~~~~~~~~~~~~~~ In file included from ./include/trace/events/block.h:11, from /tmp/B.tmfHCy/BUILD/lttng-modules-2.12.3/lttng-modules-2.12.3/probes/lttng-probe-block.c:19: ./include/linux/tracepoint.h:238:21: note: previous definition of 'trace_block_rq_requeue' was here 238 | static inline void trace_##name(proto) \ | ^~~~~~ ./include/linux/tracepoint.h:413:2: note: in expansion of macro '__DECLARE_TRACE' 413 | __DECLARE_TRACE(name, PARAMS(proto), PARAMS(args), \ | ^~~~~~~~~~~~~~~ ./include/linux/tracepoint.h:549:2: note: in expansion of macro 'DECLARE_TRACE' 549 | DECLARE_TRACE(name, PARAMS(proto), PARAMS(args)) | ^~~~~~~~~~~~~ ./include/trace/events/block.h:73:1: note: in expansion of macro 'TRACE_EVENT' 73 | TRACE_EVENT(block_rq_requeue, | ^~~~~~~~~~~ In file included from /tmp/B.tmfHCy/BUILD/lttng-modules-2.12.3/lttng-modules-2.12.3/probes/../probes/define_trace.h:87, from /tmp/B.tmfHCy/BUILD/lttng-modules-2.12.3/lttng-modules-2.12.3/probes/../instrumentation/events/lttng-module/block.h:1122, from /tmp/B.tmfHCy/BUILD/lttng-modules-2.12.3/lttng-modules-2.12.3/probes/lttng-probe-block.c:30: /tmp/B.tmfHCy/BUILD/lttng-modules-2.12.3/lttng-modules-2.12.3/probes/../probes/lttng-tracepoint-event-impl.h:131:6: error: conflicting types for 'trace_block_rq_insert' 131 | void trace_##_name(_proto); | ^~~~~~ /tmp/B.tmfHCy/BUILD/lttng-modules-2.12.3/lttng-modules-2.12.3/probes/../probes/lttng-tracepoint-event-impl.h:96:2: note: in expansion of macro 'LTTNG_TRACEPOINT_EVENT_INSTANCE_MAP' 96 | LTTNG_TRACEPOINT_EVENT_INSTANCE_MAP(template, name, name, PARAMS(proto), PARAMS(args)) | ^~~~~~~~~~~~~~~~~~~~~~~~~~~~~~~~~~~ /tmp/B.tmfHCy/BUILD/lttng-modules-2.12.3/lttng-modules-2.12.3/probes/../instrumentation/events/lttng-module/block.h:563:1: note: in expansion of macro 'LTTNG_TRACEPOINT_EVENT_INSTANCE' 563 | LTTNG_TRACEPOINT_EVENT_INSTANCE(block_rq, block_rq_insert, | ^~~~~~~~~~~~~~~~~~~~~~~~~~~~~~~ In file included from ./include/trace/events/block.h:11, from /tmp/B.tmfHCy/BUILD/lttng-modules-2.12.3/lttng-modules-2.12.3/probes/lttng-probe-block.c:19: ./include/linux/tracepoint.h:238:21: note: previous definition of 'trace_block_rq_insert' was here 238 | static inline void trace_##name(proto) \ | ^~~~~~ ./include/linux/tracepoint.h:413:2: note: in expansion of macro '__DECLARE_TRACE' 413 | __DECLARE_TRACE(name, PARAMS(proto), PARAMS(args), \ | ^~~~~~~~~~~~~~~ ./include/linux/tracepoint.h:538:2: note: in expansion of macro 'DECLARE_TRACE' 538 | DECLARE_TRACE(name, PARAMS(proto), PARAMS(args)) | ^~~~~~~~~~~~~ ./include/trace/events/block.h:190:1: note: in expansion of macro 'DEFINE_EVENT' 190 | DEFINE_EVENT(block_rq, block_rq_insert, | ^~~~~~~~~~~~ In file included from /tmp/B.tmfHCy/BUILD/lttng-modules-2.12.3/lttng-modules-2.12.3/probes/../probes/define_trace.h:87, from /tmp/B.tmfHCy/BUILD/lttng-modules-2.12.3/lttng-modules-2.12.3/probes/../instrumentation/events/lttng-module/block.h:1122, from /tmp/B.tmfHCy/BUILD/lttng-modules-2.12.3/lttng-modules-2.12.3/probes/lttng-probe-block.c:30: /tmp/B.tmfHCy/BUILD/lttng-modules-2.12.3/lttng-modules-2.12.3/probes/../probes/lttng-tracepoint-event-impl.h:131:6: error: conflicting types for 'trace_block_rq_issue' 131 | void trace_##_name(_proto); | ^~~~~~ /tmp/B.tmfHCy/BUILD/lttng-modules-2.12.3/lttng-modules-2.12.3/probes/../probes/lttng-tracepoint-event-impl.h:96:2: note: in expansion of macro 'LTTNG_TRACEPOINT_EVENT_INSTANCE_MAP' 96 | LTTNG_TRACEPOINT_EVENT_INSTANCE_MAP(template, name, name, PARAMS(proto), PARAMS(args)) | ^~~~~~~~~~~~~~~~~~~~~~~~~~~~~~~~~~~ /tmp/B.tmfHCy/BUILD/lttng-modules-2.12.3/lttng-modules-2.12.3/probes/../instrumentation/events/lttng-module/block.h:578:1: note: in expansion of macro 'LTTNG_TRACEPOINT_EVENT_INSTANCE' 578 | LTTNG_TRACEPOINT_EVENT_INSTANCE(block_rq, block_rq_issue, | ^~~~~~~~~~~~~~~~~~~~~~~~~~~~~~~ In file included from ./include/trace/events/block.h:11, from /tmp/B.tmfHCy/BUILD/lttng-modules-2.12.3/lttng-modules-2.12.3/probes/lttng-probe-block.c:19: ./include/linux/tracepoint.h:238:21: note: previous definition of 'trace_block_rq_issue' was here 238 | static inline void trace_##name(proto) \ | ^~~~~~ ./include/linux/tracepoint.h:413:2: note: in expansion of macro '__DECLARE_TRACE' 413 | __DECLARE_TRACE(name, PARAMS(proto), PARAMS(args), \ | ^~~~~~~~~~~~~~~ ./include/linux/tracepoint.h:538:2: note: in expansion of macro 'DECLARE_TRACE' 538 | DECLARE_TRACE(name, PARAMS(proto), PARAMS(args)) | ^~~~~~~~~~~~~ ./include/trace/events/block.h:204:1: note: in expansion of macro 'DEFINE_EVENT' 204 | DEFINE_EVENT(block_rq, block_rq_issue, | ^~~~~~~~~~~~ In file included from /tmp/B.tmfHCy/BUILD/lttng-modules-2.12.3/lttng-modules-2.12.3/probes/../probes/define_trace.h:87, from /tmp/B.tmfHCy/BUILD/lttng-modules-2.12.3/lttng-modules-2.12.3/probes/../instrumentation/events/lttng-module/block.h:1122, from /tmp/B.tmfHCy/BUILD/lttng-modules-2.12.3/lttng-modules-2.12.3/probes/lttng-probe-block.c:30: /tmp/B.tmfHCy/BUILD/lttng-modules-2.12.3/lttng-modules-2.12.3/probes/../probes/lttng-tracepoint-event-impl.h:131:6: error: conflicting types for 'trace_block_bio_bounce' 131 | void trace_##_name(_proto); | ^~~~~~ /tmp/B.tmfHCy/BUILD/lttng-modules-2.12.3/lttng-modules-2.12.3/probes/../probes/lttng-tracepoint-event-impl.h:43:2: note: in expansion of macro 'LTTNG_TRACEPOINT_EVENT_INSTANCE_MAP' 43 | LTTNG_TRACEPOINT_EVENT_INSTANCE_MAP(map, name, map, PARAMS(proto), PARAMS(args)) | ^~~~~~~~~~~~~~~~~~~~~~~~~~~~~~~~~~~ /tmp/B.tmfHCy/BUILD/lttng-modules-2.12.3/lttng-modules-2.12.3/probes/../probes/lttng-tracepoint-event-impl.h:85:2: note: in expansion of macro 'LTTNG_TRACEPOINT_EVENT_MAP' 85 | LTTNG_TRACEPOINT_EVENT_MAP(name, name, \ | ^~~~~~~~~~~~~~~~~~~~~~~~~~ /tmp/B.tmfHCy/BUILD/lttng-modules-2.12.3/lttng-modules-2.12.3/probes/../instrumentation/events/lttng-module/block.h:596:1: note: in expansion of macro 'LTTNG_TRACEPOINT_EVENT' 596 | LTTNG_TRACEPOINT_EVENT(block_bio_bounce, | ^~~~~~~~~~~~~~~~~~~~~~ In file included from ./include/trace/events/block.h:11, from /tmp/B.tmfHCy/BUILD/lttng-modules-2.12.3/lttng-modules-2.12.3/probes/lttng-probe-block.c:19: ./include/linux/tracepoint.h:238:21: note: previous definition of 'trace_block_bio_bounce' was here 238 | static inline void trace_##name(proto) \ | ^~~~~~ ./include/linux/tracepoint.h:413:2: note: in expansion of macro '__DECLARE_TRACE' 413 | __DECLARE_TRACE(name, PARAMS(proto), PARAMS(args), \ | ^~~~~~~~~~~~~~~ ./include/linux/tracepoint.h:538:2: note: in expansion of macro 'DECLARE_TRACE' 538 | DECLARE_TRACE(name, PARAMS(proto), PARAMS(args)) | ^~~~~~~~~~~~~ ./include/trace/events/block.h:299:1: note: in expansion of macro 'DEFINE_EVENT' 299 | DEFINE_EVENT(block_bio, block_bio_bounce, | ^~~~~~~~~~~~ In file included from /tmp/B.tmfHCy/BUILD/lttng-modules-2.12.3/lttng-modules-2.12.3/probes/../probes/define_trace.h:87, from /tmp/B.tmfHCy/BUILD/lttng-modules-2.12.3/lttng-modules-2.12.3/probes/../instrumentation/events/lttng-module/block.h:1122, from /tmp/B.tmfHCy/BUILD/lttng-modules-2.12.3/lttng-modules-2.12.3/probes/lttng-probe-block.c:30: /tmp/B.tmfHCy/BUILD/lttng-modules-2.12.3/lttng-modules-2.12.3/probes/../probes/lttng-tracepoint-event-impl.h:131:6: error: conflicting types for 'trace_block_bio_backmerge' 131 | void trace_##_name(_proto); | ^~~~~~ /tmp/B.tmfHCy/BUILD/lttng-modules-2.12.3/lttng-modules-2.12.3/probes/../probes/lttng-tracepoint-event-impl.h:96:2: note: in expansion of macro 'LTTNG_TRACEPOINT_EVENT_INSTANCE_MAP' 96 | LTTNG_TRACEPOINT_EVENT_INSTANCE_MAP(template, name, name, PARAMS(proto), PARAMS(args)) | ^~~~~~~~~~~~~~~~~~~~~~~~~~~~~~~~~~~ /tmp/B.tmfHCy/BUILD/lttng-modules-2.12.3/lttng-modules-2.12.3/probes/../instrumentation/events/lttng-module/block.h:770:1: note: in expansion of macro 'LTTNG_TRACEPOINT_EVENT_INSTANCE' 770 | LTTNG_TRACEPOINT_EVENT_INSTANCE(block_bio_merge, block_bio_backmerge, | ^~~~~~~~~~~~~~~~~~~~~~~~~~~~~~~ In file included from ./include/trace/events/block.h:11, from /tmp/B.tmfHCy/BUILD/lttng-modules-2.12.3/lttng-modules-2.12.3/probes/lttng-probe-block.c:19: ./include/linux/tracepoint.h:238:21: note: previous definition of 'trace_block_bio_backmerge' was here 238 | static inline void trace_##name(proto) \ | ^~~~~~ ./include/linux/tracepoint.h:413:2: note: in expansion of macro '__DECLARE_TRACE' 413 | __DECLARE_TRACE(name, PARAMS(proto), PARAMS(args), \ | ^~~~~~~~~~~~~~~ ./include/linux/tracepoint.h:538:2: note: in expansion of macro 'DECLARE_TRACE' 538 | DECLARE_TRACE(name, PARAMS(proto), PARAMS(args)) | ^~~~~~~~~~~~~ ./include/trace/events/block.h:310:1: note: in expansion of macro 'DEFINE_EVENT' 310 | DEFINE_EVENT(block_bio, block_bio_backmerge, | ^~~~~~~~~~~~ In file included from /tmp/B.tmfHCy/BUILD/lttng-modules-2.12.3/lttng-modules-2.12.3/probes/../probes/define_trace.h:87, from /tmp/B.tmfHCy/BUILD/lttng-modules-2.12.3/lttng-modules-2.12.3/probes/../instrumentation/events/lttng-module/block.h:1122, from /tmp/B.tmfHCy/BUILD/lttng-modules-2.12.3/lttng-modules-2.12.3/probes/lttng-probe-block.c:30: /tmp/B.tmfHCy/BUILD/lttng-modules-2.12.3/lttng-modules-2.12.3/probes/../probes/lttng-tracepoint-event-impl.h:131:6: error: conflicting types for 'trace_block_bio_frontmerge' 131 | void trace_##_name(_proto); | ^~~~~~ /tmp/B.tmfHCy/BUILD/lttng-modules-2.12.3/lttng-modules-2.12.3/probes/../probes/lttng-tracepoint-event-impl.h:96:2: note: in expansion of macro 'LTTNG_TRACEPOINT_EVENT_INSTANCE_MAP' 96 | LTTNG_TRACEPOINT_EVENT_INSTANCE_MAP(template, name, name, PARAMS(proto), PARAMS(args)) | ^~~~~~~~~~~~~~~~~~~~~~~~~~~~~~~~~~~ /tmp/B.tmfHCy/BUILD/lttng-modules-2.12.3/lttng-modules-2.12.3/probes/../instrumentation/events/lttng-module/block.h:785:1: note: in expansion of macro 'LTTNG_TRACEPOINT_EVENT_INSTANCE' 785 | LTTNG_TRACEPOINT_EVENT_INSTANCE(block_bio_merge, block_bio_frontmerge, | ^~~~~~~~~~~~~~~~~~~~~~~~~~~~~~~ In file included from ./include/trace/events/block.h:11, from /tmp/B.tmfHCy/BUILD/lttng-modules-2.12.3/lttng-modules-2.12.3/probes/lttng-probe-block.c:19: ./include/linux/tracepoint.h:238:21: note: previous definition of 'trace_block_bio_frontmerge' was here 238 | static inline void trace_##name(proto) \ | ^~~~~~ ./include/linux/tracepoint.h:413:2: note: in expansion of macro '__DECLARE_TRACE' 413 | __DECLARE_TRACE(name, PARAMS(proto), PARAMS(args), \ | ^~~~~~~~~~~~~~~ ./include/linux/tracepoint.h:538:2: note: in expansion of macro 'DECLARE_TRACE' 538 | DECLARE_TRACE(name, PARAMS(proto), PARAMS(args)) | ^~~~~~~~~~~~~ ./include/trace/events/block.h:321:1: note: in expansion of macro 'DEFINE_EVENT' 321 | DEFINE_EVENT(block_bio, block_bio_frontmerge, | ^~~~~~~~~~~~ In file included from /tmp/B.tmfHCy/BUILD/lttng-modules-2.12.3/lttng-modules-2.12.3/probes/../probes/define_trace.h:87, from /tmp/B.tmfHCy/BUILD/lttng-modules-2.12.3/lttng-modules-2.12.3/probes/../instrumentation/events/lttng-module/block.h:1122, from /tmp/B.tmfHCy/BUILD/lttng-modules-2.12.3/lttng-modules-2.12.3/probes/lttng-probe-block.c:30: /tmp/B.tmfHCy/BUILD/lttng-modules-2.12.3/lttng-modules-2.12.3/probes/../probes/lttng-tracepoint-event-impl.h:131:6: error: conflicting types for 'trace_block_bio_queue' 131 | void trace_##_name(_proto); | ^~~~~~ /tmp/B.tmfHCy/BUILD/lttng-modules-2.12.3/lttng-modules-2.12.3/probes/../probes/lttng-tracepoint-event-impl.h:43:2: note: in expansion of macro 'LTTNG_TRACEPOINT_EVENT_INSTANCE_MAP' 43 | LTTNG_TRACEPOINT_EVENT_INSTANCE_MAP(map, name, map, PARAMS(proto), PARAMS(args)) | ^~~~~~~~~~~~~~~~~~~~~~~~~~~~~~~~~~~ /tmp/B.tmfHCy/BUILD/lttng-modules-2.12.3/lttng-modules-2.12.3/probes/../probes/lttng-tracepoint-event-impl.h:85:2: note: in expansion of macro 'LTTNG_TRACEPOINT_EVENT_MAP' 85 | LTTNG_TRACEPOINT_EVENT_MAP(name, name, \ | ^~~~~~~~~~~~~~~~~~~~~~~~~~ /tmp/B.tmfHCy/BUILD/lttng-modules-2.12.3/lttng-modules-2.12.3/probes/../instrumentation/events/lttng-module/block.h:799:1: note: in expansion of macro 'LTTNG_TRACEPOINT_EVENT' 799 | LTTNG_TRACEPOINT_EVENT(block_bio_queue, | ^~~~~~~~~~~~~~~~~~~~~~ In file included from ./include/trace/events/block.h:11, from /tmp/B.tmfHCy/BUILD/lttng-modules-2.12.3/lttng-modules-2.12.3/probes/lttng-probe-block.c:19: ./include/linux/tracepoint.h:238:21: note: previous definition of 'trace_block_bio_queue' was here 238 | static inline void trace_##name(proto) \ | ^~~~~~ ./include/linux/tracepoint.h:413:2: note: in expansion of macro '__DECLARE_TRACE' 413 | __DECLARE_TRACE(name, PARAMS(proto), PARAMS(args), \ | ^~~~~~~~~~~~~~~ ./include/linux/tracepoint.h:538:2: note: in expansion of macro 'DECLARE_TRACE' 538 | DECLARE_TRACE(name, PARAMS(proto), PARAMS(args)) | ^~~~~~~~~~~~~ ./include/trace/events/block.h:332:1: note: in expansion of macro 'DEFINE_EVENT' 332 | DEFINE_EVENT(block_bio, block_bio_queue, | ^~~~~~~~~~~~ In file included from /tmp/B.tmfHCy/BUILD/lttng-modules-2.12.3/lttng-modules-2.12.3/probes/../probes/define_trace.h:87, from /tmp/B.tmfHCy/BUILD/lttng-modules-2.12.3/lttng-modules-2.12.3/probes/../instrumentation/events/lttng-module/block.h:1122, from /tmp/B.tmfHCy/BUILD/lttng-modules-2.12.3/lttng-modules-2.12.3/probes/lttng-probe-block.c:30: /tmp/B.tmfHCy/BUILD/lttng-modules-2.12.3/lttng-modules-2.12.3/probes/../probes/lttng-tracepoint-event-impl.h:131:6: error: conflicting types for 'trace_block_getrq' 131 | void trace_##_name(_proto); | ^~~~~~ /tmp/B.tmfHCy/BUILD/lttng-modules-2.12.3/lttng-modules-2.12.3/probes/../probes/lttng-tracepoint-event-impl.h:96:2: note: in expansion of macro 'LTTNG_TRACEPOINT_EVENT_INSTANCE_MAP' 96 | LTTNG_TRACEPOINT_EVENT_INSTANCE_MAP(template, name, name, PARAMS(proto), PARAMS(args)) | ^~~~~~~~~~~~~~~~~~~~~~~~~~~~~~~~~~~ /tmp/B.tmfHCy/BUILD/lttng-modules-2.12.3/lttng-modules-2.12.3/probes/../instrumentation/events/lttng-module/block.h:933:1: note: in expansion of macro 'LTTNG_TRACEPOINT_EVENT_INSTANCE' 933 | LTTNG_TRACEPOINT_EVENT_INSTANCE(block_get_rq, block_getrq, | ^~~~~~~~~~~~~~~~~~~~~~~~~~~~~~~ In file included from ./include/trace/events/block.h:11, from /tmp/B.tmfHCy/BUILD/lttng-modules-2.12.3/lttng-modules-2.12.3/probes/lttng-probe-block.c:19: ./include/linux/tracepoint.h:238:21: note: previous definition of 'trace_block_getrq' was here 238 | static inline void trace_##name(proto) \ | ^~~~~~ ./include/linux/tracepoint.h:413:2: note: in expansion of macro '__DECLARE_TRACE' 413 | __DECLARE_TRACE(name, PARAMS(proto), PARAMS(args), \ | ^~~~~~~~~~~~~~~ ./include/linux/tracepoint.h:538:2: note: in expansion of macro 'DECLARE_TRACE' 538 | DECLARE_TRACE(name, PARAMS(proto), PARAMS(args)) | ^~~~~~~~~~~~~ ./include/trace/events/block.h:343:1: note: in expansion of macro 'DEFINE_EVENT' 343 | DEFINE_EVENT(block_bio, block_getrq, | ^~~~~~~~~~~~ In file included from /tmp/B.tmfHCy/BUILD/lttng-modules-2.12.3/lttng-modules-2.12.3/probes/../probes/define_trace.h:87, from /tmp/B.tmfHCy/BUILD/lttng-modules-2.12.3/lttng-modules-2.12.3/probes/../instrumentation/events/lttng-module/block.h:1122, from /tmp/B.tmfHCy/BUILD/lttng-modules-2.12.3/lttng-modules-2.12.3/probes/lttng-probe-block.c:30: /tmp/B.tmfHCy/BUILD/lttng-modules-2.12.3/lttng-modules-2.12.3/probes/../probes/lttng-tracepoint-event-impl.h:131:6: error: conflicting types for 'trace_block_split' 131 | void trace_##_name(_proto); | ^~~~~~ /tmp/B.tmfHCy/BUILD/lttng-modules-2.12.3/lttng-modules-2.12.3/probes/../probes/lttng-tracepoint-event-impl.h:43:2: note: in expansion of macro 'LTTNG_TRACEPOINT_EVENT_INSTANCE_MAP' 43 | LTTNG_TRACEPOINT_EVENT_INSTANCE_MAP(map, name, map, PARAMS(proto), PARAMS(args)) | ^~~~~~~~~~~~~~~~~~~~~~~~~~~~~~~~~~~ /tmp/B.tmfHCy/BUILD/lttng-modules-2.12.3/lttng-modules-2.12.3/probes/../probes/lttng-tracepoint-event-impl.h:85:2: note: in expansion of macro 'LTTNG_TRACEPOINT_EVENT_MAP' 85 | LTTNG_TRACEPOINT_EVENT_MAP(name, name, \ | ^~~~~~~~~~~~~~~~~~~~~~~~~~ /tmp/B.tmfHCy/BUILD/lttng-modules-2.12.3/lttng-modules-2.12.3/probes/../instrumentation/events/lttng-module/block.h:1018:1: note: in expansion of macro 'LTTNG_TRACEPOINT_EVENT' 1018 | LTTNG_TRACEPOINT_EVENT(block_split, | ^~~~~~~~~~~~~~~~~~~~~~ In file included from ./include/trace/events/block.h:11, from /tmp/B.tmfHCy/BUILD/lttng-modules-2.12.3/lttng-modules-2.12.3/probes/lttng-probe-block.c:19: ./include/linux/tracepoint.h:238:21: note: previous definition of 'trace_block_split' was here 238 | static inline void trace_##name(proto) \ | ^~~~~~ ./include/linux/tracepoint.h:413:2: note: in expansion of macro '__DECLARE_TRACE' 413 | __DECLARE_TRACE(name, PARAMS(proto), PARAMS(args), \ | ^~~~~~~~~~~~~~~ ./include/linux/tracepoint.h:549:2: note: in expansion of macro 'DECLARE_TRACE' 549 | DECLARE_TRACE(name, PARAMS(proto), PARAMS(args)) | ^~~~~~~~~~~~~ ./include/trace/events/block.h:418:1: note: in expansion of macro 'TRACE_EVENT' 418 | TRACE_EVENT(block_split, | ^~~~~~~~~~~ In file included from /tmp/B.tmfHCy/BUILD/lttng-modules-2.12.3/lttng-modules-2.12.3/probes/../probes/define_trace.h:87, from /tmp/B.tmfHCy/BUILD/lttng-modules-2.12.3/lttng-modules-2.12.3/probes/../instrumentation/events/lttng-module/block.h:1122, from /tmp/B.tmfHCy/BUILD/lttng-modules-2.12.3/lttng-modules-2.12.3/probes/lttng-probe-block.c:30: /tmp/B.tmfHCy/BUILD/lttng-modules-2.12.3/lttng-modules-2.12.3/probes/../probes/lttng-tracepoint-event-impl.h:131:6: error: conflicting types for 'trace_block_bio_remap' 131 | void trace_##_name(_proto); | ^~~~~~ /tmp/B.tmfHCy/BUILD/lttng-modules-2.12.3/lttng-modules-2.12.3/probes/../probes/lttng-tracepoint-event-impl.h:43:2: note: in expansion of macro 'LTTNG_TRACEPOINT_EVENT_INSTANCE_MAP' 43 | LTTNG_TRACEPOINT_EVENT_INSTANCE_MAP(map, name, map, PARAMS(proto), PARAMS(args)) | ^~~~~~~~~~~~~~~~~~~~~~~~~~~~~~~~~~~ /tmp/B.tmfHCy/BUILD/lttng-modules-2.12.3/lttng-modules-2.12.3/probes/../probes/lttng-tracepoint-event-impl.h:85:2: note: in expansion of macro 'LTTNG_TRACEPOINT_EVENT_MAP' 85 | LTTNG_TRACEPOINT_EVENT_MAP(name, name, \ | ^~~~~~~~~~~~~~~~~~~~~~~~~~ /tmp/B.tmfHCy/BUILD/lttng-modules-2.12.3/lttng-modules-2.12.3/probes/../instrumentation/events/lttng-module/block.h:1057:1: note: in expansion of macro 'LTTNG_TRACEPOINT_EVENT' 1057 | LTTNG_TRACEPOINT_EVENT(block_bio_remap, | ^~~~~~~~~~~~~~~~~~~~~~ In file included from ./include/trace/events/block.h:11, from /tmp/B.tmfHCy/BUILD/lttng-modules-2.12.3/lttng-modules-2.12.3/probes/lttng-probe-block.c:19: ./include/linux/tracepoint.h:238:21: note: previous definition of 'trace_block_bio_remap' was here 238 | static inline void trace_##name(proto) \ | ^~~~~~ ./include/linux/tracepoint.h:413:2: note: in expansion of macro '__DECLARE_TRACE' 413 | __DECLARE_TRACE(name, PARAMS(proto), PARAMS(args), \ | ^~~~~~~~~~~~~~~ ./include/linux/tracepoint.h:549:2: note: in expansion of macro 'DECLARE_TRACE' 549 | DECLARE_TRACE(name, PARAMS(proto), PARAMS(args)) | ^~~~~~~~~~~~~ ./include/trace/events/block.h:456:1: note: in expansion of macro 'TRACE_EVENT' 456 | TRACE_EVENT(block_bio_remap, | ^~~~~~~~~~~ In file included from /tmp/B.tmfHCy/BUILD/lttng-modules-2.12.3/lttng-modules-2.12.3/probes/../probes/define_trace.h:87, from /tmp/B.tmfHCy/BUILD/lttng-modules-2.12.3/lttng-modules-2.12.3/probes/../instrumentation/events/lttng-module/block.h:1122, from /tmp/B.tmfHCy/BUILD/lttng-modules-2.12.3/lttng-modules-2.12.3/probes/lttng-probe-block.c:30: /tmp/B.tmfHCy/BUILD/lttng-modules-2.12.3/lttng-modules-2.12.3/probes/../probes/lttng-tracepoint-event-impl.h:131:6: error: conflicting types for 'trace_block_rq_remap' 131 | void trace_##_name(_proto); | ^~~~~~ /tmp/B.tmfHCy/BUILD/lttng-modules-2.12.3/lttng-modules-2.12.3/probes/../probes/lttng-tracepoint-event-impl.h:43:2: note: in expansion of macro 'LTTNG_TRACEPOINT_EVENT_INSTANCE_MAP' 43 | LTTNG_TRACEPOINT_EVENT_INSTANCE_MAP(map, name, map, PARAMS(proto), PARAMS(args)) | ^~~~~~~~~~~~~~~~~~~~~~~~~~~~~~~~~~~ /tmp/B.tmfHCy/BUILD/lttng-modules-2.12.3/lttng-modules-2.12.3/probes/../probes/lttng-tracepoint-event-impl.h:85:2: note: in expansion of macro 'LTTNG_TRACEPOINT_EVENT_MAP' 85 | LTTNG_TRACEPOINT_EVENT_MAP(name, name, \ | ^~~~~~~~~~~~~~~~~~~~~~~~~~ /tmp/B.tmfHCy/BUILD/lttng-modules-2.12.3/lttng-modules-2.12.3/probes/../instrumentation/events/lttng-module/block.h:1098:1: note: in expansion of macro 'LTTNG_TRACEPOINT_EVENT' 1098 | LTTNG_TRACEPOINT_EVENT(block_rq_remap, | ^~~~~~~~~~~~~~~~~~~~~~ In file included from ./include/trace/events/block.h:11, from /tmp/B.tmfHCy/BUILD/lttng-modules-2.12.3/lttng-modules-2.12.3/probes/lttng-probe-block.c:19: ./include/linux/tracepoint.h:238:21: note: previous definition of 'trace_block_rq_remap' was here 238 | static inline void trace_##name(proto) \ | ^~~~~~ ./include/linux/tracepoint.h:413:2: note: in expansion of macro '__DECLARE_TRACE' 413 | __DECLARE_TRACE(name, PARAMS(proto), PARAMS(args), \ | ^~~~~~~~~~~~~~~ ./include/linux/tracepoint.h:549:2: note: in expansion of macro 'DECLARE_TRACE' 549 | DECLARE_TRACE(name, PARAMS(proto), PARAMS(args)) | ^~~~~~~~~~~~~ ./include/trace/events/block.h:498:1: note: in expansion of macro 'TRACE_EVENT' 498 | TRACE_EVENT(block_rq_remap, | ^~~~~~~~~~~ make[3]: *** [scripts/Makefile.build:279: /tmp/B.tmfHCy/BUILD/lttng-modules-2.12.3/lttng-modules-2.12.3/probes/lttng-probe-block.o] Error 1 make[3]: *** Waiting for unfinished jobs.... CC [M] /tmp/B.tmfHCy/BUILD/lttng-modules-2.12.3/lttng-modules-2.12.3/probes/lttng-probe-kvm-x86-mmu.o CC [M] /tmp/B.tmfHCy/BUILD/lttng-modules-2.12.3/lttng-modules-2.12.3/lttng-context-egid.o CC [M] /tmp/B.tmfHCy/BUILD/lttng-modules-2.12.3/lttng-modules-2.12.3/probes/lttng-probe-napi.o CC [M] /tmp/B.tmfHCy/BUILD/lttng-modules-2.12.3/lttng-modules-2.12.3/probes/lttng-probe-kvm-x86.o CC [M] /tmp/B.tmfHCy/BUILD/lttng-modules-2.12.3/lttng-modules-2.12.3/lttng-context-sgid.o CC [M] /tmp/B.tmfHCy/BUILD/lttng-modules-2.12.3/lttng-modules-2.12.3/lttng-context-vuid.o CC [M] /tmp/B.tmfHCy/BUILD/lttng-modules-2.12.3/lttng-modules-2.12.3/lttng-context-veuid.o CC [M] /tmp/B.tmfHCy/BUILD/lttng-modules-2.12.3/lttng-modules-2.12.3/probes/lttng-probe-skb.o make[2]: *** [scripts/Makefile.build:496: /tmp/B.tmfHCy/BUILD/lttng-modules-2.12.3/lttng-modules-2.12.3/probes] Error 2 make[2]: *** Waiting for unfinished jobs.... CC [M] /tmp/B.tmfHCy/BUILD/lttng-modules-2.12.3/lttng-modules-2.12.3/lttng-context-vgid.o CC [M] /tmp/B.tmfHCy/BUILD/lttng-modules-2.12.3/lttng-modules-2.12.3/lttng-context-vsuid.o CC [M] /tmp/B.tmfHCy/BUILD/lttng-modules-2.12.3/lttng-modules-2.12.3/lttng-context-vegid.o CC [M] /tmp/B.tmfHCy/BUILD/lttng-modules-2.12.3/lttng-modules-2.12.3/lttng-calibrate.o CC [M] /tmp/B.tmfHCy/BUILD/lttng-modules-2.12.3/lttng-modules-2.12.3/lttng-context-vsgid.o CC [M] /tmp/B.tmfHCy/BUILD/lttng-modules-2.12.3/lttng-modules-2.12.3/lttng-context-interruptible.o CC [M] /tmp/B.tmfHCy/BUILD/lttng-modules-2.12.3/lttng-modules-2.12.3/lttng-context-need-reschedule.o CC [M] /tmp/B.tmfHCy/BUILD/lttng-modules-2.12.3/lttng-modules-2.12.3/lttng-context-callstack.o make[1]: *** [Makefile:1800: /tmp/B.tmfHCy/BUILD/lttng-modules-2.12.3/lttng-modules-2.12.3] Error 2 make: *** [Makefile:153: modules] Error 2 error: Bad exit status from /tmp/B.tmfHCy/BUILD/tmp/rpm-tmp.rI3uXy (%build) RPM build errors: Could not canonicalize hostname: nereid Bad exit status from /tmp/B.tmfHCy/BUILD/tmp/rpm-tmp.rI3uXy (%build) ended at: Tue Feb 23 13:11:20 2021, done in 0:01:52.438962 error: No files produced. + chmod -R u+rwX /tmp/B.tmfHCy/BUILD + rm -rf /tmp/B.tmfHCy/tmp /tmp/B.tmfHCy/BUILD + rm -rf /tmp/B.tmfHCy Begin-PLD-Builder-Info Build-Time: user:389.18s sys:57.13s real:203.09s (faults io:170 non-io:10224589) End-PLD-Builder-Info
[Back to list of logs] [View rpm -qa of builder]