FailedOk

th/SRPMS[OK]
th/x32[OK]
th/i686[OK]
th/x86_64[OK]

ac/SRPMS[OK]
ac/i386[OK]
ac/i586[OK]
ac/i686[OK]
ac/alpha[OK]
ac/amd64[OK]
ac/athlon[OK]
ac/ppc[OK]
ac/sparc[OK]
ac/sparc64[OK]

Advanced Search
main()
Powered by PLD Linux
(c) 2002-2018 PLD Team
$Revision: 1.37 $
Powered by BOFH.
Your IP: 54.235.48.106

lttng-modules d615bd70-a332-4a73-b985-abce0d5c6a32

Status:Failed
Source URL:ftp://buildlogs.pld-linux.org/th/i686/FAIL/lttng-modules,d615bd70-a332-4a73-b985-abce0d5c6a32.bz2
text/plain URL:View!
rpm -qa of builder:View!
Date:2018/10/27 17:04:20
Runtime:0:00:34.027514

Toc:

  • prep
  • Executing(%prep): /bin/sh -e /tmp/B.sgz0Y2/BUILD/tmp/rpm-tmp.49796
  • build
  • Executing(%build): /bin/sh -e /tmp/B.sgz0Y2/BUILD/tmp/rpm-tmp.49796
  • error 1
  • /tmp/B.sgz0Y2/BUILD/lttng-modules-2.10.7/probes/../probes/lttng-tracepoint-event-impl.h:143:6: error: conflicting types for 'trace_sock_exceed_buf_limit'
  • error 2
  • make[3]: *** [scripts/Makefile.build:311: /tmp/B.sgz0Y2/BUILD/lttng-modules-2.10.7/probes/lttng-probe-sock.o] Error 1
  • error 3
  • make[2]: *** [scripts/Makefile.build:546: /tmp/B.sgz0Y2/BUILD/lttng-modules-2.10.7/probes] Error 2
  • error 4
  • make[1]: *** [Makefile:1517: _module_/tmp/B.sgz0Y2/BUILD/lttng-modules-2.10.7] Error 2
  • error 5
  • error: Bad exit status from /tmp/B.sgz0Y2/BUILD/tmp/rpm-tmp.49796 (%build)
  • error 6
  • RPM build errors:
  • error 7
  • error: No files produced.

Content:

request from: baggins
checking if we should skip the build
started at: Sat Oct 27 17:03:36 2018
killing old processes on a builder
sending signal 9 to pid -1
Killed
cleaning up /tmp
fetching https://srcbuilder.pld-linux.org/th//srpms/d615bd70-a332-4a73-b985-abce0d5c6a32/lttng-modules-2.10.7-1%404.19.0_1.src.rpm
fetched 317632 bytes, 452.0 K/s
installing srpm: lttng-modules-2.10.7-1@4.19.0_1.src.rpm
+ install -d /tmp/B.sgz0Y2/BUILD /tmp/B.sgz0Y2/RPMS
+ LC_ALL=en_US.UTF-8
+ rpm -qp --changelog lttng-modules-2.10.7-1@4.19.0_1.src.rpm
* Sat Oct 27 2018 PLD Linux Team <feedback@pld-linux.org>
- For complete changelog see: http://git.pld-linux.org/?p=packages/lttng-modules.git;a=log;h=auto/th/lttng-modules-2.10.7-1
* Mon Aug 13 2018 Jan Rękorajski <baggins@pld-linux.org> 616ac20
- up to 2.10.7 * Mon Jun 18 2018 Jan Rękorajski <baggins@pld-linux.org> 7681880
- up to 2.10.6 * Sat Apr 07 2018 Jan Rękorajski <baggins@pld-linux.org> ce7edfe
- upstream fixes for kernel 4.16 * Fri Apr 06 2018 Jan Rękorajski <baggins@pld-linux.org> bb69d75
- up to 2.10.5 * Mon Jan 29 2018 Jan Rękorajski <baggins@pld-linux.org> 9fd8375
- upstream fixes for kernel 4.15 - rel 3 * Fri Jan 19 2018 Jan Rękorajski <baggins@pld-linux.org> b1989bf
- upstream updates for kvm instrumentation - rel 2 * Thu Nov 16 2017 Jan Rękorajski <baggins@pld-linux.org> 3bb63f3
- up to 2.10.4 + rpm -Uhv --nodeps --define '_topdir /tmp/B.sgz0Y2' --define '_specdir %{_topdir}' --define '_sourcedir %{_specdir}' --define '_rpmdir %{_topdir}/RPMS' --define '_builddir %{_topdir}/BUILD' --without userspace --define 'build_kernels head,4.14,4.9,4.4' lttng-modules-2.10.7-1@4.19.0_1.src.rpm Preparing... ################################################## lttng-modules ################################################## + rm -f lttng-modules-2.10.7-1@4.19.0_1.src.rpm + install -m 700 -d /tmp/B.sgz0Y2/BUILD/tmp + TMPDIR=/tmp/B.sgz0Y2/BUILD/tmp + exec nice -n 0 rpmbuild -bp --short-circuit --nodeps --define '_topdir /tmp/B.sgz0Y2' --define '_specdir %{_topdir}' --define '_sourcedir %{_specdir}' --define '_rpmdir %{_topdir}/RPMS' --define '_builddir %{_topdir}/BUILD' --without userspace --target i686-pld-linux --define 'build_kernels head,4.14,4.9,4.4' --define 'prep exit 0' /tmp/B.sgz0Y2/lttng-modules.spec Building target platforms: i686-pld-linux checking BuildConflict-ing packages no BuildConflicts found checking BR rpm: Building target platforms: i686-pld-linux no BR needed building RPM using: set -ex; : build-id: d615bd70-a332-4a73-b985-abce0d5c6a32; TMPDIR=/tmp/B.sgz0Y2/BUILD/tmp exec nice -n 0 rpmbuild -bb --define '_smp_mflags -j9' --define '_make_opts -Otarget' --define '_pld_builder 1' --define '_topdir /tmp/B.sgz0Y2' --define '_specdir %{_topdir}' --define '_sourcedir %{_specdir}' --define '_rpmdir %{_topdir}/RPMS' --define '_builddir %{_topdir}/BUILD' --without userspace --target i686-pld-linux --define 'build_kernels head,4.14,4.9,4.4' /tmp/B.sgz0Y2/lttng-modules.spec + : build-id: d615bd70-a332-4a73-b985-abce0d5c6a32 + TMPDIR=/tmp/B.sgz0Y2/BUILD/tmp + exec nice -n 0 rpmbuild -bb --define '_smp_mflags -j9' --define '_make_opts -Otarget' --define '_pld_builder 1' --define '_topdir /tmp/B.sgz0Y2' --define '_specdir %{_topdir}' --define '_sourcedir %{_specdir}' --define '_rpmdir %{_topdir}/RPMS' --define '_builddir %{_topdir}/BUILD' --without userspace --target i686-pld-linux --define 'build_kernels head,4.14,4.9,4.4' /tmp/B.sgz0Y2/lttng-modules.spec Building target platforms: i686-pld-linux Executing(%prep): /bin/sh -e /tmp/B.sgz0Y2/BUILD/tmp/rpm-tmp.49796 + umask 022 + cd /tmp/B.sgz0Y2/BUILD + cd /tmp/B.sgz0Y2/BUILD + rm -rf lttng-modules-2.10.7 + /usr/bin/bzip2 -dc /tmp/B.sgz0Y2/lttng-modules-2.10.7.tar.bz2 + /bin/tar -xf - + STATUS=0 + '[' 0 -ne 0 ']' + cd lttng-modules-2.10.7 + /bin/id -u + '[' 1001 '=' 0 ']' + /bin/id -u + '[' 1001 '=' 0 ']' + /bin/chmod -Rf a+rX,u+w,g-w,o-w . + echo 'Patch #0 (build.patch):' Patch #0 (build.patch): + '[' -f /tmp/B.sgz0Y2/build.patch ']' + /bin/cat /tmp/B.sgz0Y2/build.patch + /usr/bin/patch -s -p1 + exit 0 Executing(%build): /bin/sh -e /tmp/B.sgz0Y2/BUILD/tmp/rpm-tmp.49796 TMP=/home/users/builder/tmp HOME=/home/users/builder PATH=/usr/local/bin:/usr/bin:/bin:/home/users/builder/bin TMPDIR=/tmp/B.sgz0Y2/BUILD/tmp + umask 022 + cd /tmp/B.sgz0Y2/BUILD + cd lttng-modules-2.10.7 + /usr/bin/make -Otarget -j9 'KERNELDIR=/usr/src/linux' /usr/bin/make -C /usr/src/linux M=/tmp/B.sgz0Y2/BUILD/lttng-modules-2.10.7 CONFIG_LTTNG=m CONFIG_LTTNG_CLOCK_PLUGIN_TEST=m modules find: '/tmp/B.sgz0Y2/BUILD/lttng-modules-2.10.7/extra_version/patches/': No such file or directory find: '/tmp/B.sgz0Y2/BUILD/lttng-modules-2.10.7/lib/../extra_version/patches/': No such file or directory find: '/tmp/B.sgz0Y2/BUILD/lttng-modules-2.10.7/probes/../extra_version/patches/': No such file or directory find: '/tmp/B.sgz0Y2/BUILD/lttng-modules-2.10.7/tests/../extra_version/patches/': No such file or directory CC [M] /tmp/B.sgz0Y2/BUILD/lttng-modules-2.10.7/tests/probes/lttng-test.o CC [M] /tmp/B.sgz0Y2/BUILD/lttng-modules-2.10.7/lttng-ring-buffer-metadata-client.o CC [M] /tmp/B.sgz0Y2/BUILD/lttng-modules-2.10.7/lttng-ring-buffer-metadata-mmap-client.o CC [M] /tmp/B.sgz0Y2/BUILD/lttng-modules-2.10.7/lttng-ring-buffer-client-discard.o CC [M] /tmp/B.sgz0Y2/BUILD/lttng-modules-2.10.7/lttng-ring-buffer-client-mmap-discard.o CC [M] /tmp/B.sgz0Y2/BUILD/lttng-modules-2.10.7/lttng-ring-buffer-client-overwrite.o CC [M] /tmp/B.sgz0Y2/BUILD/lttng-modules-2.10.7/lttng-string-utils.o CC [M] /tmp/B.sgz0Y2/BUILD/lttng-modules-2.10.7/tests/clock-plugin/lttng-clock-plugin-test.o LD [M] /tmp/B.sgz0Y2/BUILD/lttng-modules-2.10.7/tests/lttng-test.o LD [M] /tmp/B.sgz0Y2/BUILD/lttng-modules-2.10.7/tests/lttng-clock-plugin-test.o CC [M] /tmp/B.sgz0Y2/BUILD/lttng-modules-2.10.7/lttng-ring-buffer-client-mmap-overwrite.o CC [M] /tmp/B.sgz0Y2/BUILD/lttng-modules-2.10.7/lib/ringbuffer/ring_buffer_backend.o CC [M] /tmp/B.sgz0Y2/BUILD/lttng-modules-2.10.7/lib/ringbuffer/ring_buffer_iterator.o CC [M] /tmp/B.sgz0Y2/BUILD/lttng-modules-2.10.7/lib/ringbuffer/ring_buffer_vfs.o CC [M] /tmp/B.sgz0Y2/BUILD/lttng-modules-2.10.7/lttng-abi.o CC [M] /tmp/B.sgz0Y2/BUILD/lttng-modules-2.10.7/lttng-probes.o CC [M] /tmp/B.sgz0Y2/BUILD/lttng-modules-2.10.7/lttng-context.o CC [M] /tmp/B.sgz0Y2/BUILD/lttng-modules-2.10.7/lttng-clock.o CC [M] /tmp/B.sgz0Y2/BUILD/lttng-modules-2.10.7/probes/lttng-probe-sched.o CC [M] /tmp/B.sgz0Y2/BUILD/lttng-modules-2.10.7/lib/ringbuffer/ring_buffer_frontend.o CC [M] /tmp/B.sgz0Y2/BUILD/lttng-modules-2.10.7/lttng-events.o CC [M] /tmp/B.sgz0Y2/BUILD/lttng-modules-2.10.7/lib/ringbuffer/ring_buffer_splice.o CC [M] /tmp/B.sgz0Y2/BUILD/lttng-modules-2.10.7/lib/prio_heap/lttng_prio_heap.o CC [M] /tmp/B.sgz0Y2/BUILD/lttng-modules-2.10.7/probes/lttng-probe-irq.o CC [M] /tmp/B.sgz0Y2/BUILD/lttng-modules-2.10.7/lttng-context-procname.o CC [M] /tmp/B.sgz0Y2/BUILD/lttng-modules-2.10.7/lib/ringbuffer/ring_buffer_mmap.o CC [M] /tmp/B.sgz0Y2/BUILD/lttng-modules-2.10.7/lttng-context-pid.o CC [M] /tmp/B.sgz0Y2/BUILD/lttng-modules-2.10.7/lttng-context-nice.o CC [M] /tmp/B.sgz0Y2/BUILD/lttng-modules-2.10.7/lttng-context-prio.o CC [M] /tmp/B.sgz0Y2/BUILD/lttng-modules-2.10.7/lttng-context-vpid.o CC [M] /tmp/B.sgz0Y2/BUILD/lttng-modules-2.10.7/lib/../wrapper/splice.o LD [M] /tmp/B.sgz0Y2/BUILD/lttng-modules-2.10.7/lib/lttng-lib-ring-buffer.o CC [M] /tmp/B.sgz0Y2/BUILD/lttng-modules-2.10.7/lttng-context-vtid.o CC [M] /tmp/B.sgz0Y2/BUILD/lttng-modules-2.10.7/probes/lttng-probe-module.o CC [M] /tmp/B.sgz0Y2/BUILD/lttng-modules-2.10.7/probes/lttng-probe-timer.o CC [M] /tmp/B.sgz0Y2/BUILD/lttng-modules-2.10.7/lttng-context-tid.o CC [M] /tmp/B.sgz0Y2/BUILD/lttng-modules-2.10.7/probes/lttng-probe-kmem.o CC [M] /tmp/B.sgz0Y2/BUILD/lttng-modules-2.10.7/lttng-context-ppid.o CC [M] /tmp/B.sgz0Y2/BUILD/lttng-modules-2.10.7/probes/lttng-probe-power.o CC [M] /tmp/B.sgz0Y2/BUILD/lttng-modules-2.10.7/lttng-context-cpu-id.o CC [M] /tmp/B.sgz0Y2/BUILD/lttng-modules-2.10.7/probes/lttng-probe-i2c.o CC [M] /tmp/B.sgz0Y2/BUILD/lttng-modules-2.10.7/lttng-context-vppid.o CC [M] /tmp/B.sgz0Y2/BUILD/lttng-modules-2.10.7/lttng-context-interruptible.o CC [M] /tmp/B.sgz0Y2/BUILD/lttng-modules-2.10.7/lttng-calibrate.o CC [M] /tmp/B.sgz0Y2/BUILD/lttng-modules-2.10.7/probes/lttng-probe-statedump.o CC [M] /tmp/B.sgz0Y2/BUILD/lttng-modules-2.10.7/probes/lttng-probe-x86-irq-vectors.o CC [M] /tmp/B.sgz0Y2/BUILD/lttng-modules-2.10.7/probes/lttng-probe-x86-exceptions.o CC [M] /tmp/B.sgz0Y2/BUILD/lttng-modules-2.10.7/probes/lttng-probe-kvm.o CC [M] /tmp/B.sgz0Y2/BUILD/lttng-modules-2.10.7/probes/lttng-probe-kvm-x86-mmu.o CC [M] /tmp/B.sgz0Y2/BUILD/lttng-modules-2.10.7/probes/lttng-probe-signal.o CC [M] /tmp/B.sgz0Y2/BUILD/lttng-modules-2.10.7/probes/lttng-probe-napi.o CC [M] /tmp/B.sgz0Y2/BUILD/lttng-modules-2.10.7/probes/lttng-probe-skb.o CC [M] /tmp/B.sgz0Y2/BUILD/lttng-modules-2.10.7/probes/lttng-probe-kvm-x86.o CC [M] /tmp/B.sgz0Y2/BUILD/lttng-modules-2.10.7/probes/lttng-probe-net.o CC [M] /tmp/B.sgz0Y2/BUILD/lttng-modules-2.10.7/probes/lttng-probe-sock.o In file included from /tmp/B.sgz0Y2/BUILD/lttng-modules-2.10.7/probes/../probes/define_trace.h:100, from /tmp/B.sgz0Y2/BUILD/lttng-modules-2.10.7/probes/../instrumentation/events/lttng-module/sock.h:63, from /tmp/B.sgz0Y2/BUILD/lttng-modules-2.10.7/probes/lttng-probe-sock.c:40: /tmp/B.sgz0Y2/BUILD/lttng-modules-2.10.7/probes/../probes/lttng-tracepoint-event-impl.h:143:6: error: conflicting types for 'trace_sock_exceed_buf_limit' void trace_##_name(_proto); ^~~~~~ /tmp/B.sgz0Y2/BUILD/lttng-modules-2.10.7/probes/../probes/lttng-tracepoint-event-impl.h:55:2: note: in expansion of macro 'LTTNG_TRACEPOINT_EVENT_INSTANCE_MAP' LTTNG_TRACEPOINT_EVENT_INSTANCE_MAP(map, name, map, PARAMS(proto), PARAMS(args)) ^~~~~~~~~~~~~~~~~~~~~~~~~~~~~~~~~~~ /tmp/B.sgz0Y2/BUILD/lttng-modules-2.10.7/probes/../probes/lttng-tracepoint-event-impl.h:97:2: note: in expansion of macro 'LTTNG_TRACEPOINT_EVENT_MAP' LTTNG_TRACEPOINT_EVENT_MAP(name, name, \ ^~~~~~~~~~~~~~~~~~~~~~~~~~ /tmp/B.sgz0Y2/BUILD/lttng-modules-2.10.7/probes/../instrumentation/events/lttng-module/sock.h:26:1: note: in expansion of macro 'LTTNG_TRACEPOINT_EVENT' LTTNG_TRACEPOINT_EVENT(sock_exceed_buf_limit, ^~~~~~~~~~~~~~~~~~~~~~ In file included from ./include/trace/events/sock.h:10, from /tmp/B.sgz0Y2/BUILD/lttng-modules-2.10.7/probes/lttng-probe-sock.c:31: ./include/linux/tracepoint.h:235:21: note: previous definition of 'trace_sock_exceed_buf_limit' was here static inline void trace_##name(proto) \ ^~~~~~ ./include/linux/tracepoint.h:398:2: note: in expansion of macro '__DECLARE_TRACE' __DECLARE_TRACE(name, PARAMS(proto), PARAMS(args), \ ^~~~~~~~~~~~~~~ ./include/linux/tracepoint.h:534:2: note: in expansion of macro 'DECLARE_TRACE' DECLARE_TRACE(name, PARAMS(proto), PARAMS(args)) ^~~~~~~~~~~~~ ./include/trace/events/sock.h:92:1: note: in expansion of macro 'TRACE_EVENT' TRACE_EVENT(sock_exceed_buf_limit, ^~~~~~~~~~~ make[3]: *** [scripts/Makefile.build:311: /tmp/B.sgz0Y2/BUILD/lttng-modules-2.10.7/probes/lttng-probe-sock.o] Error 1 make[3]: *** Waiting for unfinished jobs.... CC [M] /tmp/B.sgz0Y2/BUILD/lttng-modules-2.10.7/lttng-context-need-reschedule.o CC [M] /tmp/B.sgz0Y2/BUILD/lttng-modules-2.10.7/lttng-context-hostname.o CC [M] /tmp/B.sgz0Y2/BUILD/lttng-modules-2.10.7/wrapper/random.o CC [M] /tmp/B.sgz0Y2/BUILD/lttng-modules-2.10.7/probes/lttng-probe-gpio.o CC [M] /tmp/B.sgz0Y2/BUILD/lttng-modules-2.10.7/wrapper/trace-clock.o CC [M] /tmp/B.sgz0Y2/BUILD/lttng-modules-2.10.7/probes/lttng-probe-udp.o CC [M] /tmp/B.sgz0Y2/BUILD/lttng-modules-2.10.7/probes/lttng-probe-block.o CC [M] /tmp/B.sgz0Y2/BUILD/lttng-modules-2.10.7/probes/lttng-probe-asoc.o CC [M] /tmp/B.sgz0Y2/BUILD/lttng-modules-2.10.7/probes/lttng.o CC [M] /tmp/B.sgz0Y2/BUILD/lttng-modules-2.10.7/wrapper/page_alloc.o CC [M] /tmp/B.sgz0Y2/BUILD/lttng-modules-2.10.7/lttng-tracker-pid.o CC [M] /tmp/B.sgz0Y2/BUILD/lttng-modules-2.10.7/probes/lttng-probe-jbd2.o make[2]: *** [scripts/Makefile.build:546: /tmp/B.sgz0Y2/BUILD/lttng-modules-2.10.7/probes] Error 2 make[2]: *** Waiting for unfinished jobs.... CC [M] /tmp/B.sgz0Y2/BUILD/lttng-modules-2.10.7/lttng-filter-specialize.o CC [M] /tmp/B.sgz0Y2/BUILD/lttng-modules-2.10.7/lttng-filter.o CC [M] /tmp/B.sgz0Y2/BUILD/lttng-modules-2.10.7/lttng-filter-interpreter.o CC [M] /tmp/B.sgz0Y2/BUILD/lttng-modules-2.10.7/probes/lttng-probe-user.o CC [M] /tmp/B.sgz0Y2/BUILD/lttng-modules-2.10.7/lttng-filter-validator.o CC [M] /tmp/B.sgz0Y2/BUILD/lttng-modules-2.10.7/lttng-tp-mempool.o CC [M] /tmp/B.sgz0Y2/BUILD/lttng-modules-2.10.7/lttng-context-perf-counters.o CC [M] /tmp/B.sgz0Y2/BUILD/lttng-modules-2.10.7/lttng-syscalls.o make[1]: *** [Makefile:1517: _module_/tmp/B.sgz0Y2/BUILD/lttng-modules-2.10.7] Error 2 make: *** [Makefile:111: modules] Error 2 error: Bad exit status from /tmp/B.sgz0Y2/BUILD/tmp/rpm-tmp.49796 (%build) RPM build errors: Bad exit status from /tmp/B.sgz0Y2/BUILD/tmp/rpm-tmp.49796 (%build) ended at: Sat Oct 27 17:04:20 2018, done in 0:00:34.027514 error: No files produced. + chmod -R u+rwX /tmp/B.sgz0Y2/BUILD + rm -rf /tmp/B.sgz0Y2/tmp /tmp/B.sgz0Y2/BUILD + rm -rf /tmp/B.sgz0Y2 Begin-PLD-Builder-Info Build-Time: user:77.86s sys:6.24s real:43.58s (faults io:0 non-io:1665093) End-PLD-Builder-Info
[Back to list of logs] [View rpm -qa of builder]