FailedOk

th/SRPMS[OK]
th/x32[OK]
th/i686[OK]
th/x86_64[OK]

ac/SRPMS[OK]
ac/i386[OK]
ac/i586[OK]
ac/i686[OK]
ac/alpha[OK]
ac/amd64[OK]
ac/athlon[OK]
ac/ppc[OK]
ac/sparc[OK]
ac/sparc64[OK]

Advanced Search
main()
Powered by PLD Linux
(c) 2002-2018 PLD Team
$Revision: 1.37 $
Powered by Leppe'.
Your IP: 54.166.228.35

lttng-modules d7bc72fe-414e-4557-a707-b4605af9ab57

Status:Failed
Source URL:ftp://buildlogs.pld-linux.org/th/i686/FAIL/lttng-modules,d7bc72fe-414e-4557-a707-b4605af9ab57.bz2
text/plain URL:View!
full text:View!
rpm -qa of builder:View!
Date:2018/04/07 12:45:00
Runtime:0:00:24.750286

Toc:

  • error 1
  • /tmp/B.SrjwdE/BUILD/lttng-modules-2.10.4/probes/../probes/lttng-tracepoint-event-impl.h:142:6: error: conflicting types for 'trace_hrtimer_start'
  • error 2
  • make[3]: *** [scripts/Makefile.build:330: /tmp/B.SrjwdE/BUILD/lttng-modules-2.10.4/probes/lttng-probe-timer.o] Error 1
  • error 3
  • make[2]: *** [scripts/Makefile.build:583: /tmp/B.SrjwdE/BUILD/lttng-modules-2.10.4/probes] Error 2
  • error 4
  • make[1]: *** [Makefile:1561: _module_/tmp/B.SrjwdE/BUILD/lttng-modules-2.10.4] Error 2
  • error 5
  • error: Bad exit status from /tmp/B.SrjwdE/BUILD/tmp/rpm-tmp.21887 (%build)
  • error 6
  • RPM build errors:
  • error 7
  • error: No files produced.

Content:

+ umask 022
+ cd /tmp/B.SrjwdE/BUILD
+ cd /tmp/B.SrjwdE/BUILD
+ rm -rf lttng-modules-2.10.4
+ /usr/bin/bzip2 -dc /tmp/B.SrjwdE/lttng-modules-2.10.4.tar.bz2
+ /bin/tar -xf -
+ STATUS=0 
+ '[' 0 -ne 0 ']'
+ cd lttng-modules-2.10.4
+ /bin/id -u
+ '[' 1001 '=' 0 ']'
+ /bin/id -u
+ '[' 1001 '=' 0 ']'
+ /bin/chmod -Rf a+rX,u+w,g-w,o-w .
+ echo 'Patch #0 (build.patch):'
Patch #0 (build.patch):
+ '[' -f /tmp/B.SrjwdE/build.patch ']'
+ /bin/cat /tmp/B.SrjwdE/build.patch
+ /usr/bin/patch -s -p1
+ echo 'Patch #1 (kvm-update.patch):'
Patch #1 (kvm-update.patch):
+ '[' -f /tmp/B.SrjwdE/kvm-update.patch ']'
+ /bin/cat /tmp/B.SrjwdE/kvm-update.patch
+ /usr/bin/patch -s -p1
+ echo 'Patch #2 (kmem-update.patch):'
Patch #2 (kmem-update.patch):
+ '[' -f /tmp/B.SrjwdE/kmem-update.patch ']'
+ /bin/cat /tmp/B.SrjwdE/kmem-update.patch
+ /usr/bin/patch -s -p1
+ echo 'Patch #3 (kernel-4.15-timers.patch):'
Patch #3 (kernel-4.15-timers.patch):
+ '[' -f /tmp/B.SrjwdE/kernel-4.15-timers.patch ']'
+ /bin/cat /tmp/B.SrjwdE/kernel-4.15-timers.patch
+ /usr/bin/patch -s -p1
+ echo 'Patch #4 (kernel-4.15-atomics.patch):'
Patch #4 (kernel-4.15-atomics.patch):
+ '[' -f /tmp/B.SrjwdE/kernel-4.15-atomics.patch ']'
+ /bin/cat /tmp/B.SrjwdE/kernel-4.15-atomics.patch
+ /usr/bin/patch -s -p1
+ echo 'Patch #5 (sock-update.patch):'
Patch #5 (sock-update.patch):
+ '[' -f /tmp/B.SrjwdE/sock-update.patch ']'
+ /bin/cat /tmp/B.SrjwdE/sock-update.patch
+ /usr/bin/patch -s -p1
+ exit 0
Executing(%build): /bin/sh -e /tmp/B.SrjwdE/BUILD/tmp/rpm-tmp.21887
TMP=/home/users/builder/tmp
HOME=/home/users/builder
PATH=/home/users/builder/GNUstep/Tools:/usr/local/bin:/usr/bin:/bin:/home/users/builder/bin
TMPDIR=/tmp/B.SrjwdE/BUILD/tmp
+ umask 022
+ cd /tmp/B.SrjwdE/BUILD
+ cd lttng-modules-2.10.4
+ /usr/bin/make -Otarget -j9 'KERNELDIR=/usr/src/linux'
/usr/bin/make -C /usr/src/linux M=/tmp/B.SrjwdE/BUILD/lttng-modules-2.10.4 CONFIG_LTTNG=m CONFIG_LTTNG_CLOCK_PLUGIN_TEST=m modules
  CC [M]  /tmp/B.SrjwdE/BUILD/lttng-modules-2.10.4/lttng-ring-buffer-metadata-mmap-client.o
  CC [M]  /tmp/B.SrjwdE/BUILD/lttng-modules-2.10.4/lttng-clock.o
  CC [M]  /tmp/B.SrjwdE/BUILD/lttng-modules-2.10.4/lttng-string-utils.o
  CC [M]  /tmp/B.SrjwdE/BUILD/lttng-modules-2.10.4/lttng-abi.o
  CC [M]  /tmp/B.SrjwdE/BUILD/lttng-modules-2.10.4/lttng-ring-buffer-metadata-client.o
  CC [M]  /tmp/B.SrjwdE/BUILD/lttng-modules-2.10.4/lttng-ring-buffer-client-mmap-discard.o
  CC [M]  /tmp/B.SrjwdE/BUILD/lttng-modules-2.10.4/lttng-ring-buffer-client-overwrite.o
  CC [M]  /tmp/B.SrjwdE/BUILD/lttng-modules-2.10.4/lttng-ring-buffer-client-discard.o
  CC [M]  /tmp/B.SrjwdE/BUILD/lttng-modules-2.10.4/lttng-ring-buffer-client-mmap-overwrite.o
  CC [M]  /tmp/B.SrjwdE/BUILD/lttng-modules-2.10.4/lttng-context-procname.o
  CC [M]  /tmp/B.SrjwdE/BUILD/lttng-modules-2.10.4/lttng-context.o
  CC [M]  /tmp/B.SrjwdE/BUILD/lttng-modules-2.10.4/lttng-context-pid.o
  CC [M]  /tmp/B.SrjwdE/BUILD/lttng-modules-2.10.4/lttng-context-prio.o
  CC [M]  /tmp/B.SrjwdE/BUILD/lttng-modules-2.10.4/lttng-probes.o
  CC [M]  /tmp/B.SrjwdE/BUILD/lttng-modules-2.10.4/lttng-context-nice.o
  CC [M]  /tmp/B.SrjwdE/BUILD/lttng-modules-2.10.4/lttng-events.o
  CC [M]  /tmp/B.SrjwdE/BUILD/lttng-modules-2.10.4/lttng-context-vpid.o
  CC [M]  /tmp/B.SrjwdE/BUILD/lttng-modules-2.10.4/lttng-context-tid.o
  CC [M]  /tmp/B.SrjwdE/BUILD/lttng-modules-2.10.4/wrapper/random.o
  CC [M]  /tmp/B.SrjwdE/BUILD/lttng-modules-2.10.4/lttng-calibrate.o
  CC [M]  /tmp/B.SrjwdE/BUILD/lttng-modules-2.10.4/lttng-context-cpu-id.o
  CC [M]  /tmp/B.SrjwdE/BUILD/lttng-modules-2.10.4/lttng-context-vtid.o
  CC [M]  /tmp/B.SrjwdE/BUILD/lttng-modules-2.10.4/lttng-context-ppid.o
  CC [M]  /tmp/B.SrjwdE/BUILD/lttng-modules-2.10.4/lttng-context-need-reschedule.o
  CC [M]  /tmp/B.SrjwdE/BUILD/lttng-modules-2.10.4/lttng-context-interruptible.o
  CC [M]  /tmp/B.SrjwdE/BUILD/lttng-modules-2.10.4/lttng-context-vppid.o
  CC [M]  /tmp/B.SrjwdE/BUILD/lttng-modules-2.10.4/wrapper/trace-clock.o
  CC [M]  /tmp/B.SrjwdE/BUILD/lttng-modules-2.10.4/probes/lttng.o
  CC [M]  /tmp/B.SrjwdE/BUILD/lttng-modules-2.10.4/lttng-context-hostname.o
  CC [M]  /tmp/B.SrjwdE/BUILD/lttng-modules-2.10.4/lttng-filter.o
  CC [M]  /tmp/B.SrjwdE/BUILD/lttng-modules-2.10.4/wrapper/page_alloc.o
  CC [M]  /tmp/B.SrjwdE/BUILD/lttng-modules-2.10.4/lttng-filter-interpreter.o
  CC [M]  /tmp/B.SrjwdE/BUILD/lttng-modules-2.10.4/lttng-filter-specialize.o
  CC [M]  /tmp/B.SrjwdE/BUILD/lttng-modules-2.10.4/lttng-filter-validator.o
  CC [M]  /tmp/B.SrjwdE/BUILD/lttng-modules-2.10.4/probes/lttng-probe-user.o
  CC [M]  /tmp/B.SrjwdE/BUILD/lttng-modules-2.10.4/lttng-tracker-pid.o
  CC [M]  /tmp/B.SrjwdE/BUILD/lttng-modules-2.10.4/lttng-context-perf-counters.o
  CC [M]  /tmp/B.SrjwdE/BUILD/lttng-modules-2.10.4/wrapper/fdtable.o
  CC [M]  /tmp/B.SrjwdE/BUILD/lttng-modules-2.10.4/lttng-tracepoint.o
  CC [M]  /tmp/B.SrjwdE/BUILD/lttng-modules-2.10.4/wrapper/irqdesc.o
  CC [M]  /tmp/B.SrjwdE/BUILD/lttng-modules-2.10.4/probes/lttng-probe-timer.o
In file included from /tmp/B.SrjwdE/BUILD/lttng-modules-2.10.4/probes/../probes/define_trace.h:100:0,
                 from /tmp/B.SrjwdE/BUILD/lttng-modules-2.10.4/probes/../instrumentation/events/lttng-module/timer.h:332,
                 from /tmp/B.SrjwdE/BUILD/lttng-modules-2.10.4/probes/lttng-probe-timer.c:43:
/tmp/B.SrjwdE/BUILD/lttng-modules-2.10.4/probes/../probes/lttng-tracepoint-event-impl.h:142:6: error: conflicting types for 'trace_hrtimer_start'
 void trace_##_name(_proto);
      ^
/tmp/B.SrjwdE/BUILD/lttng-modules-2.10.4/probes/../probes/lttng-tracepoint-event-impl.h:54:2: note: in expansion of macro 'LTTNG_TRACEPOINT_EVENT_INSTANCE_MAP'
  LTTNG_TRACEPOINT_EVENT_INSTANCE_MAP(map, name, map, PARAMS(proto), PARAMS(args))
  ^~~~~~~~~~~~~~~~~~~~~~~~~~~~~~~~~~~
/tmp/B.SrjwdE/BUILD/lttng-modules-2.10.4/probes/../instrumentation/events/lttng-module/timer.h:163:1: note: in expansion of macro 'LTTNG_TRACEPOINT_EVENT_MAP'
 LTTNG_TRACEPOINT_EVENT_MAP(hrtimer_start,
 ^~~~~~~~~~~~~~~~~~~~~~~~~~
In file included from ./include/trace/events/timer.h:8:0,
                 from /tmp/B.SrjwdE/BUILD/lttng-modules-2.10.4/probes/lttng-probe-timer.c:32:
./include/linux/tracepoint.h:184:21: note: previous definition of 'trace_hrtimer_start' was here
  static inline void trace_##name(proto)    \
                     ^
./include/linux/tracepoint.h:349:2: note: in expansion of macro '__DECLARE_TRACE'
  __DECLARE_TRACE(name, PARAMS(proto), PARAMS(args),  \
  ^~~~~~~~~~~~~~~
./include/linux/tracepoint.h:485:2: note: in expansion of macro 'DECLARE_TRACE'
  DECLARE_TRACE(name, PARAMS(proto), PARAMS(args))
  ^~~~~~~~~~~~~
./include/trace/events/timer.h:191:1: note: in expansion of macro 'TRACE_EVENT'
 TRACE_EVENT(hrtimer_start,
 ^~~~~~~~~~~
make[3]: *** [scripts/Makefile.build:330: /tmp/B.SrjwdE/BUILD/lttng-modules-2.10.4/probes/lttng-probe-timer.o] Error 1
make[3]: *** Waiting for unfinished jobs....
  CC [M]  /tmp/B.SrjwdE/BUILD/lttng-modules-2.10.4/probes/lttng-probe-irq.o
  CC [M]  /tmp/B.SrjwdE/BUILD/lttng-modules-2.10.4/tests/clock-plugin/lttng-clock-plugin-test.o
  CC [M]  /tmp/B.SrjwdE/BUILD/lttng-modules-2.10.4/tests/probes/lttng-test.o
  LD [M]  /tmp/B.SrjwdE/BUILD/lttng-modules-2.10.4/tests/lttng-clock-plugin-test.o
  LD [M]  /tmp/B.SrjwdE/BUILD/lttng-modules-2.10.4/tests/lttng-test.o
  CC [M]  /tmp/B.SrjwdE/BUILD/lttng-modules-2.10.4/probes/lttng-probe-sched.o
make[2]: *** [scripts/Makefile.build:583: /tmp/B.SrjwdE/BUILD/lttng-modules-2.10.4/probes] Error 2
make[2]: *** Waiting for unfinished jobs....
  CC [M]  /tmp/B.SrjwdE/BUILD/lttng-modules-2.10.4/lib/ringbuffer/ring_buffer_backend.o
  CC [M]  /tmp/B.SrjwdE/BUILD/lttng-modules-2.10.4/lttng-statedump-impl.o
  CC [M]  /tmp/B.SrjwdE/BUILD/lttng-modules-2.10.4/lib/ringbuffer/ring_buffer_frontend.o
  CC [M]  /tmp/B.SrjwdE/BUILD/lttng-modules-2.10.4/lib/ringbuffer/ring_buffer_iterator.o
  CC [M]  /tmp/B.SrjwdE/BUILD/lttng-modules-2.10.4/lib/ringbuffer/ring_buffer_vfs.o
  CC [M]  /tmp/B.SrjwdE/BUILD/lttng-modules-2.10.4/lib/../wrapper/splice.o
  CC [M]  /tmp/B.SrjwdE/BUILD/lttng-modules-2.10.4/lib/ringbuffer/ring_buffer_splice.o
  CC [M]  /tmp/B.SrjwdE/BUILD/lttng-modules-2.10.4/lib/prio_heap/lttng_prio_heap.o
  CC [M]  /tmp/B.SrjwdE/BUILD/lttng-modules-2.10.4/lib/ringbuffer/ring_buffer_mmap.o
  LD [M]  /tmp/B.SrjwdE/BUILD/lttng-modules-2.10.4/lib/lttng-lib-ring-buffer.o
  CC [M]  /tmp/B.SrjwdE/BUILD/lttng-modules-2.10.4/lttng-syscalls.o
In file included from /tmp/B.SrjwdE/BUILD/lttng-modules-2.10.4/lttng-syscalls.c:37:0:
/tmp/B.SrjwdE/BUILD/lttng-modules-2.10.4/lttng-syscalls.c: In function 'lttng_channel_syscall_mask':
/tmp/B.SrjwdE/BUILD/lttng-modules-2.10.4/lib/bitfield.h:166:13: warning: '~' on a boolean expression [-Wbool-operation]
   __v &= ~((~(typeof(__v)) 0) << __length);  \
             ^
/tmp/B.SrjwdE/BUILD/lttng-modules-2.10.4/lib/bitfield.h:221:2: note: in expansion of macro '_bt_bitfield_write_be'
  _bt_bitfield_write_be(ptr, unsigned char, _start, _length, _v)
  ^~~~~~~~~~~~~~~~~~~~~
/tmp/B.SrjwdE/BUILD/lttng-modules-2.10.4/lttng-syscalls.c:1272:3: note: in expansion of macro 'bt_bitfield_write_be'
   bt_bitfield_write_be(tmp_mask, char, bit, 1, state);
   ^
/tmp/B.SrjwdE/BUILD/lttng-modules-2.10.4/lib/bitfield.h:166:13: note: did you mean to use logical not?
   __v &= ~((~(typeof(__v)) 0) << __length);  \
             ^
/tmp/B.SrjwdE/BUILD/lttng-modules-2.10.4/lib/bitfield.h:221:2: note: in expansion of macro '_bt_bitfield_write_be'
  _bt_bitfield_write_be(ptr, unsigned char, _start, _length, _v)
  ^~~~~~~~~~~~~~~~~~~~~
/tmp/B.SrjwdE/BUILD/lttng-modules-2.10.4/lttng-syscalls.c:1272:3: note: in expansion of macro 'bt_bitfield_write_be'
   bt_bitfield_write_be(tmp_mask, char, bit, 1, state);
   ^
/tmp/B.SrjwdE/BUILD/lttng-modules-2.10.4/lib/bitfield.h:166:13: warning: '~' on a boolean expression [-Wbool-operation]
   __v &= ~((~(typeof(__v)) 0) << __length);  \
             ^
/tmp/B.SrjwdE/BUILD/lttng-modules-2.10.4/lib/bitfield.h:221:2: note: in expansion of macro '_bt_bitfield_write_be'
  _bt_bitfield_write_be(ptr, unsigned char, _start, _length, _v)
  ^~~~~~~~~~~~~~~~~~~~~
/tmp/B.SrjwdE/BUILD/lttng-modules-2.10.4/lttng-syscalls.c:1286:3: note: in expansion of macro 'bt_bitfield_write_be'
   bt_bitfield_write_be(tmp_mask, char, bit, 1, state);
   ^
/tmp/B.SrjwdE/BUILD/lttng-modules-2.10.4/lib/bitfield.h:166:13: note: did you mean to use logical not?
   __v &= ~((~(typeof(__v)) 0) << __length);  \
             ^
/tmp/B.SrjwdE/BUILD/lttng-modules-2.10.4/lib/bitfield.h:221:2: note: in expansion of macro '_bt_bitfield_write_be'
  _bt_bitfield_write_be(ptr, unsigned char, _start, _length, _v)
  ^~~~~~~~~~~~~~~~~~~~~
/tmp/B.SrjwdE/BUILD/lttng-modules-2.10.4/lttng-syscalls.c:1286:3: note: in expansion of macro 'bt_bitfield_write_be'
   bt_bitfield_write_be(tmp_mask, char, bit, 1, state);
   ^
make[1]: *** [Makefile:1561: _module_/tmp/B.SrjwdE/BUILD/lttng-modules-2.10.4] Error 2
make: *** [Makefile:110: modules] Error 2
error: Bad exit status from /tmp/B.SrjwdE/BUILD/tmp/rpm-tmp.21887 (%build)


RPM build errors:
    Bad exit status from /tmp/B.SrjwdE/BUILD/tmp/rpm-tmp.21887 (%build)
ended at: Sat Apr  7 12:45:00 2018, done in 0:00:24.750286
error: No files produced.
+ chmod -R u+rwX /tmp/B.SrjwdE/BUILD
+ rm -rf /tmp/B.SrjwdE/tmp /tmp/B.SrjwdE/BUILD
+ rm -rf /tmp/B.SrjwdE
Begin-PLD-Builder-Info
Build-Time: user:54.99s sys:4.50s real:34.62s (faults io:0 non-io:1344282)

End-PLD-Builder-Info
[Back to list of logs] [View rpm -qa of builder]