FailedOk

th/SRPMS[OK]
th/x32[OK]
th/i686[OK]
th/x86_64[OK]

ac/SRPMS[OK]
ac/i386[OK]
ac/i586[OK]
ac/i686[OK]
ac/alpha[OK]
ac/amd64[OK]
ac/athlon[OK]
ac/ppc[OK]
ac/sparc[OK]
ac/sparc64[OK]

Advanced Search
main()
Powered by PLD Linux
(c) 2002-2020 PLD Team
$Revision: 1.37 $
Powered by Lunatic Corp.
Your IP: 3.89.87.12

mbrowse c0c7348e-9fb1-4845-beae-b024f46405a4

Status:Failed
Source URL:https://buildlogs.pld-linux.org/pld/th/i686/FAIL/mbrowse,c0c7348e-9fb1-4845-beae-b024f46405a4.bz2
text/plain URL:View!
full text:View!
rpm -qa of builder:View!
Date:2020/10/09 19:10:55
Runtime:0:00:05.846176

Toc:

  • error 1
  • collect2: error: ld returned 1 exit status
  • error 2
  • make[2]: *** [Makefile:358: mbrowse] Error 1
  • error 3
  • make[1]: *** [Makefile:360: all-recursive] Error 1
  • error 4
  • error: Bad exit status from /tmp/B.vGl2o0/BUILD/tmp/rpm-tmp.5142 (%build)
  • error 5
  • RPM build errors:
  • error 6
  • error: No files produced.

Content:

                 from /usr/include/gtk-2.0/gtk/gtktoolbutton.h:30,
                 from /usr/include/gtk-2.0/gtk/gtkmenutoolbutton.h:30,
                 from /usr/include/gtk-2.0/gtk/gtk.h:126,
                 from snmpstuff.c:14:
/usr/include/gtk-2.0/gtk/gtktooltips.h:73:3: warning: 'GTimeVal' is deprecated: Use 'GDateTime' instead [-Wdeprecated-declarations]
   73 |   GTimeVal last_popdown;
      |   ^~~~~~~~
In file included from /usr/include/glib-2.0/glib/galloca.h:32,
                 from /usr/include/glib-2.0/glib.h:30,
                 from /usr/include/glib-2.0/gobject/gbinding.h:28,
                 from /usr/include/glib-2.0/glib-object.h:22,
                 from /usr/include/glib-2.0/gio/gioenums.h:28,
                 from /usr/include/glib-2.0/gio/giotypes.h:28,
                 from /usr/include/glib-2.0/gio/gio.h:26,
                 from /usr/include/gtk-2.0/gdk/gdkapplaunchcontext.h:30,
                 from /usr/include/gtk-2.0/gdk/gdk.h:32,
                 from /usr/include/gtk-2.0/gtk/gtk.h:32,
                 from snmpstuff.c:14:
/usr/include/glib-2.0/glib/gtypes.h:547:8: note: declared here
  547 | struct _GTimeVal
      |        ^~~~~~~~~
snmpstuff.c: In function 'mbrowse_create_snmp_session':
snmpstuff.c:67:3: warning: 'remote_port' is deprecated [-Wdeprecated-declarations]
   67 |   session->remote_port = config->snmp_port;
      |   ^~~~~~~
In file included from /usr/include/net-snmp/definitions.h:22,
                 from /usr/include/net-snmp/net-snmp-includes.h:24,
                 from callbacks.h:9,
                 from snmpstuff.c:19:
/usr/include/net-snmp/types.h:307:21: note: declared here
  307 |     u_short         remote_port NETSNMP_ATTRIBUTE_DEPRECATED;
      |                     ^~~~~~~~~~~
snmpstuff.c: In function 'snmpget':
snmpstuff.c:147:5: warning: this 'else' clause does not guard... [-Wmisleading-indentation]
  147 |   } else
      |     ^~~~
snmpstuff.c:150:5: note: ...this statement, but the latter is misleadingly indented as if it were guarded by the 'else'
  150 |     status = snmp_synch_response(ss, pdu, &response);
      |     ^~~~~~
snmpstuff.c: In function 'snmpset':
snmpstuff.c:320:16: warning: variable 'subtree' set but not used [-Wunused-but-set-variable]
  320 |   struct tree *subtree;
      |                ^~~~~~~
mv -f .deps/snmpstuff.Tpo .deps/snmpstuff.Po
make[2]: Leaving directory '/tmp/B.vGl2o0/BUILD/mbrowse-0.4.3/src'
make[2]: Entering directory '/tmp/B.vGl2o0/BUILD/mbrowse-0.4.3/src'
i686-pld-linux-gcc -DHAVE_CONFIG_H -I. -I.. -pthread -I/usr/include/gtk-2.0 -I/usr/lib/gtk-2.0/include -I/usr/include/pango-1.0 -I/usr/include/gio-unix-2.0 -I/usr/include/cairo -I/usr/include/atk-1.0 -I/usr/include/gdk-pixbuf-2.0 -I/usr/include/pango-1.0 -I/usr/include/libmount -I/usr/include/blkid -I/usr/include/fribidi -I/usr/include/cairo -I/usr/include/pixman-1 -I/usr/include/uuid -I/usr/include/freetype2 -I/usr/include/libpng16 -I/usr/include/harfbuzz -I/usr/include/glib-2.0 -I/usr/lib/glib-2.0/include -I/usr/include -DHAVE_NETSNMP    -O2 -fwrapv -pipe -Wformat -Werror=format-security -gdwarf-4 -fno-debug-types-section -fvar-tracking-assignments -g2 -Wp,-D_FORTIFY_SOURCE=2 -fstack-protector-strong --param=ssp-buffer-size=4 -Werror=trampolines -fomit-frame-pointer -march=i686 -fasynchronous-unwind-tables -mtune=pentium4 -gdwarf-4 -fno-debug-types-section -fvar-tracking-assignments -g2  -Wall -MT search.o -MD -MP -MF .deps/search.Tpo -c -o search.o search.c
In file included from /usr/include/gtk-2.0/gtk/gtkobject.h:37,
                 from /usr/include/gtk-2.0/gtk/gtkwidget.h:36,
                 from /usr/include/gtk-2.0/gtk/gtkcontainer.h:35,
                 from /usr/include/gtk-2.0/gtk/gtkbin.h:35,
                 from /usr/include/gtk-2.0/gtk/gtkwindow.h:36,
                 from /usr/include/gtk-2.0/gtk/gtkdialog.h:35,
                 from /usr/include/gtk-2.0/gtk/gtkaboutdialog.h:32,
                 from /usr/include/gtk-2.0/gtk/gtk.h:33,
                 from search.c:19:
/usr/include/gtk-2.0/gtk/gtktypeutils.h:236:1: warning: 'GTypeDebugFlags' is deprecated [-Wdeprecated-declarations]
  236 | void            gtk_type_init   (GTypeDebugFlags    debug_flags);
      | ^~~~
In file included from /usr/include/glib-2.0/gobject/gobject.h:24,
                 from /usr/include/glib-2.0/gobject/gbinding.h:29,
                 from /usr/include/glib-2.0/glib-object.h:22,
                 from /usr/include/glib-2.0/gio/gioenums.h:28,
                 from /usr/include/glib-2.0/gio/giotypes.h:28,
                 from /usr/include/glib-2.0/gio/gio.h:26,
                 from /usr/include/gtk-2.0/gdk/gdkapplaunchcontext.h:30,
                 from /usr/include/gtk-2.0/gdk/gdk.h:32,
                 from /usr/include/gtk-2.0/gtk/gtk.h:32,
                 from search.c:19:
/usr/include/glib-2.0/gobject/gtype.h:679:1: note: declared here
  679 | {
      | ^
In file included from /usr/include/gtk-2.0/gtk/gtktoolitem.h:31,
                 from /usr/include/gtk-2.0/gtk/gtktoolbutton.h:30,
                 from /usr/include/gtk-2.0/gtk/gtkmenutoolbutton.h:30,
                 from /usr/include/gtk-2.0/gtk/gtk.h:126,
                 from search.c:19:
/usr/include/gtk-2.0/gtk/gtktooltips.h:73:3: warning: 'GTimeVal' is deprecated: Use 'GDateTime' instead [-Wdeprecated-declarations]
   73 |   GTimeVal last_popdown;
      |   ^~~~~~~~
In file included from /usr/include/glib-2.0/glib/galloca.h:32,
                 from /usr/include/glib-2.0/glib.h:30,
                 from /usr/include/glib-2.0/gobject/gbinding.h:28,
                 from /usr/include/glib-2.0/glib-object.h:22,
                 from /usr/include/glib-2.0/gio/gioenums.h:28,
                 from /usr/include/glib-2.0/gio/giotypes.h:28,
                 from /usr/include/glib-2.0/gio/gio.h:26,
                 from /usr/include/gtk-2.0/gdk/gdkapplaunchcontext.h:30,
                 from /usr/include/gtk-2.0/gdk/gdk.h:32,
                 from /usr/include/gtk-2.0/gtk/gtk.h:32,
                 from search.c:19:
/usr/include/glib-2.0/glib/gtypes.h:547:8: note: declared here
  547 | struct _GTimeVal
      |        ^~~~~~~~~
mv -f .deps/search.Tpo .deps/search.Po
make[2]: Leaving directory '/tmp/B.vGl2o0/BUILD/mbrowse-0.4.3/src'
make[2]: Entering directory '/tmp/B.vGl2o0/BUILD/mbrowse-0.4.3/src'
i686-pld-linux-gcc  -O2 -fwrapv -pipe -Wformat -Werror=format-security -gdwarf-4 -fno-debug-types-section -fvar-tracking-assignments -g2 -Wp,-D_FORTIFY_SOURCE=2 -fstack-protector-strong --param=ssp-buffer-size=4 -Werror=trampolines -fomit-frame-pointer -march=i686 -fasynchronous-unwind-tables -mtune=pentium4 -gdwarf-4 -fno-debug-types-section -fvar-tracking-assignments -g2  -Wall   -o mbrowse main.o interface.o details.o callbacks.o snmpstuff.o bookmarks.o mibtree.o configuration.o search.o -lgtk-x11-2.0 -lgdk-x11-2.0 -lpangocairo-1.0 -lXrender -lXinerama -lXi -lXrandr -lXcursor -lXcomposite -lXdamage -lXfixes -lX11 -lXext -latk-1.0 -lcairo -lgdk_pixbuf-2.0 -lgio-2.0 -lpangoft2-1.0 -lpango-1.0 -lgobject-2.0 -lglib-2.0 -lharfbuzz -lfontconfig -lfreetype -L/usr/lib -lnetsnmp -lm -lcom_err -lkrb5 -lssh2 -lssl -lssl -lcrypto 
/usr/bin/ld: bookmarks.o:/tmp/B.vGl2o0/BUILD/mbrowse-0.4.3/src/bookmarks.c:30: multiple definition of `bookmark_items'; callbacks.o:/tmp/B.vGl2o0/BUILD/mbrowse-0.4.3/src/callbacks.c:31: first defined here
collect2: error: ld returned 1 exit status
make[2]: *** [Makefile:358: mbrowse] Error 1
make[2]: Leaving directory '/tmp/B.vGl2o0/BUILD/mbrowse-0.4.3/src'
make[1]: *** [Makefile:360: all-recursive] Error 1
make: *** [Makefile:301: all] Error 2
error: Bad exit status from /tmp/B.vGl2o0/BUILD/tmp/rpm-tmp.5142 (%build)


RPM build errors:
    Bad exit status from /tmp/B.vGl2o0/BUILD/tmp/rpm-tmp.5142 (%build)
ended at: Fri Oct  9 19:10:55 2020, done in 0:00:05.846176
error: No files produced.
+ chmod -R u+rwX /tmp/B.vGl2o0/BUILD
+ rm -rf /tmp/B.vGl2o0/tmp /tmp/B.vGl2o0/BUILD
+ rm -rf /tmp/B.vGl2o0
Begin-PLD-Builder-Info
Build-Time: user:8.85s sys:1.20s real:8.72s (faults io:0 non-io:393372)

End-PLD-Builder-Info
[Back to list of logs] [View rpm -qa of builder]