FailedOk

th/SRPMS[OK]
th/x32[OK]
th/i686[OK]
th/x86_64[OK]

ac/SRPMS[OK]
ac/i386[OK]
ac/i586[OK]
ac/i686[OK]
ac/alpha[OK]
ac/amd64[OK]
ac/athlon[OK]
ac/ppc[OK]
ac/sparc[OK]
ac/sparc64[OK]

Advanced Search
main()
Powered by PLD Linux
(c) 2002-2019 PLD Team
$Revision: 1.37 $
Powered by php.
Your IP: 34.237.76.91

mediastreamer-plugin-msopenh264 ee5291b2-eeac-4c80-8ab7-dc1c402ffdcc

Status:Failed
Source URL:ftp://buildlogs.pld-linux.org/th/i686/FAIL/mediastreamer-plugin-msopenh264,ee5291b2-eeac-4c80-8ab7-dc1c402ffdcc.bz2
text/plain URL:View!
full text:View!
rpm -qa of builder:View!
Date:2019/08/07 21:21:22
Runtime:0:00:08.241373

Toc:

  • error 1
  • rpm: error: Failed build dependencies:
  • error 2
  • rpm: error: Failed build dependencies:
  • prep
  • Executing(%prep): /bin/sh -e /tmp/B.8JpRrJ/BUILD/tmp/rpm-tmp.43392
  • build
  • Executing(%build): /bin/sh -e /tmp/B.8JpRrJ/BUILD/tmp/rpm-tmp.62704
  • error 3
  • msopenh264dec.cpp:67:11: error: 'SDecodingParam' {aka 'struct TagSVCDecodingParam'} has no member named 'eOutputColorFormat'
  • error 4
  • make[2]: *** [Makefile:502: libmsopenh264_la-msopenh264dec.lo] Error 1
  • error 5
  • msopenh264enc.cpp:134:29: error: 'struct SSpatialLayerConfig' has no member named 'sSliceCfg'; did you mean 'sSliceArgument'?
  • error 6
  • msopenh264enc.cpp:134:53: error: 'SM_DYN_SLICE' was not declared in this scope
  • error 7
  • msopenh264enc.cpp:135:29: error: 'struct SSpatialLayerConfig' has no member named 'sSliceCfg'; did you mean 'sSliceArgument'?
  • error 8
  • make[2]: *** [Makefile:509: libmsopenh264_la-msopenh264enc.lo] Error 1
  • error 9
  • make[1]: *** [Makefile:440: all-recursive] Error 1
  • error 10
  • error: Bad exit status from /tmp/B.8JpRrJ/BUILD/tmp/rpm-tmp.62704 (%build)
  • error 11
  • RPM build errors:
  • error 12
  • error: No files produced.

Content:

checking if we should skip the build
started at: Wed Aug  7 21:20:56 2019
killing old processes on a builder
sending signal 9 to pid -1
Killed
cleaning up /tmp
fetching https://srcbuilder.pld-linux.org/th//srpms/ee5291b2-eeac-4c80-8ab7-dc1c402ffdcc/mediastreamer-plugin-msopenh264-1.2.1-6.src.rpm
fetched 40203 bytes, 106.2 K/s
installing srpm: mediastreamer-plugin-msopenh264-1.2.1-6.src.rpm
+ install -d /tmp/B.8JpRrJ/BUILD /tmp/B.8JpRrJ/RPMS
+ LC_ALL=en_US.UTF-8
+ rpm -qp --changelog mediastreamer-plugin-msopenh264-1.2.1-6.src.rpm
* Wed Aug 07 2019 PLD Linux Team <feedback@pld-linux.org>
- For complete changelog see: http://git.pld-linux.org/?p=packages/mediastreamer-plugin-msopenh264.git;a=log;h=master
* Sat Jun 01 2019 Jakub Bogusz <qboosh@pld-linux.org> 6d365de
- updated to 1.2.1 - removed obsolete openh264-1.6 patch * Sat Sep 29 2018 Arkadiusz Miśkiewicz <arekm@maven.pl> 89a14b8
- rel 6; fix build * Wed Sep 26 2018 Arkadiusz Miśkiewicz <arekm@maven.pl> 9a9b658
- release 5 (by relup.sh) + rpm -Uhv --nodeps --define '_topdir /tmp/B.8JpRrJ' --define '_specdir %{_topdir}' --define '_sourcedir %{_specdir}' --define '_rpmdir %{_topdir}/RPMS' --define '_builddir %{_topdir}/BUILD' mediastreamer-plugin-msopenh264-1.2.1-6.src.rpm Preparing... ################################################## mediastreamer-plugin-msopenh################################################## + rm -f mediastreamer-plugin-msopenh264-1.2.1-6.src.rpm + install -m 700 -d /tmp/B.8JpRrJ/BUILD/tmp + TMPDIR=/tmp/B.8JpRrJ/BUILD/tmp + exec nice -n 0 rpmbuild -bp --short-circuit --nodeps --define '_topdir /tmp/B.8JpRrJ' --define '_specdir %{_topdir}' --define '_sourcedir %{_specdir}' --define '_rpmdir %{_topdir}/RPMS' --define '_builddir %{_topdir}/BUILD' --target i686-pld-linux --define 'prep exit 0' /tmp/B.8JpRrJ/mediastreamer-plugin-msopenh264.spec Building target platforms: i686-pld-linux checking BuildConflict-ing packages no BuildConflicts found checking BR rpm: error: Failed build dependencies: rpm: mediastreamer-devel >= 2.14.0 is needed by mediastreamer-plugin-msopenh264-1.2.1-6.src rpm: Building target platforms: i686-pld-linux updating poldek cache... ready is up to date Retrieving th::packages.ndir.md... th is up to date Retrieving th::packages.ndir.md... th is up to date Retrieving th-ready::packages.ndir.md... th-ready is up to date Retrieving th-ready::packages.ndir.md... th-ready is up to date Retrieving th-test::packages.ndir.md... th-test is up to date Retrieving th-test::packages.ndir.md... th-test is up to date checking conflicting packages in BRed packages poldek: Loading [pndir]ready... poldek: Loading [pndir]th-test... poldek: Loading [pndir]th-test... poldek: Loading [pndir]th-ready... poldek: Loading [pndir]th-ready... poldek: Loading [pndir]th... poldek: Loading [pndir]th... poldek: 30442 packages read poldek: Removed 2668 duplicate packages from available set poldek: Processing dependencies... poldek: mediastreamer-devel-2.16.1-5.i686 marks mediastreamer-2.16.1-5.i686 (cap mediastreamer = 2.16.1-5) poldek: There are 2 packages to install (1 marked by dependencies): poldek: I mediastreamer-devel-2.16.1-5.i686 poldek: D mediastreamer-2.16.1-5.i686 poldek: This operation will use 1.5MB of disk space. poldek: Need to get 525.1KB of archives. poldek: Executing pm-command.sh --upgrade -vh --test --root / --define _check_dirname_deps 1... poldek: Preparing... ################################################## no conflicts found checking BR rpm: error: Failed build dependencies: rpm: mediastreamer-devel >= 2.14.0 is needed by mediastreamer-plugin-msopenh264-1.2.1-6.src rpm: Building target platforms: i686-pld-linux installing BR: mediastreamer\-devel + poldek --noask --caplookup -Q -v '--ignore=hhvm-*' '--ignore=php4-*' '--ignore=php52-*' '--ignore=php54-*' '--ignore=php55-*' '--ignore=php56-*' '--ignore=php70-*' '--ignore=php71-*' '--ignore=php72-*' '--ignore=php73-*' '--ignore=php74-*' --upgrade mediastreamer-devel Loading [pndir]ready... Loading [pndir]th-test... Loading [pndir]th-test... Loading [pndir]th-ready... Loading [pndir]th-ready... Loading [pndir]th... Loading [pndir]th... 30442 packages read Removed 2668 duplicate packages from available set Processing dependencies... mediastreamer-devel-2.16.1-5.i686 marks mediastreamer-2.16.1-5.i686 (cap mediastreamer = 2.16.1-5) There are 2 packages to install (1 marked by dependencies): I mediastreamer-devel-2.16.1-5.i686 D mediastreamer-2.16.1-5.i686 This operation will use 1.5MB of disk space. Need to get 525.1KB of archives. Executing pm-command.sh --upgrade -vh --root / --define _check_dirname_deps 1... Preparing... ################################################## mediastreamer ################################################## mediastreamer-devel ################################################## building RPM using: set -ex; : build-id: ee5291b2-eeac-4c80-8ab7-dc1c402ffdcc; TMPDIR=/tmp/B.8JpRrJ/BUILD/tmp exec nice -n 0 rpmbuild -bb --define '_smp_mflags -j9' --define '_make_opts -Otarget' --define '_pld_builder 1' --define '_topdir /tmp/B.8JpRrJ' --define '_specdir %{_topdir}' --define '_sourcedir %{_specdir}' --define '_rpmdir %{_topdir}/RPMS' --define '_builddir %{_topdir}/BUILD' --target i686-pld-linux /tmp/B.8JpRrJ/mediastreamer-plugin-msopenh264.spec + : build-id: ee5291b2-eeac-4c80-8ab7-dc1c402ffdcc + TMPDIR=/tmp/B.8JpRrJ/BUILD/tmp + exec nice -n 0 rpmbuild -bb --define '_smp_mflags -j9' --define '_make_opts -Otarget' --define '_pld_builder 1' --define '_topdir /tmp/B.8JpRrJ' --define '_specdir %{_topdir}' --define '_sourcedir %{_specdir}' --define '_rpmdir %{_topdir}/RPMS' --define '_builddir %{_topdir}/BUILD' --target i686-pld-linux /tmp/B.8JpRrJ/mediastreamer-plugin-msopenh264.spec Building target platforms: i686-pld-linux Executing(%prep): /bin/sh -e /tmp/B.8JpRrJ/BUILD/tmp/rpm-tmp.43392 + umask 022 + cd /tmp/B.8JpRrJ/BUILD + cd /tmp/B.8JpRrJ/BUILD + rm -rf msopenh264-1.2.1 + /bin/tar -xf - + /usr/bin/gzip -dc /tmp/B.8JpRrJ/msopenh264-1.2.1.tar.gz + STATUS=0 + '[' 0 -ne 0 ']' + cd msopenh264-1.2.1 + /bin/id -u + '[' 1001 '=' 0 ']' + /bin/id -u + '[' 1001 '=' 0 ']' + /bin/chmod -Rf a+rX,u+w,g-w,o-w . + exit 0 Executing(%build): /bin/sh -e /tmp/B.8JpRrJ/BUILD/tmp/rpm-tmp.62704 TMP=/home/users/builder/tmp HOME=/home/users/builder PATH=/home/users/builder/GNUstep/Tools:/usr/local/bin:/usr/bin:/bin:/home/users/builder/bin TMPDIR=/tmp/B.8JpRrJ/BUILD/tmp + umask 022 + cd /tmp/B.8JpRrJ/BUILD + cd msopenh264-1.2.1 + libtoolize --copy --force --install libtoolize: putting auxiliary files in '.'. libtoolize: copying file './config.guess' libtoolize: copying file './config.sub' libtoolize: copying file './install-sh' libtoolize: copying file './ltmain.sh' libtoolize: You should add the contents of the following files to 'aclocal.m4': libtoolize: '/usr/share/aclocal/libtool.m4' libtoolize: '/usr/share/aclocal/ltoptions.m4' libtoolize: '/usr/share/aclocal/ltsugar.m4' libtoolize: '/usr/share/aclocal/ltversion.m4' libtoolize: '/usr/share/aclocal/lt~obsolete.m4' libtoolize: Consider adding 'AC_CONFIG_MACRO_DIRS([m4])' to configure.ac, libtoolize: and rerunning libtoolize and aclocal. libtoolize: Consider adding '-I m4' to ACLOCAL_AMFLAGS in Makefile.am. + aclocal + autoconf + autoheader + automake -a -c -f --foreign configure.ac:32: installing './compile' configure.ac:6: installing './missing' src/Makefile.am: installing './depcomp' + ./configure 'LDFLAGS=-Wl,--as-needed -Wl,--no-copy-dt-needed-entries -Wl,-z,relro -Wl,-z,combreloc ' 'CFLAGS=-O2 -fwrapv -pipe -Wformat -Werror=format-security -gdwarf-4 -fno-debug-types-section -fvar-tracking-assignments -g2 -Wp,-D_FORTIFY_SOURCE=2 -fstack-protector-strong --param=ssp-buffer-size=4 -Werror=trampolines -fomit-frame-pointer -march=i686 -fasynchronous-unwind-tables -mtune=pentium4 -gdwarf-4 -fno-debug-types-section -fvar-tracking-assignments -g2 ' 'CXXFLAGS=-O2 -fwrapv -pipe -Wformat -Werror=format-security -gdwarf-4 -fno-debug-types-section -fvar-tracking-assignments -g2 -Wp,-D_FORTIFY_SOURCE=2 -fstack-protector-strong --param=ssp-buffer-size=4 -Werror=trampolines -fomit-frame-pointer -march=i686 -fasynchronous-unwind-tables -mtune=pentium4 -gdwarf-4 -fno-debug-types-section -fvar-tracking-assignments -g2 ' 'FFLAGS=-O2 -fwrapv -pipe -Wformat -Werror=format-security -gdwarf-4 -fno-debug-types-section -fvar-tracking-assignments -g2 -Wp,-D_FORTIFY_SOURCE=2 -fstack-protector-strong --param=ssp-buffer-size=4 -Werror=trampolines -fomit-frame-pointer -march=i686 -fasynchronous-unwind-tables -mtune=pentium4 -gdwarf-4 -fno-debug-types-section -fvar-tracking-assignments -g2 ' 'FCFLAGS=-O2 -fwrapv -pipe -Wformat -Werror=format-security -gdwarf-4 -fno-debug-types-section -fvar-tracking-assignments -g2 -Wp,-D_FORTIFY_SOURCE=2 -fstack-protector-strong --param=ssp-buffer-size=4 -Werror=trampolines -fomit-frame-pointer -march=i686 -fasynchronous-unwind-tables -mtune=pentium4 -gdwarf-4 -fno-debug-types-section -fvar-tracking-assignments -g2 ' 'CPPFLAGS=' 'CC=i686-pld-linux-gcc' 'CXX=i686-pld-linux-g++' '--host=i686-pld-linux' '--build=i686-pld-linux' '--prefix=/usr' '--exec-prefix=/usr' '--bindir=/usr/bin' '--sbindir=/usr/sbin' '--sysconfdir=/etc' '--datadir=/usr/share' '--includedir=/usr/include' '--libdir=/usr/lib' '--libexecdir=/usr/libexec' '--localstatedir=/var' '--sharedstatedir=/var/lib' '--mandir=/usr/share/man' '--infodir=/usr/share/info' '--x-libraries=/usr/lib' checking build system type... i686-pld-linux-gnu checking host system type... i686-pld-linux-gnu checking target system type... i686-pld-linux-gnu checking for a BSD-compatible install... /usr/bin/install -c checking whether build environment is sane... yes checking for a thread-safe mkdir -p... /bin/mkdir -p checking for mawk... mawk checking whether make sets $(MAKE)... yes checking whether make supports nested variables... yes checking whether UID '1001' is supported by ustar format... yes checking whether GID '1000' is supported by ustar format... yes checking how to create a ustar tar archive... gnutar checking warning make an error on compilation... checking whether the C++ compiler works... yes checking for C++ compiler default output file name... a.out checking for suffix of executables... checking whether we are cross compiling... no checking for suffix of object files... o checking whether we are using the GNU C++ compiler... yes checking whether i686-pld-linux-g++ accepts -g... yes checking whether make supports the include directive... yes (GNU style) checking dependency style of i686-pld-linux-g++... gcc3 checking how to print strings... print -r checking for i686-pld-linux-gcc... i686-pld-linux-gcc checking whether we are using the GNU C compiler... yes checking whether i686-pld-linux-gcc accepts -g... yes checking for i686-pld-linux-gcc option to accept ISO C89... none needed checking whether i686-pld-linux-gcc understands -c and -o together... yes checking dependency style of i686-pld-linux-gcc... gcc3 checking for a sed that does not truncate output... /bin/sed checking for grep that handles long lines and -e... /bin/grep checking for egrep... /bin/grep -E checking for fgrep... /bin/grep -F checking for ld used by i686-pld-linux-gcc... /usr/bin/ld checking if the linker (/usr/bin/ld) is GNU ld... yes checking for BSD- or MS-compatible name lister (nm)... /usr/bin/nm -B checking the name lister (/usr/bin/nm -B) interface... BSD nm checking whether ln -s works... yes checking the maximum length of command line arguments... 1572864 checking how to convert i686-pld-linux-gnu file names to i686-pld-linux-gnu format... func_convert_file_noop checking how to convert i686-pld-linux-gnu file names to toolchain format... func_convert_file_noop checking for /usr/bin/ld option to reload object files... -r checking for i686-pld-linux-objdump... objdump checking how to recognize dependent libraries... pass_all checking for i686-pld-linux-dlltool... dlltool checking how to associate runtime and link libraries... print -r -- checking for i686-pld-linux-ar... no checking for ar... ar checking for archiver @FILE support... @ checking for i686-pld-linux-strip... no checking for strip... strip checking for i686-pld-linux-ranlib... no checking for ranlib... ranlib checking command to parse /usr/bin/nm -B output from i686-pld-linux-gcc object... ok checking for sysroot... no checking for a working dd... /bin/dd checking how to truncate binary pipes... /bin/dd bs=4096 count=1 checking for i686-pld-linux-mt... no checking for mt... no checking if : is a manifest tool... no checking how to run the C preprocessor... i686-pld-linux-gcc -E checking for ANSI C header files... yes checking for sys/types.h... yes checking for sys/stat.h... yes checking for stdlib.h... yes checking for string.h... yes checking for memory.h... yes checking for strings.h... yes checking for inttypes.h... yes checking for stdint.h... yes checking for unistd.h... yes checking for dlfcn.h... yes checking for objdir... .libs checking if i686-pld-linux-gcc supports -fno-rtti -fno-exceptions... no checking for i686-pld-linux-gcc option to produce PIC... -fPIC -DPIC checking if i686-pld-linux-gcc PIC flag -fPIC -DPIC works... yes checking if i686-pld-linux-gcc static flag -static works... yes checking if i686-pld-linux-gcc supports -c -o file.o... yes checking if i686-pld-linux-gcc supports -c -o file.o... (cached) yes checking whether the i686-pld-linux-gcc linker (/usr/bin/ld) supports shared libraries... yes checking whether -lc should be explicitly linked in... no checking dynamic linker characteristics... GNU/Linux ld.so checking how to hardcode library paths into programs... immediate checking whether stripping libraries is possible... yes checking if libtool supports shared libraries... yes checking whether to build shared libraries... yes checking whether to build static libraries... no checking how to run the C++ preprocessor... i686-pld-linux-g++ -E checking for ld used by i686-pld-linux-g++... /usr/bin/ld checking if the linker (/usr/bin/ld) is GNU ld... yes checking whether the i686-pld-linux-g++ linker (/usr/bin/ld) supports shared libraries... yes checking for i686-pld-linux-g++ option to produce PIC... -fPIC -DPIC checking if i686-pld-linux-g++ PIC flag -fPIC -DPIC works... yes checking if i686-pld-linux-g++ static flag -static works... yes checking if i686-pld-linux-g++ supports -c -o file.o... yes checking if i686-pld-linux-g++ supports -c -o file.o... (cached) yes checking whether the i686-pld-linux-g++ linker (/usr/bin/ld) supports shared libraries... yes checking dynamic linker characteristics... (cached) GNU/Linux ld.so checking how to hardcode library paths into programs... immediate checking for ANSI C header files... (cached) yes checking for an ANSI C-conforming const... yes checking for inline... inline checking whether time.h and sys/time.h may both be included... yes checking whether byte ordering is bigendian... no checking for i686-pld-linux-pkg-config... no checking for pkg-config... /usr/bin/pkg-config checking pkg-config is at least version 0.9.0... yes checking for mediastreamer >= 2.14.0... yes checking for stdbool.h... yes checking for WelsCreateDecoder in -lopenh264... yes checking for wels/codec_api.h... yes checking for WelsCreateDecoder in -lopenh264... (cached) yes checking for epm... false checking for mkepmlist... false checking for epminstall... false checking that generated files are newer than configure... done configure: creating ./config.status config.status: creating Makefile config.status: creating build/Makefile config.status: creating build/vs/Makefile config.status: creating src/Makefile config.status: creating msopenh264.iss config.status: creating config.h config.status: executing depfiles commands config.status: executing libtool commands config.status: executing libtool-hacking commands + /usr/bin/make -Otarget -j9 /usr/bin/make all-recursive Making all in src make[2]: Entering directory '/tmp/B.8JpRrJ/BUILD/msopenh264-1.2.1/src' /bin/sh ../libtool --tag=CXX --mode=compile i686-pld-linux-g++ -DHAVE_CONFIG_H -I. -I.. -D_REENTRANT -O2 -fwrapv -pipe -Wformat -Werror=format-security -gdwarf-4 -fno-debug-types-section -fvar-tracking-assignments -g2 -Wp,-D_FORTIFY_SOURCE=2 -fstack-protector-strong --param=ssp-buffer-size=4 -Werror=trampolines -fomit-frame-pointer -march=i686 -fasynchronous-unwind-tables -mtune=pentium4 -gdwarf-4 -fno-debug-types-section -fvar-tracking-assignments -g2 -MT libmsopenh264_la-msopenh264dec.lo -MD -MP -MF .deps/libmsopenh264_la-msopenh264dec.Tpo -c -o libmsopenh264_la-msopenh264dec.lo `test -f 'msopenh264dec.cpp' || echo './'`msopenh264dec.cpp libtool: compile: i686-pld-linux-g++ -DHAVE_CONFIG_H -I. -I.. -D_REENTRANT -O2 -fwrapv -pipe -Wformat -Werror=format-security -gdwarf-4 -fno-debug-types-section -fvar-tracking-assignments -g2 -Wp,-D_FORTIFY_SOURCE=2 -fstack-protector-strong --param=ssp-buffer-size=4 -Werror=trampolines -fomit-frame-pointer -march=i686 -fasynchronous-unwind-tables -mtune=pentium4 -gdwarf-4 -fno-debug-types-section -fvar-tracking-assignments -g2 -MT libmsopenh264_la-msopenh264dec.lo -MD -MP -MF .deps/libmsopenh264_la-msopenh264dec.Tpo -c msopenh264dec.cpp -fPIC -DPIC -o .libs/libmsopenh264_la-msopenh264dec.o msopenh264dec.cpp: In member function 'void MSOpenH264Decoder::initialize()': msopenh264dec.cpp:67:11: error: 'SDecodingParam' {aka 'struct TagSVCDecodingParam'} has no member named 'eOutputColorFormat' params.eOutputColorFormat = videoFormatI420; ^~~~~~~~~~~~~~~~~~ make[2]: *** [Makefile:502: libmsopenh264_la-msopenh264dec.lo] Error 1 make[2]: Leaving directory '/tmp/B.8JpRrJ/BUILD/msopenh264-1.2.1/src' make[2]: *** Waiting for unfinished jobs.... make[2]: Entering directory '/tmp/B.8JpRrJ/BUILD/msopenh264-1.2.1/src' /bin/sh ../libtool --tag=CXX --mode=compile i686-pld-linux-g++ -DHAVE_CONFIG_H -I. -I.. -D_REENTRANT -O2 -fwrapv -pipe -Wformat -Werror=format-security -gdwarf-4 -fno-debug-types-section -fvar-tracking-assignments -g2 -Wp,-D_FORTIFY_SOURCE=2 -fstack-protector-strong --param=ssp-buffer-size=4 -Werror=trampolines -fomit-frame-pointer -march=i686 -fasynchronous-unwind-tables -mtune=pentium4 -gdwarf-4 -fno-debug-types-section -fvar-tracking-assignments -g2 -MT libmsopenh264_la-msopenh264enc.lo -MD -MP -MF .deps/libmsopenh264_la-msopenh264enc.Tpo -c -o libmsopenh264_la-msopenh264enc.lo `test -f 'msopenh264enc.cpp' || echo './'`msopenh264enc.cpp libtool: compile: i686-pld-linux-g++ -DHAVE_CONFIG_H -I. -I.. -D_REENTRANT -O2 -fwrapv -pipe -Wformat -Werror=format-security -gdwarf-4 -fno-debug-types-section -fvar-tracking-assignments -g2 -Wp,-D_FORTIFY_SOURCE=2 -fstack-protector-strong --param=ssp-buffer-size=4 -Werror=trampolines -fomit-frame-pointer -march=i686 -fasynchronous-unwind-tables -mtune=pentium4 -gdwarf-4 -fno-debug-types-section -fvar-tracking-assignments -g2 -MT libmsopenh264_la-msopenh264enc.lo -MD -MP -MF .deps/libmsopenh264_la-msopenh264enc.Tpo -c msopenh264enc.cpp -fPIC -DPIC -o .libs/libmsopenh264_la-msopenh264enc.o msopenh264enc.cpp: In member function 'void MSOpenH264Encoder::initialize()': msopenh264enc.cpp:134:29: error: 'struct SSpatialLayerConfig' has no member named 'sSliceCfg'; did you mean 'sSliceArgument'? params.sSpatialLayers[0].sSliceCfg.uiSliceMode = SM_DYN_SLICE; ^~~~~~~~~ sSliceArgument msopenh264enc.cpp:134:53: error: 'SM_DYN_SLICE' was not declared in this scope params.sSpatialLayers[0].sSliceCfg.uiSliceMode = SM_DYN_SLICE; ^~~~~~~~~~~~ msopenh264enc.cpp:134:53: note: suggested alternative: 'SM_SINGLE_SLICE' params.sSpatialLayers[0].sSliceCfg.uiSliceMode = SM_DYN_SLICE; ^~~~~~~~~~~~ SM_SINGLE_SLICE msopenh264enc.cpp:135:29: error: 'struct SSpatialLayerConfig' has no member named 'sSliceCfg'; did you mean 'sSliceArgument'? params.sSpatialLayers[0].sSliceCfg.sSliceArgument.uiSliceSizeConstraint = ms_factory_get_payload_max_size(mFilter->factory); ^~~~~~~~~ sSliceArgument make[2]: *** [Makefile:509: libmsopenh264_la-msopenh264enc.lo] Error 1 make[2]: Leaving directory '/tmp/B.8JpRrJ/BUILD/msopenh264-1.2.1/src' make[2]: Entering directory '/tmp/B.8JpRrJ/BUILD/msopenh264-1.2.1/src' /bin/sh ../libtool --tag=CXX --mode=compile i686-pld-linux-g++ -DHAVE_CONFIG_H -I. -I.. -D_REENTRANT -O2 -fwrapv -pipe -Wformat -Werror=format-security -gdwarf-4 -fno-debug-types-section -fvar-tracking-assignments -g2 -Wp,-D_FORTIFY_SOURCE=2 -fstack-protector-strong --param=ssp-buffer-size=4 -Werror=trampolines -fomit-frame-pointer -march=i686 -fasynchronous-unwind-tables -mtune=pentium4 -gdwarf-4 -fno-debug-types-section -fvar-tracking-assignments -g2 -MT libmsopenh264_la-msopenh264.lo -MD -MP -MF .deps/libmsopenh264_la-msopenh264.Tpo -c -o libmsopenh264_la-msopenh264.lo `test -f 'msopenh264.cpp' || echo './'`msopenh264.cpp libtool: compile: i686-pld-linux-g++ -DHAVE_CONFIG_H -I. -I.. -D_REENTRANT -O2 -fwrapv -pipe -Wformat -Werror=format-security -gdwarf-4 -fno-debug-types-section -fvar-tracking-assignments -g2 -Wp,-D_FORTIFY_SOURCE=2 -fstack-protector-strong --param=ssp-buffer-size=4 -Werror=trampolines -fomit-frame-pointer -march=i686 -fasynchronous-unwind-tables -mtune=pentium4 -gdwarf-4 -fno-debug-types-section -fvar-tracking-assignments -g2 -MT libmsopenh264_la-msopenh264.lo -MD -MP -MF .deps/libmsopenh264_la-msopenh264.Tpo -c msopenh264.cpp -fPIC -DPIC -o .libs/libmsopenh264_la-msopenh264.o mv -f .deps/libmsopenh264_la-msopenh264.Tpo .deps/libmsopenh264_la-msopenh264.Plo make[2]: Leaving directory '/tmp/B.8JpRrJ/BUILD/msopenh264-1.2.1/src' make[1]: *** [Makefile:440: all-recursive] Error 1 make: *** [Makefile:370: all] Error 2 error: Bad exit status from /tmp/B.8JpRrJ/BUILD/tmp/rpm-tmp.62704 (%build) RPM build errors: Bad exit status from /tmp/B.8JpRrJ/BUILD/tmp/rpm-tmp.62704 (%build) ended at: Wed Aug 7 21:21:21 2019, done in 0:00:08.241373 error: No files produced. + chmod -R u+rwX /tmp/B.8JpRrJ/BUILD + rm -rf /tmp/B.8JpRrJ/tmp /tmp/B.8JpRrJ/BUILD + rm -rf /tmp/B.8JpRrJ Begin-PLD-Builder-Info Build-Time: user:15.52s sys:2.66s real:25.42s (faults io:0 non-io:853760) End-PLD-Builder-Info
[Back to list of logs] [View rpm -qa of builder]