FailedOk

th/SRPMS[OK]
th/x32[OK]
th/i686[OK]
th/x86_64[OK]

ac/SRPMS[OK]
ac/i386[OK]
ac/i586[OK]
ac/i686[OK]
ac/alpha[OK]
ac/amd64[OK]
ac/athlon[OK]
ac/ppc[OK]
ac/sparc[OK]
ac/sparc64[OK]

Advanced Search
main()
Powered by PLD Linux
(c) 2002-2017 PLD Team
$Revision: 1.37 $
Powered by ITS.
Your IP: 54.224.50.28

museek+ 17ffdc03-77be-485a-808d-be36330d1ff4

Status:Failed
Source URL:ftp://buildlogs.pld-linux.org/th/i686/FAIL/museek+,17ffdc03-77be-485a-808d-be36330d1ff4.bz2
text/plain URL:View!
rpm -qa of builder:View!
Date:2017/04/13 20:34:31
Runtime:0:00:18.760325

Toc:

  • prep
  • Executing(%prep): /bin/sh -e /tmp/B._cawro/BUILD/tmp/rpm-tmp.18932
  • build
  • Executing(%build): /bin/sh -e /tmp/B._cawro/BUILD/tmp/rpm-tmp.18932
  • error 1
  • /tmp/B._cawro/BUILD/museek+-0.2/NewNet/nnsocket.h:89:22: error: 'struct event' has no member named 'ev_flags'; did you mean 'ev_fd'?
  • error 2
  • /tmp/B._cawro/BUILD/museek+-0.2/NewNet/nnsocket.h:89:22: error: 'struct event' has no member named 'ev_flags'; did you mean 'ev_fd'?
  • error 3
  • /tmp/B._cawro/BUILD/museek+-0.2/museeq/chatrooms.cpp:58:50: error: no matching function for call to 'ChatRoom::ChatRoom(const QString&, ChatRooms*, bool)'
  • error 4
  • error: Bad exit status from /tmp/B._cawro/BUILD/tmp/rpm-tmp.18932 (%build)
  • error 5
  • RPM build errors:
  • error 6
  • error: No files produced.

Content:

request from: qboosh
checking if we should skip the build
started at: Thu Apr 13 20:34:06 2017
fetching https://srcbuilder.pld-linux.org/th//srpms/17ffdc03-77be-485a-808d-be36330d1ff4/museek%2B-0.2-7.src.rpm
fetched 1228091 bytes, 1367.0 K/s
installing srpm: museek+-0.2-7.src.rpm
+ install -d /tmp/B._cawro/BUILD /tmp/B._cawro/RPMS
+ LC_ALL=en_US.UTF-8
+ rpm -qp --changelog museek+-0.2-7.src.rpm
* Thu Apr 13 2017 PLD Linux Team <feedback@pld-linux.org>
- For complete changelog see: http://git.pld-linux.org/?p=packages/museek+.git;a=log;h=master
+ rpm -Uhv --nodeps --define '_topdir /tmp/B._cawro' --define '_specdir %{_topdir}' --define '_sourcedir %{_specdir}' --define '_rpmdir %{_topdir}/RPMS' --define '_builddir %{_topdir}/BUILD' museek+-0.2-7.src.rpm Preparing... ################################################## museek+ ################################################## + rm -f museek+-0.2-7.src.rpm + install -m 700 -d /tmp/B._cawro/BUILD/tmp + TMPDIR=/tmp/B._cawro/BUILD/tmp + exec nice -n 0 rpmbuild -bp --short-circuit --nodeps --define '_topdir /tmp/B._cawro' --define '_specdir %{_topdir}' --define '_sourcedir %{_specdir}' --define '_rpmdir %{_topdir}/RPMS' --define '_builddir %{_topdir}/BUILD' --target i686-pld-linux --define 'prep exit 0' /tmp/B._cawro/museek+.spec Building target platforms: i686-pld-linux checking BuildConflict-ing packages no BuildConflicts found checking BR rpm: Building target platforms: i686-pld-linux no BR needed building RPM using: set -ex; : build-id: 17ffdc03-77be-485a-808d-be36330d1ff4; TMPDIR=/tmp/B._cawro/BUILD/tmp exec nice -n 0 rpmbuild -bb --define '_smp_mflags -j9' --define '_make_opts -Otarget' --define '_pld_builder 1' --define '_topdir /tmp/B._cawro' --define '_specdir %{_topdir}' --define '_sourcedir %{_specdir}' --define '_rpmdir %{_topdir}/RPMS' --define '_builddir %{_topdir}/BUILD' --target i686-pld-linux /tmp/B._cawro/museek+.spec + : build-id: 17ffdc03-77be-485a-808d-be36330d1ff4 + TMPDIR=/tmp/B._cawro/BUILD/tmp + exec nice -n 0 rpmbuild -bb --define '_smp_mflags -j9' --define '_make_opts -Otarget' --define '_pld_builder 1' --define '_topdir /tmp/B._cawro' --define '_specdir %{_topdir}' --define '_sourcedir %{_specdir}' --define '_rpmdir %{_topdir}/RPMS' --define '_builddir %{_topdir}/BUILD' --target i686-pld-linux /tmp/B._cawro/museek+.spec Building target platforms: i686-pld-linux Executing(%prep): /bin/sh -e /tmp/B._cawro/BUILD/tmp/rpm-tmp.18932 + umask 022 + cd /tmp/B._cawro/BUILD + cd /tmp/B._cawro/BUILD + rm -rf museek+-0.2 + /usr/bin/bzip2 -dc /tmp/B._cawro/museek+-0.2.tar.bz2 + /bin/tar -xf - + STATUS=0 + '[' 0 -ne 0 ']' + cd museek+-0.2 + /bin/id -u + '[' 1001 '=' 0 ']' + /bin/id -u + '[' 1001 '=' 0 ']' + /bin/chmod -Rf a+rX,u+w,g-w,o-w . + echo 'Patch #0 (sitescriptdir.patch):' Patch #0 (sitescriptdir.patch): + '[' -f /tmp/B._cawro/sitescriptdir.patch ']' + /bin/cat /tmp/B._cawro/sitescriptdir.patch + /usr/bin/patch -s -p1 + echo 'Patch #1 (museek+-desktop.patch):' Patch #1 (museek+-desktop.patch): + '[' -f /tmp/B._cawro/museek+-desktop.patch ']' + /bin/cat /tmp/B._cawro/museek+-desktop.patch + /usr/bin/patch -s -p1 + echo 'Patch #2 (museek+-python.patch):' Patch #2 (museek+-python.patch): + '[' -f /tmp/B._cawro/museek+-python.patch ']' + /bin/cat /tmp/B._cawro/museek+-python.patch + /usr/bin/patch -s -p1 + grep -r /usr/bin/env . -l + xargs sed -i -e '1s,#!.*env python,#!/usr/bin/python2,' + exit 0 Executing(%build): /bin/sh -e /tmp/B._cawro/BUILD/tmp/rpm-tmp.18932 TMP=/home/users/builder/tmp HOME=/home/users/builder PATH=/home/users/builder/GNUstep/Tools:/usr/local/bin:/usr/bin:/bin:/home/users/builder/bin TMPDIR=/tmp/B._cawro/BUILD/tmp + umask 022 + cd /tmp/B._cawro/BUILD + cd museek+-0.2 + mkdir build + cd build + CXXFLAGS='-O2 -fwrapv -pipe -Wformat -Werror=format-security -gdwarf-4 -fno-debug-types-section -fvar-tracking-assignments -g2 -Wp,-D_FORTIFY_SOURCE=2 -fstack-protector-strong --param=ssp-buffer-size=4 -fomit-frame-pointer -march=i686 -fasynchronous-unwind-tables -mtune=pentium4 -gdwarf-4 -fno-debug-types-section -fvar-tracking-assignments -g2 -std=c++0x' + CC=i686-pld-linux-gcc CXX=i686-pld-linux-g++ CPPFLAGS= /usr/bin/cmake '-DCMAKE_VERBOSE_MAKEFILE=ON' '-DCMAKE_BUILD_TYPE=PLD' '-DCMAKE_INSTALL_BINDIR:PATH=/usr/bin' '-DCMAKE_INSTALL_SBINDIR:PATH=/usr/sbin' '-DCMAKE_INSTALL_LIBEXECDIR:PATH=/usr/lib' '-DCMAKE_INSTALL_SYSCONFDIR:PATH=/etc' '-DCMAKE_INSTALL_SHAREDSTATEDIRPATH:PATH=/var/lib' '-DCMAKE_INSTALL_LOCALSTATEDIRPATH:PATH=/var' '-DCMAKE_INSTALL_LIBDIR:PATH=/usr/lib' '-DCMAKE_INSTALL_INCLUDEDIR:PATH=/usr/include' '-DCMAKE_INSTALL_OLDINCLUDEDIR:PATH=/usr/include' '-DCMAKE_INSTALL_DATAROOTDIR:PATH=/usr/share' '-DCMAKE_INSTALL_DATADIR:PATH=/usr/share' '-DCMAKE_INSTALL_INFODIR:PATH=/usr/share/info' '-DCMAKE_INSTALL_LOCALEDIR:PATH=/usr/share/locale' '-DCMAKE_INSTALL_MANDIR:PATH=/usr/share/man' '-DCMAKE_INSTALL_DOCDIR:PATH=/usr/share/doc' '-DCMAKE_INSTALL_PREFIX:PATH=/usr' '-DSYSCONF_INSTALL_DIR:PATH=/etc' '-DCMAKE_CXX_FLAGS_PLD=-O2 -fwrapv -pipe -Wformat -Werror=format-security -gdwarf-4 -fno-debug-types-section -fvar-tracking-assignments -g2 -Wp,-D_FORTIFY_SOURCE=2 -fstack-protector-strong --param=ssp-buffer-size=4 -fomit-frame-pointer -march=i686 -fasynchronous-unwind-tables -mtune=pentium4 -gdwarf-4 -fno-debug-types-section -fvar-tracking-assignments -g2 -std=c++0x' '-DCMAKE_C_FLAGS_PLD=-O2 -fwrapv -pipe -Wformat -Werror=format-security -gdwarf-4 -fno-debug-types-section -fvar-tracking-assignments -g2 -Wp,-D_FORTIFY_SOURCE=2 -fstack-protector-strong --param=ssp-buffer-size=4 -fomit-frame-pointer -march=i686 -fasynchronous-unwind-tables -mtune=pentium4 -gdwarf-4 -fno-debug-types-section -fvar-tracking-assignments -g2 -DNDEBUG -DQT_NO_DEBUG' '-DCMAKE_Fortran_FLAGS_PLD=-O2 -fwrapv -pipe -Wformat -Werror=format-security -gdwarf-4 -fno-debug-types-section -fvar-tracking-assignments -g2 -Wp,-D_FORTIFY_SOURCE=2 -fstack-protector-strong --param=ssp-buffer-size=4 -fomit-frame-pointer -march=i686 -fasynchronous-unwind-tables -mtune=pentium4 -gdwarf-4 -fno-debug-types-section -fvar-tracking-assignments -g2 -DNDEBUG -DQT_NO_DEBUG' '-DCMAKE_EXE_LINKER_FLAGS_PLD=-Wl,--as-needed -Wl,--no-copy-dt-needed-entries -Wl,-z,relro -Wl,-z,combreloc ' '-DCMAKE_SHARED_LINKER_FLAGS_PLD=-Wl,--as-needed -Wl,--no-copy-dt-needed-entries -Wl,-z,relro -Wl,-z,combreloc ' '-DCMAKE_MODULE_LINKER_FLAGS_PLD=-Wl,--as-needed -Wl,--no-copy-dt-needed-entries -Wl,-z,relro -Wl,-z,combreloc ' '-DBUILD_SHARED_LIBS:BOOL=ON' .. '-DEVERYTHING=1' '-DMANDIR=/usr/share/man' '-DPYTHON_EXECUTABLE:PATH=/usr/bin/python2' -- The C compiler identification is GNU 6.3.0 -- The CXX compiler identification is GNU 6.3.0 -- Check for working C compiler: /usr/bin/i686-pld-linux-gcc -- Check for working C compiler: /usr/bin/i686-pld-linux-gcc -- works -- Detecting C compiler ABI info -- Detecting C compiler ABI info - done -- Detecting C compile features -- Detecting C compile features - done -- Check for working CXX compiler: /usr/bin/i686-pld-linux-g++ -- Check for working CXX compiler: /usr/bin/i686-pld-linux-g++ -- works -- Detecting CXX compiler ABI info -- Detecting CXX compiler ABI info - done -- Detecting CXX compile features -- Detecting CXX compile features - done DECLARATIONS: PREFIX (/usr), MANDIR (PREFIX/man) Package options: EVERYTHING, NO_MUSEEKD, NO_MUSCAN, NO_SETUP, NO_MUSEEQ, NO_PYMUCIPHER, BINDINGS, MURMUR, MUCOUS, CLIENTS Museeq options: BINRELOC, DATADIR (PREFIX/share), RELOAD_TRANSLATIONS Prefix these declarations with -D and set them with either 1, 0 or a path. Set -DEVERYTHING=1 if you want it all -- Looking for include file stdlib.h -- Looking for include file stdlib.h - found -- Looking for include file stdio.h -- Looking for include file stdio.h - found -- Looking for include file stdarg.h -- Looking for include file stdarg.h - found -- Looking for include file stdint.h -- Looking for include file stdint.h - found -- Looking for include file stddef.h -- Looking for include file stddef.h - found -- Looking for include file unistd.h -- Looking for include file unistd.h - found -- Looking for include file string.h -- Looking for include file string.h - found -- Looking for include file strings.h -- Looking for include file strings.h - found -- Looking for include file errno.h -- Looking for include file errno.h - found -- Looking for include file fcntl.h -- Looking for include file fcntl.h - found -- Looking for include file netdb.h -- Looking for include file netdb.h - found -- Looking for include file sys/types.h -- Looking for include file sys/types.h - found -- Looking for include file sys/time.h -- Looking for include file sys/time.h - found -- Looking for include file inttypes.h, -- Looking for include file inttypes.h, - not found -- Looking for include file time.h -- Looking for include file time.h - found -- Looking for include file memory.h -- Looking for include file memory.h - found -- Looking for include file sys/socket.h -- Looking for include file sys/socket.h - found -- Looking for include file sys/poll.h -- Looking for include file sys/poll.h - found -- Looking for include file sys/epoll.h -- Looking for include file sys/epoll.h - found -- Looking for include file sys/signal.h -- Looking for include file sys/signal.h - found -- Looking for include file sys/un.h -- Looking for include file sys/un.h - found -- Looking for include file sys/syslog.h -- Looking for include file sys/syslog.h - found -- Looking for include file sys/stat.h -- Looking for include file sys/stat.h - found -- Looking for include file dirent.h -- Looking for include file dirent.h - found -- Looking for include file sys/ndir.h -- Looking for include file sys/ndir.h - not found -- Looking for include file sys/dir.h -- Looking for include file sys/dir.h - found -- Looking for include file ndir.h -- Looking for include file ndir.h - not found -- Looking for include file vorbis/vorbisfile.h -- Looking for include file vorbis/vorbisfile.h - found -- Looking for include file pwd.h -- Looking for include file pwd.h - found -- Looking for include file netinet/in.h -- Looking for include file netinet/in.h - found -- Looking for include file netinet/tcp.h -- Looking for include file netinet/tcp.h - found -- Looking for include file windows.h -- Looking for include file windows.h - not found -- Looking for include file winsock.h -- Looking for include file winsock.h - not found -- Check size of unsigned char -- Check size of unsigned char - done -- Check size of unsigned short -- Check size of unsigned short - done -- Check size of unsigned int -- Check size of unsigned int - done -- Check size of unsigned long -- Check size of unsigned long - done -- Check size of unsigned long long -- Check size of unsigned long long - done -- Check size of uint -- Check size of uint - done -- Check size of uint32 -- Check size of uint32 - failed -- Looking for include file iconv.h -- Looking for include file iconv.h - found -- Looking for iconv -- Looking for iconv - found -- Performing Test ICONV_CONST -- Performing Test ICONV_CONST - Failed -- Performing Test ICONV_NON_CONST -- Performing Test ICONV_NON_CONST - Success -- Performing Test SIGNAL_TYPE -- Performing Test SIGNAL_TYPE - Success -- Performing Test DIR_H -- Performing Test DIR_H - Success -- Performing Test DIR_SCANDIR_H -- Performing Test DIR_SCANDIR_H - Success -- Vorbisfile library found at /usr/lib/libvorbisfile.so. -- Found Event: /usr/include -- Found SWIG: /usr/bin/swig (found version "3.0.12") -- Found PythonInterp: /usr/bin/python2 (found version "2.7.13") -- Found PythonLibs: /usr/lib/libpython2.7.so (found version "2.7.13") --> PyMucipher will be installed.. [NO_PYMUCIPHER=1] -- Found PkgConfig: /usr/bin/pkg-config (found version "0.29.2") -- Checking for one of the modules 'libxml++-2.6' -- Found Gamin: good choice, it's better then FAM -- Found FAM (provided by Gamin): /usr/lib/libgamin-1.so --> muscan (file scanner) will be installed.. --> muscand (FAM-based file scanning daemon) will be installed.. -- Found ZLIB: /usr/lib/libz.so (found version "1.2.11") -- Found LibXml2: /usr/lib/libxml2.so (found version "2.9.4") --> Museek Daemon (museekd) will be installed.. --> Python Bindings will be installed.. --> mulog, museekchat, museekcontrol, musirc.py will be installed.. --> musetup, musetup-gtk, musetup-qt will be installed.. --> Mucous will be installed.. --> Murmur will be installed.. -- Looking for Q_WS_X11 -- Looking for Q_WS_X11 - found -- Looking for Q_WS_WIN -- Looking for Q_WS_WIN - not found -- Looking for Q_WS_QWS -- Looking for Q_WS_QWS - not found -- Looking for Q_WS_MAC -- Looking for Q_WS_MAC - not found -- Found Qt4: /usr/bin/qmake-qt4 (found version "4.8.7") -- Qt Script available -- Qt UI Tools available -- moc binary:/usr/lib/qt4/bin/moc --> Museeq-qt4 will be installed.. [NO_MUSEEQ=1] * without Binary Relocation.. [BINRELOC=1] -- Configuring done -- Generating done CMake Warning: Manually-specified variables were not used by the project: CMAKE_Fortran_FLAGS_PLD CMAKE_INSTALL_BINDIR CMAKE_INSTALL_DATADIR CMAKE_INSTALL_DATAROOTDIR CMAKE_INSTALL_DOCDIR CMAKE_INSTALL_INCLUDEDIR CMAKE_INSTALL_INFODIR CMAKE_INSTALL_LIBDIR CMAKE_INSTALL_LIBEXECDIR CMAKE_INSTALL_LOCALEDIR CMAKE_INSTALL_LOCALSTATEDIRPATH CMAKE_INSTALL_MANDIR CMAKE_INSTALL_OLDINCLUDEDIR CMAKE_INSTALL_SBINDIR CMAKE_INSTALL_SHAREDSTATEDIRPATH CMAKE_INSTALL_SYSCONFDIR CMAKE_SHARED_LINKER_FLAGS_PLD SYSCONF_INSTALL_DIR -- Build files have been written to: /tmp/B._cawro/BUILD/museek+-0.2/build + /usr/bin/make -Otarget -j9 /usr/bin/cmake -H/tmp/B._cawro/BUILD/museek+-0.2 -B/tmp/B._cawro/BUILD/museek+-0.2/build --check-build-system CMakeFiles/Makefile.cmake 0 /usr/bin/cmake -E cmake_progress_start /tmp/B._cawro/BUILD/museek+-0.2/build/CMakeFiles /tmp/B._cawro/BUILD/museek+-0.2/build/CMakeFiles/progress.marks /usr/bin/make -f CMakeFiles/Makefile2 all /usr/bin/make -f NewNet/CMakeFiles/NewNet.dir/build.make NewNet/CMakeFiles/NewNet.dir/depend /usr/bin/make -f Mucipher/CMakeFiles/Mucipher.dir/build.make Mucipher/CMakeFiles/Mucipher.dir/depend /usr/bin/make -f Mucipher/PyMucipher/CMakeFiles/_mucipherc.dir/build.make Mucipher/PyMucipher/CMakeFiles/_mucipherc.dir/depend /usr/bin/make -f muscan/CMakeFiles/Tools.dir/build.make muscan/CMakeFiles/Tools.dir/depend make[2]: Entering directory '/tmp/B._cawro/BUILD/museek+-0.2/build' cd /tmp/B._cawro/BUILD/museek+-0.2/build && /usr/bin/cmake -E cmake_depends "Unix Makefiles" /tmp/B._cawro/BUILD/museek+-0.2 /tmp/B._cawro/BUILD/museek+-0.2/Mucipher /tmp/B._cawro/BUILD/museek+-0.2/build /tmp/B._cawro/BUILD/museek+-0.2/build/Mucipher /tmp/B._cawro/BUILD/museek+-0.2/build/Mucipher/CMakeFiles/Mucipher.dir/DependInfo.cmake --color= Scanning dependencies of target Mucipher make[2]: Leaving directory '/tmp/B._cawro/BUILD/museek+-0.2/build' make[2]: Entering directory '/tmp/B._cawro/BUILD/museek+-0.2/build' cd /tmp/B._cawro/BUILD/museek+-0.2/build && /usr/bin/cmake -E cmake_depends "Unix Makefiles" /tmp/B._cawro/BUILD/museek+-0.2 /tmp/B._cawro/BUILD/museek+-0.2/muscan /tmp/B._cawro/BUILD/museek+-0.2/build /tmp/B._cawro/BUILD/museek+-0.2/build/muscan /tmp/B._cawro/BUILD/museek+-0.2/build/muscan/CMakeFiles/Tools.dir/DependInfo.cmake --color= Scanning dependencies of target Tools make[2]: Leaving directory '/tmp/B._cawro/BUILD/museek+-0.2/build' /usr/bin/make -f Mucipher/CMakeFiles/Mucipher.dir/build.make Mucipher/CMakeFiles/Mucipher.dir/build /usr/bin/make -f muscan/CMakeFiles/Tools.dir/build.make muscan/CMakeFiles/Tools.dir/build make[2]: Entering directory '/tmp/B._cawro/BUILD/museek+-0.2/build' cd /tmp/B._cawro/BUILD/museek+-0.2/build && /usr/bin/cmake -E cmake_depends "Unix Makefiles" /tmp/B._cawro/BUILD/museek+-0.2 /tmp/B._cawro/BUILD/museek+-0.2/NewNet /tmp/B._cawro/BUILD/museek+-0.2/build /tmp/B._cawro/BUILD/museek+-0.2/build/NewNet /tmp/B._cawro/BUILD/museek+-0.2/build/NewNet/CMakeFiles/NewNet.dir/DependInfo.cmake --color= Scanning dependencies of target NewNet make[2]: Leaving directory '/tmp/B._cawro/BUILD/museek+-0.2/build' /usr/bin/make -f NewNet/CMakeFiles/NewNet.dir/build.make NewNet/CMakeFiles/NewNet.dir/build make[2]: Entering directory '/tmp/B._cawro/BUILD/museek+-0.2/build' [ 1%] Building CXX object Mucipher/CMakeFiles/Mucipher.dir/hexdigest.cpp.o cd /tmp/B._cawro/BUILD/museek+-0.2/build/Mucipher && /usr/bin/i686-pld-linux-g++ -DHAVE_CONFIG_H -DHAVE_SYSTEM_H -DNN_PTR_DEBUG -DNN_PTR_DEBUG_ASSERT -I/tmp/B._cawro/BUILD/museek+-0.2/. -I/tmp/B._cawro/BUILD/museek+-0.2/build -O2 -fwrapv -pipe -Wformat -Werror=format-security -gdwarf-4 -fno-debug-types-section -fvar-tracking-assignments -g2 -Wp,-D_FORTIFY_SOURCE=2 -fstack-protector-strong --param=ssp-buffer-size=4 -fomit-frame-pointer -march=i686 -fasynchronous-unwind-tables -mtune=pentium4 -gdwarf-4 -fno-debug-types-section -fvar-tracking-assignments -g2 -std=c++0x -o CMakeFiles/Mucipher.dir/hexdigest.cpp.o -c /tmp/B._cawro/BUILD/museek+-0.2/Mucipher/hexdigest.cpp make[2]: Leaving directory '/tmp/B._cawro/BUILD/museek+-0.2/build' make[2]: Entering directory '/tmp/B._cawro/BUILD/museek+-0.2/build' [ 2%] Building CXX object muscan/CMakeFiles/Tools.dir/scandir.cc.o cd /tmp/B._cawro/BUILD/museek+-0.2/build/muscan && /usr/bin/i686-pld-linux-g++ -DHAVE_CONFIG_H -DHAVE_SYSTEM_H -DNN_PTR_DEBUG -DNN_PTR_DEBUG_ASSERT -I/tmp/B._cawro/BUILD/museek+-0.2/. -I/tmp/B._cawro/BUILD/museek+-0.2/build -O2 -fwrapv -pipe -Wformat -Werror=format-security -gdwarf-4 -fno-debug-types-section -fvar-tracking-assignments -g2 -Wp,-D_FORTIFY_SOURCE=2 -fstack-protector-strong --param=ssp-buffer-size=4 -fomit-frame-pointer -march=i686 -fasynchronous-unwind-tables -mtune=pentium4 -gdwarf-4 -fno-debug-types-section -fvar-tracking-assignments -g2 -std=c++0x -I/usr/include/libxml++-2.6 -I/usr/lib/libxml++-2.6/include -I/usr/include/libxml2 -I/usr/include/glibmm-2.4 -I/usr/lib/glibmm-2.4/include -I/usr/include/glib-2.0 -I/usr/lib/glib-2.0/include -I/usr/include/sigc++-2.0 -I/usr/lib/sigc++-2.0/include -o CMakeFiles/Tools.dir/scandir.cc.o -c /tmp/B._cawro/BUILD/museek+-0.2/muscan/scandir.cc make[2]: Leaving directory '/tmp/B._cawro/BUILD/museek+-0.2/build' make[2]: Entering directory '/tmp/B._cawro/BUILD/museek+-0.2/build' [ 4%] Building CXX object Mucipher/CMakeFiles/Mucipher.dir/sha.cpp.o cd /tmp/B._cawro/BUILD/museek+-0.2/build/Mucipher && /usr/bin/i686-pld-linux-g++ -DHAVE_CONFIG_H -DHAVE_SYSTEM_H -DNN_PTR_DEBUG -DNN_PTR_DEBUG_ASSERT -I/tmp/B._cawro/BUILD/museek+-0.2/. -I/tmp/B._cawro/BUILD/museek+-0.2/build -O2 -fwrapv -pipe -Wformat -Werror=format-security -gdwarf-4 -fno-debug-types-section -fvar-tracking-assignments -g2 -Wp,-D_FORTIFY_SOURCE=2 -fstack-protector-strong --param=ssp-buffer-size=4 -fomit-frame-pointer -march=i686 -fasynchronous-unwind-tables -mtune=pentium4 -gdwarf-4 -fno-debug-types-section -fvar-tracking-assignments -g2 -std=c++0x -o CMakeFiles/Mucipher.dir/sha.cpp.o -c /tmp/B._cawro/BUILD/museek+-0.2/Mucipher/sha.cpp make[2]: Leaving directory '/tmp/B._cawro/BUILD/museek+-0.2/build' make[2]: Entering directory '/tmp/B._cawro/BUILD/museek+-0.2/build' [ 2%] Building C object muscan/CMakeFiles/Tools.dir/mp3.c.o cd /tmp/B._cawro/BUILD/museek+-0.2/build/muscan && /usr/bin/i686-pld-linux-gcc -DHAVE_CONFIG_H -DHAVE_SYSTEM_H -DNN_PTR_DEBUG -DNN_PTR_DEBUG_ASSERT -I/tmp/B._cawro/BUILD/museek+-0.2/. -I/tmp/B._cawro/BUILD/museek+-0.2/build -O2 -fwrapv -pipe -Wformat -Werror=format-security -gdwarf-4 -fno-debug-types-section -fvar-tracking-assignments -g2 -Wp,-D_FORTIFY_SOURCE=2 -fstack-protector-strong --param=ssp-buffer-size=4 -fomit-frame-pointer -march=i686 -fasynchronous-unwind-tables -mtune=pentium4 -gdwarf-4 -fno-debug-types-section -fvar-tracking-assignments -g2 -DNDEBUG -DQT_NO_DEBUG -I/usr/include/libxml++-2.6 -I/usr/lib/libxml++-2.6/include -I/usr/include/libxml2 -I/usr/include/glibmm-2.4 -I/usr/lib/glibmm-2.4/include -I/usr/include/glib-2.0 -I/usr/lib/glib-2.0/include -I/usr/include/sigc++-2.0 -I/usr/lib/sigc++-2.0/include -o CMakeFiles/Tools.dir/mp3.c.o -c /tmp/B._cawro/BUILD/museek+-0.2/muscan/mp3.c make[2]: Leaving directory '/tmp/B._cawro/BUILD/museek+-0.2/build' make[2]: Entering directory '/tmp/B._cawro/BUILD/museek+-0.2/build' [ 4%] Building CXX object Mucipher/CMakeFiles/Mucipher.dir/md5.cpp.o cd /tmp/B._cawro/BUILD/museek+-0.2/build/Mucipher && /usr/bin/i686-pld-linux-g++ -DHAVE_CONFIG_H -DHAVE_SYSTEM_H -DNN_PTR_DEBUG -DNN_PTR_DEBUG_ASSERT -I/tmp/B._cawro/BUILD/museek+-0.2/. -I/tmp/B._cawro/BUILD/museek+-0.2/build -O2 -fwrapv -pipe -Wformat -Werror=format-security -gdwarf-4 -fno-debug-types-section -fvar-tracking-assignments -g2 -Wp,-D_FORTIFY_SOURCE=2 -fstack-protector-strong --param=ssp-buffer-size=4 -fomit-frame-pointer -march=i686 -fasynchronous-unwind-tables -mtune=pentium4 -gdwarf-4 -fno-debug-types-section -fvar-tracking-assignments -g2 -std=c++0x -o CMakeFiles/Mucipher.dir/md5.cpp.o -c /tmp/B._cawro/BUILD/museek+-0.2/Mucipher/md5.cpp make[2]: Leaving directory '/tmp/B._cawro/BUILD/museek+-0.2/build' make[2]: Entering directory '/tmp/B._cawro/BUILD/museek+-0.2/build' [ 1%] Swig source cd /tmp/B._cawro/BUILD/museek+-0.2/build/Mucipher/PyMucipher && /usr/bin/cmake -E make_directory /tmp/B._cawro/BUILD/museek+-0.2/build/Mucipher/PyMucipher cd /tmp/B._cawro/BUILD/museek+-0.2/build/Mucipher/PyMucipher && /usr/bin/swig -python -includeall -outdir /tmp/B._cawro/BUILD/museek+-0.2/build/Mucipher/PyMucipher -c++ -I/tmp/B._cawro/BUILD/museek+-0.2/. -I/tmp/B._cawro/BUILD/museek+-0.2/build -I/usr/include/python2.7 -I/tmp/B._cawro/BUILD/museek+-0.2/Mucipher/PyMucipher -o /tmp/B._cawro/BUILD/museek+-0.2/build/Mucipher/PyMucipher/mucipherPYTHON_wrap.cxx /tmp/B._cawro/BUILD/museek+-0.2/Mucipher/PyMucipher/mucipher.i make[2]: Leaving directory '/tmp/B._cawro/BUILD/museek+-0.2/build' make[2]: Entering directory '/tmp/B._cawro/BUILD/museek+-0.2/build' [ 1%] Building CXX object NewNet/CMakeFiles/NewNet.dir/nnbuffer.cpp.o cd /tmp/B._cawro/BUILD/museek+-0.2/build/NewNet && /usr/bin/i686-pld-linux-g++ -DHAVE_CONFIG_H -DHAVE_SYSTEM_H -DNN_PTR_DEBUG -DNN_PTR_DEBUG_ASSERT -I/tmp/B._cawro/BUILD/museek+-0.2/. -I/tmp/B._cawro/BUILD/museek+-0.2/build -O2 -fwrapv -pipe -Wformat -Werror=format-security -gdwarf-4 -fno-debug-types-section -fvar-tracking-assignments -g2 -Wp,-D_FORTIFY_SOURCE=2 -fstack-protector-strong --param=ssp-buffer-size=4 -fomit-frame-pointer -march=i686 -fasynchronous-unwind-tables -mtune=pentium4 -gdwarf-4 -fno-debug-types-section -fvar-tracking-assignments -g2 -std=c++0x -o CMakeFiles/NewNet.dir/nnbuffer.cpp.o -c /tmp/B._cawro/BUILD/museek+-0.2/NewNet/nnbuffer.cpp make[2]: Leaving directory '/tmp/B._cawro/BUILD/museek+-0.2/build' make[2]: Entering directory '/tmp/B._cawro/BUILD/museek+-0.2/build' cd /tmp/B._cawro/BUILD/museek+-0.2/build && /usr/bin/cmake -E cmake_depends "Unix Makefiles" /tmp/B._cawro/BUILD/museek+-0.2 /tmp/B._cawro/BUILD/museek+-0.2/Mucipher/PyMucipher /tmp/B._cawro/BUILD/museek+-0.2/build /tmp/B._cawro/BUILD/museek+-0.2/build/Mucipher/PyMucipher /tmp/B._cawro/BUILD/museek+-0.2/build/Mucipher/PyMucipher/CMakeFiles/_mucipherc.dir/DependInfo.cmake --color= Scanning dependencies of target _mucipherc make[2]: Leaving directory '/tmp/B._cawro/BUILD/museek+-0.2/build' /usr/bin/make -f Mucipher/PyMucipher/CMakeFiles/_mucipherc.dir/build.make Mucipher/PyMucipher/CMakeFiles/_mucipherc.dir/build make[2]: Entering directory '/tmp/B._cawro/BUILD/museek+-0.2/build' [ 3%] Building CXX object Mucipher/CMakeFiles/Mucipher.dir/sha256.cpp.o cd /tmp/B._cawro/BUILD/museek+-0.2/build/Mucipher && /usr/bin/i686-pld-linux-g++ -DHAVE_CONFIG_H -DHAVE_SYSTEM_H -DNN_PTR_DEBUG -DNN_PTR_DEBUG_ASSERT -I/tmp/B._cawro/BUILD/museek+-0.2/. -I/tmp/B._cawro/BUILD/museek+-0.2/build -O2 -fwrapv -pipe -Wformat -Werror=format-security -gdwarf-4 -fno-debug-types-section -fvar-tracking-assignments -g2 -Wp,-D_FORTIFY_SOURCE=2 -fstack-protector-strong --param=ssp-buffer-size=4 -fomit-frame-pointer -march=i686 -fasynchronous-unwind-tables -mtune=pentium4 -gdwarf-4 -fno-debug-types-section -fvar-tracking-assignments -g2 -std=c++0x -o CMakeFiles/Mucipher.dir/sha256.cpp.o -c /tmp/B._cawro/BUILD/museek+-0.2/Mucipher/sha256.cpp make[2]: Leaving directory '/tmp/B._cawro/BUILD/museek+-0.2/build' make[2]: Entering directory '/tmp/B._cawro/BUILD/museek+-0.2/build' [ 1%] Building CXX object Mucipher/CMakeFiles/Mucipher.dir/aes.cpp.o cd /tmp/B._cawro/BUILD/museek+-0.2/build/Mucipher && /usr/bin/i686-pld-linux-g++ -DHAVE_CONFIG_H -DHAVE_SYSTEM_H -DNN_PTR_DEBUG -DNN_PTR_DEBUG_ASSERT -I/tmp/B._cawro/BUILD/museek+-0.2/. -I/tmp/B._cawro/BUILD/museek+-0.2/build -O2 -fwrapv -pipe -Wformat -Werror=format-security -gdwarf-4 -fno-debug-types-section -fvar-tracking-assignments -g2 -Wp,-D_FORTIFY_SOURCE=2 -fstack-protector-strong --param=ssp-buffer-size=4 -fomit-frame-pointer -march=i686 -fasynchronous-unwind-tables -mtune=pentium4 -gdwarf-4 -fno-debug-types-section -fvar-tracking-assignments -g2 -std=c++0x -o CMakeFiles/Mucipher.dir/aes.cpp.o -c /tmp/B._cawro/BUILD/museek+-0.2/Mucipher/aes.cpp /tmp/B._cawro/BUILD/museek+-0.2/Mucipher/aes.cpp: In function 'int aes_set_key(void*, const u8*, unsigned int)': /tmp/B._cawro/BUILD/museek+-0.2/Mucipher/aes.cpp:280:23: warning: iteration 6 invokes undefined behavior [-Waggressive-loop-optimizations] E_KEY[8 * i + 12] = t; \ ^ /tmp/B._cawro/BUILD/museek+-0.2/Mucipher/aes.cpp:323:4: note: in expansion of macro 'loop8' loop8 (i); ^~~~~ /tmp/B._cawro/BUILD/museek+-0.2/Mucipher/aes.cpp:322:17: note: within this loop for (i = 0; i < 7; ++i) ~~^~~ make[2]: Leaving directory '/tmp/B._cawro/BUILD/museek+-0.2/build' make[2]: Entering directory '/tmp/B._cawro/BUILD/museek+-0.2/build' [ 6%] Building CXX object NewNet/CMakeFiles/NewNet.dir/nnclientsocket.cpp.o cd /tmp/B._cawro/BUILD/museek+-0.2/build/NewNet && /usr/bin/i686-pld-linux-g++ -DHAVE_CONFIG_H -DHAVE_SYSTEM_H -DNN_PTR_DEBUG -DNN_PTR_DEBUG_ASSERT -I/tmp/B._cawro/BUILD/museek+-0.2/. -I/tmp/B._cawro/BUILD/museek+-0.2/build -O2 -fwrapv -pipe -Wformat -Werror=format-security -gdwarf-4 -fno-debug-types-section -fvar-tracking-assignments -g2 -Wp,-D_FORTIFY_SOURCE=2 -fstack-protector-strong --param=ssp-buffer-size=4 -fomit-frame-pointer -march=i686 -fasynchronous-unwind-tables -mtune=pentium4 -gdwarf-4 -fno-debug-types-section -fvar-tracking-assignments -g2 -std=c++0x -o CMakeFiles/NewNet.dir/nnclientsocket.cpp.o -c /tmp/B._cawro/BUILD/museek+-0.2/NewNet/nnclientsocket.cpp In file included from /tmp/B._cawro/BUILD/museek+-0.2/NewNet/nnclientsocket.h:24:0, from /tmp/B._cawro/BUILD/museek+-0.2/NewNet/nnclientsocket.cpp:21: /tmp/B._cawro/BUILD/museek+-0.2/NewNet/nnsocket.h: In constructor 'NewNet::Socket::Socket()': /tmp/B._cawro/BUILD/museek+-0.2/NewNet/nnsocket.h:89:22: error: 'struct event' has no member named 'ev_flags'; did you mean 'ev_fd'? m_EventData->ev_flags = 0; // This event has not been initialized ^~~~~~~~ make[2]: *** [NewNet/CMakeFiles/NewNet.dir/build.make:90: NewNet/CMakeFiles/NewNet.dir/nnclientsocket.cpp.o] Error 1 make[2]: Leaving directory '/tmp/B._cawro/BUILD/museek+-0.2/build' make[2]: *** Waiting for unfinished jobs.... make[2]: Entering directory '/tmp/B._cawro/BUILD/museek+-0.2/build' [ 8%] Linking CXX static library libMucipher.a cd /tmp/B._cawro/BUILD/museek+-0.2/build/Mucipher && /usr/bin/cmake -P CMakeFiles/Mucipher.dir/cmake_clean_target.cmake cd /tmp/B._cawro/BUILD/museek+-0.2/build/Mucipher && /usr/bin/cmake -E cmake_link_script CMakeFiles/Mucipher.dir/link.txt --verbose=1 /usr/bin/ar qc libMucipher.a CMakeFiles/Mucipher.dir/aes.cpp.o CMakeFiles/Mucipher.dir/hexdigest.cpp.o CMakeFiles/Mucipher.dir/md5.cpp.o CMakeFiles/Mucipher.dir/sha.cpp.o CMakeFiles/Mucipher.dir/sha256.cpp.o /usr/bin/ranlib libMucipher.a make[2]: Leaving directory '/tmp/B._cawro/BUILD/museek+-0.2/build' make[2]: Entering directory '/tmp/B._cawro/BUILD/museek+-0.2/build' [ 9%] Building CXX object Mucipher/PyMucipher/CMakeFiles/_mucipherc.dir/__/hexdigest.cpp.o cd /tmp/B._cawro/BUILD/museek+-0.2/build/Mucipher/PyMucipher && /usr/bin/i686-pld-linux-g++ -DHAVE_CONFIG_H -DHAVE_SYSTEM_H -DNN_PTR_DEBUG -DNN_PTR_DEBUG_ASSERT -D_mucipherc_EXPORTS -I/tmp/B._cawro/BUILD/museek+-0.2/. -I/tmp/B._cawro/BUILD/museek+-0.2/build -I/usr/include/python2.7 -I/tmp/B._cawro/BUILD/museek+-0.2/Mucipher/PyMucipher -O2 -fwrapv -pipe -Wformat -Werror=format-security -gdwarf-4 -fno-debug-types-section -fvar-tracking-assignments -g2 -Wp,-D_FORTIFY_SOURCE=2 -fstack-protector-strong --param=ssp-buffer-size=4 -fomit-frame-pointer -march=i686 -fasynchronous-unwind-tables -mtune=pentium4 -gdwarf-4 -fno-debug-types-section -fvar-tracking-assignments -g2 -std=c++0x -fPIC -o CMakeFiles/_mucipherc.dir/__/hexdigest.cpp.o -c /tmp/B._cawro/BUILD/museek+-0.2/Mucipher/hexdigest.cpp make[2]: Leaving directory '/tmp/B._cawro/BUILD/museek+-0.2/build' make[1]: Entering directory '/tmp/B._cawro/BUILD/museek+-0.2/build' [ 9%] Built target Mucipher make[1]: Leaving directory '/tmp/B._cawro/BUILD/museek+-0.2/build' /usr/bin/make -f museeq/CMakeFiles/museeq.dir/build.make museeq/CMakeFiles/museeq.dir/depend make[2]: Entering directory '/tmp/B._cawro/BUILD/museek+-0.2/build' [ 8%] Building CXX object NewNet/CMakeFiles/NewNet.dir/nntcpserversocket.cpp.o cd /tmp/B._cawro/BUILD/museek+-0.2/build/NewNet && /usr/bin/i686-pld-linux-g++ -DHAVE_CONFIG_H -DHAVE_SYSTEM_H -DNN_PTR_DEBUG -DNN_PTR_DEBUG_ASSERT -I/tmp/B._cawro/BUILD/museek+-0.2/. -I/tmp/B._cawro/BUILD/museek+-0.2/build -O2 -fwrapv -pipe -Wformat -Werror=format-security -gdwarf-4 -fno-debug-types-section -fvar-tracking-assignments -g2 -Wp,-D_FORTIFY_SOURCE=2 -fstack-protector-strong --param=ssp-buffer-size=4 -fomit-frame-pointer -march=i686 -fasynchronous-unwind-tables -mtune=pentium4 -gdwarf-4 -fno-debug-types-section -fvar-tracking-assignments -g2 -std=c++0x -o CMakeFiles/NewNet.dir/nntcpserversocket.cpp.o -c /tmp/B._cawro/BUILD/museek+-0.2/NewNet/nntcpserversocket.cpp In file included from /tmp/B._cawro/BUILD/museek+-0.2/NewNet/nnserversocket.h:24:0, from /tmp/B._cawro/BUILD/museek+-0.2/NewNet/nntcpserversocket.h:24, from /tmp/B._cawro/BUILD/museek+-0.2/NewNet/nntcpserversocket.cpp:21: /tmp/B._cawro/BUILD/museek+-0.2/NewNet/nnsocket.h: In constructor 'NewNet::Socket::Socket()': /tmp/B._cawro/BUILD/museek+-0.2/NewNet/nnsocket.h:89:22: error: 'struct event' has no member named 'ev_flags'; did you mean 'ev_fd'? m_EventData->ev_flags = 0; // This event has not been initialized ^~~~~~~~ make[2]: *** [NewNet/CMakeFiles/NewNet.dir/build.make:186: NewNet/CMakeFiles/NewNet.dir/nntcpserversocket.cpp.o] Error 1 make[2]: Leaving directory '/tmp/B._cawro/BUILD/museek+-0.2/build' make[2]: Entering directory '/tmp/B._cawro/BUILD/museek+-0.2/build' [ 7%] Building CXX object NewNet/CMakeFiles/NewNet.dir/nnratelimiter.cpp.o cd /tmp/B._cawro/BUILD/museek+-0.2/build/NewNet && /usr/bin/i686-pld-linux-g++ -DHAVE_CONFIG_H -DHAVE_SYSTEM_H -DNN_PTR_DEBUG -DNN_PTR_DEBUG_ASSERT -I/tmp/B._cawro/BUILD/museek+-0.2/. -I/tmp/B._cawro/BUILD/museek+-0.2/build -O2 -fwrapv -pipe -Wformat -Werror=format-security -gdwarf-4 -fno-debug-types-section -fvar-tracking-assignments -g2 -Wp,-D_FORTIFY_SOURCE=2 -fstack-protector-strong --param=ssp-buffer-size=4 -fomit-frame-pointer -march=i686 -fasynchronous-unwind-tables -mtune=pentium4 -gdwarf-4 -fno-debug-types-section -fvar-tracking-assignments -g2 -std=c++0x -o CMakeFiles/NewNet.dir/nnratelimiter.cpp.o -c /tmp/B._cawro/BUILD/museek+-0.2/NewNet/nnratelimiter.cpp make[2]: Leaving directory '/tmp/B._cawro/BUILD/museek+-0.2/build' make[2]: Entering directory '/tmp/B._cawro/BUILD/museek+-0.2/build' [ 9%] Generating moc_wishlistview.cxx cd /tmp/B._cawro/BUILD/museek+-0.2/build/museeq && /usr/lib/qt4/bin/moc @/tmp/B._cawro/BUILD/museek+-0.2/build/museeq/moc_wishlistview.cxx_parameters make[2]: Leaving directory '/tmp/B._cawro/BUILD/museek+-0.2/build' make[2]: Entering directory '/tmp/B._cawro/BUILD/museek+-0.2/build' [ 10%] Generating museeq_de.qm cd /tmp/B._cawro/BUILD/museek+-0.2/build/museeq && /usr/lib/qt4/bin/lrelease /tmp/B._cawro/BUILD/museek+-0.2/museeq/translations/museeq_de.ts -qm /tmp/B._cawro/BUILD/museek+-0.2/build/museeq/museeq_de.qm Updating '/tmp/B._cawro/BUILD/museek+-0.2/build/museeq/museeq_de.qm'... Generated 233 translation(s) (179 finished and 54 unfinished) Ignored 203 untranslated source text(s) make[2]: Leaving directory '/tmp/B._cawro/BUILD/museek+-0.2/build' make[2]: Entering directory '/tmp/B._cawro/BUILD/museek+-0.2/build' [ 7%] Building CXX object NewNet/CMakeFiles/NewNet.dir/nnpath.cpp.o cd /tmp/B._cawro/BUILD/museek+-0.2/build/NewNet && /usr/bin/i686-pld-linux-g++ -DHAVE_CONFIG_H -DHAVE_SYSTEM_H -DNN_PTR_DEBUG -DNN_PTR_DEBUG_ASSERT -I/tmp/B._cawro/BUILD/museek+-0.2/. -I/tmp/B._cawro/BUILD/museek+-0.2/build -O2 -fwrapv -pipe -Wformat -Werror=format-security -gdwarf-4 -fno-debug-types-section -fvar-tracking-assignments -g2 -Wp,-D_FORTIFY_SOURCE=2 -fstack-protector-strong --param=ssp-buffer-size=4 -fomit-frame-pointer -march=i686 -fasynchronous-unwind-tables -mtune=pentium4 -gdwarf-4 -fno-debug-types-section -fvar-tracking-assignments -g2 -std=c++0x -o CMakeFiles/NewNet.dir/nnpath.cpp.o -c /tmp/B._cawro/BUILD/museek+-0.2/NewNet/nnpath.cpp make[2]: Leaving directory '/tmp/B._cawro/BUILD/museek+-0.2/build' make[2]: Entering directory '/tmp/B._cawro/BUILD/museek+-0.2/build' [ 12%] Generating museeq_en.qm cd /tmp/B._cawro/BUILD/museek+-0.2/build/museeq && /usr/lib/qt4/bin/lrelease /tmp/B._cawro/BUILD/museek+-0.2/museeq/translations/museeq_en.ts -qm /tmp/B._cawro/BUILD/museek+-0.2/build/museeq/museeq_en.qm Updating '/tmp/B._cawro/BUILD/museek+-0.2/build/museeq/museeq_en.qm'... Generated 7 translation(s) (0 finished and 7 unfinished) Ignored 429 untranslated source text(s) make[2]: Leaving directory '/tmp/B._cawro/BUILD/museek+-0.2/build' make[2]: Entering directory '/tmp/B._cawro/BUILD/museek+-0.2/build' [ 9%] Building CXX object Mucipher/PyMucipher/CMakeFiles/_mucipherc.dir/__/md5.cpp.o cd /tmp/B._cawro/BUILD/museek+-0.2/build/Mucipher/PyMucipher && /usr/bin/i686-pld-linux-g++ -DHAVE_CONFIG_H -DHAVE_SYSTEM_H -DNN_PTR_DEBUG -DNN_PTR_DEBUG_ASSERT -D_mucipherc_EXPORTS -I/tmp/B._cawro/BUILD/museek+-0.2/. -I/tmp/B._cawro/BUILD/museek+-0.2/build -I/usr/include/python2.7 -I/tmp/B._cawro/BUILD/museek+-0.2/Mucipher/PyMucipher -O2 -fwrapv -pipe -Wformat -Werror=format-security -gdwarf-4 -fno-debug-types-section -fvar-tracking-assignments -g2 -Wp,-D_FORTIFY_SOURCE=2 -fstack-protector-strong --param=ssp-buffer-size=4 -fomit-frame-pointer -march=i686 -fasynchronous-unwind-tables -mtune=pentium4 -gdwarf-4 -fno-debug-types-section -fvar-tracking-assignments -g2 -std=c++0x -fPIC -o CMakeFiles/_mucipherc.dir/__/md5.cpp.o -c /tmp/B._cawro/BUILD/museek+-0.2/Mucipher/md5.cpp make[2]: Leaving directory '/tmp/B._cawro/BUILD/museek+-0.2/build' make[2]: Entering directory '/tmp/B._cawro/BUILD/museek+-0.2/build' [ 11%] Generating museeq_es.qm cd /tmp/B._cawro/BUILD/museek+-0.2/build/museeq && /usr/lib/qt4/bin/lrelease /tmp/B._cawro/BUILD/museek+-0.2/museeq/translations/museeq_es.ts -qm /tmp/B._cawro/BUILD/museek+-0.2/build/museeq/museeq_es.qm Updating '/tmp/B._cawro/BUILD/museek+-0.2/build/museeq/museeq_es.qm'... Generated 240 translation(s) (181 finished and 59 unfinished) Ignored 196 untranslated source text(s) make[2]: Leaving directory '/tmp/B._cawro/BUILD/museek+-0.2/build' make[2]: Entering directory '/tmp/B._cawro/BUILD/museek+-0.2/build' [ 12%] Generating museeq_fr.qm cd /tmp/B._cawro/BUILD/museek+-0.2/build/museeq && /usr/lib/qt4/bin/lrelease /tmp/B._cawro/BUILD/museek+-0.2/museeq/translations/museeq_fr.ts -qm /tmp/B._cawro/BUILD/museek+-0.2/build/museeq/museeq_fr.qm Updating '/tmp/B._cawro/BUILD/museek+-0.2/build/museeq/museeq_fr.qm'... Generated 436 translation(s) (436 finished and 0 unfinished) make[2]: Leaving directory '/tmp/B._cawro/BUILD/museek+-0.2/build' make[2]: Entering directory '/tmp/B._cawro/BUILD/museek+-0.2/build' [ 13%] Generating museeq_it.qm cd /tmp/B._cawro/BUILD/museek+-0.2/build/museeq && /usr/lib/qt4/bin/lrelease /tmp/B._cawro/BUILD/museek+-0.2/museeq/translations/museeq_it.ts -qm /tmp/B._cawro/BUILD/museek+-0.2/build/museeq/museeq_it.qm Updating '/tmp/B._cawro/BUILD/museek+-0.2/build/museeq/museeq_it.qm'... Generated 308 translation(s) (303 finished and 5 unfinished) Ignored 128 untranslated source text(s) make[2]: Leaving directory '/tmp/B._cawro/BUILD/museek+-0.2/build' make[2]: Entering directory '/tmp/B._cawro/BUILD/museek+-0.2/build' [ 13%] Generating museeq_nl.qm cd /tmp/B._cawro/BUILD/museek+-0.2/build/museeq && /usr/lib/qt4/bin/lrelease /tmp/B._cawro/BUILD/museek+-0.2/museeq/translations/museeq_nl.ts -qm /tmp/B._cawro/BUILD/museek+-0.2/build/museeq/museeq_nl.qm Updating '/tmp/B._cawro/BUILD/museek+-0.2/build/museeq/museeq_nl.qm'... Generated 242 translation(s) (188 finished and 54 unfinished) Ignored 194 untranslated source text(s) make[2]: Leaving directory '/tmp/B._cawro/BUILD/museek+-0.2/build' make[2]: Entering directory '/tmp/B._cawro/BUILD/museek+-0.2/build' [ 14%] Generating museeq_pl.qm cd /tmp/B._cawro/BUILD/museek+-0.2/build/museeq && /usr/lib/qt4/bin/lrelease /tmp/B._cawro/BUILD/museek+-0.2/museeq/translations/museeq_pl.ts -qm /tmp/B._cawro/BUILD/museek+-0.2/build/museeq/museeq_pl.qm Updating '/tmp/B._cawro/BUILD/museek+-0.2/build/museeq/museeq_pl.qm'... Generated 436 translation(s) (436 finished and 0 unfinished) make[2]: Leaving directory '/tmp/B._cawro/BUILD/museek+-0.2/build' make[2]: Entering directory '/tmp/B._cawro/BUILD/museek+-0.2/build' [ 11%] Building CXX object Mucipher/PyMucipher/CMakeFiles/_mucipherc.dir/__/sha.cpp.o cd /tmp/B._cawro/BUILD/museek+-0.2/build/Mucipher/PyMucipher && /usr/bin/i686-pld-linux-g++ -DHAVE_CONFIG_H -DHAVE_SYSTEM_H -DNN_PTR_DEBUG -DNN_PTR_DEBUG_ASSERT -D_mucipherc_EXPORTS -I/tmp/B._cawro/BUILD/museek+-0.2/. -I/tmp/B._cawro/BUILD/museek+-0.2/build -I/usr/include/python2.7 -I/tmp/B._cawro/BUILD/museek+-0.2/Mucipher/PyMucipher -O2 -fwrapv -pipe -Wformat -Werror=format-security -gdwarf-4 -fno-debug-types-section -fvar-tracking-assignments -g2 -Wp,-D_FORTIFY_SOURCE=2 -fstack-protector-strong --param=ssp-buffer-size=4 -fomit-frame-pointer -march=i686 -fasynchronous-unwind-tables -mtune=pentium4 -gdwarf-4 -fno-debug-types-section -fvar-tracking-assignments -g2 -std=c++0x -fPIC -o CMakeFiles/_mucipherc.dir/__/sha.cpp.o -c /tmp/B._cawro/BUILD/museek+-0.2/Mucipher/sha.cpp make[2]: Leaving directory '/tmp/B._cawro/BUILD/museek+-0.2/build' make[2]: Entering directory '/tmp/B._cawro/BUILD/museek+-0.2/build' [ 14%] Generating museeq_pt_BR.qm cd /tmp/B._cawro/BUILD/museek+-0.2/build/museeq && /usr/lib/qt4/bin/lrelease /tmp/B._cawro/BUILD/museek+-0.2/museeq/translations/museeq_pt_BR.ts -qm /tmp/B._cawro/BUILD/museek+-0.2/build/museeq/museeq_pt_BR.qm Updating '/tmp/B._cawro/BUILD/museek+-0.2/build/museeq/museeq_pt_BR.qm'... Generated 206 translation(s) (163 finished and 43 unfinished) Ignored 230 untranslated source text(s) make[2]: Leaving directory '/tmp/B._cawro/BUILD/museek+-0.2/build' make[2]: Entering directory '/tmp/B._cawro/BUILD/museek+-0.2/build' [ 16%] Generating museeq_ro.qm cd /tmp/B._cawro/BUILD/museek+-0.2/build/museeq && /usr/lib/qt4/bin/lrelease /tmp/B._cawro/BUILD/museek+-0.2/museeq/translations/museeq_ro.ts -qm /tmp/B._cawro/BUILD/museek+-0.2/build/museeq/museeq_ro.qm Updating '/tmp/B._cawro/BUILD/museek+-0.2/build/museeq/museeq_ro.qm'... Generated 239 translation(s) (187 finished and 52 unfinished) Ignored 197 untranslated source text(s) make[2]: Leaving directory '/tmp/B._cawro/BUILD/museek+-0.2/build' make[2]: Entering directory '/tmp/B._cawro/BUILD/museek+-0.2/build' [ 16%] Generating moc_aclineedit.cxx cd /tmp/B._cawro/BUILD/museek+-0.2/build/museeq && /usr/lib/qt4/bin/moc @/tmp/B._cawro/BUILD/museek+-0.2/build/museeq/moc_aclineedit.cxx_parameters make[2]: Leaving directory '/tmp/B._cawro/BUILD/museek+-0.2/build' make[2]: Entering directory '/tmp/B._cawro/BUILD/museek+-0.2/build' [ 15%] Building CXX object Mucipher/PyMucipher/CMakeFiles/_mucipherc.dir/__/wraphelp.cpp.o cd /tmp/B._cawro/BUILD/museek+-0.2/build/Mucipher/PyMucipher && /usr/bin/i686-pld-linux-g++ -DHAVE_CONFIG_H -DHAVE_SYSTEM_H -DNN_PTR_DEBUG -DNN_PTR_DEBUG_ASSERT -D_mucipherc_EXPORTS -I/tmp/B._cawro/BUILD/museek+-0.2/. -I/tmp/B._cawro/BUILD/museek+-0.2/build -I/usr/include/python2.7 -I/tmp/B._cawro/BUILD/museek+-0.2/Mucipher/PyMucipher -O2 -fwrapv -pipe -Wformat -Werror=format-security -gdwarf-4 -fno-debug-types-section -fvar-tracking-assignments -g2 -Wp,-D_FORTIFY_SOURCE=2 -fstack-protector-strong --param=ssp-buffer-size=4 -fomit-frame-pointer -march=i686 -fasynchronous-unwind-tables -mtune=pentium4 -gdwarf-4 -fno-debug-types-section -fvar-tracking-assignments -g2 -std=c++0x -fPIC -o CMakeFiles/_mucipherc.dir/__/wraphelp.cpp.o -c /tmp/B._cawro/BUILD/museek+-0.2/Mucipher/wraphelp.cpp make[2]: Leaving directory '/tmp/B._cawro/BUILD/museek+-0.2/build' make[2]: Entering directory '/tmp/B._cawro/BUILD/museek+-0.2/build' [ 16%] Generating moc_banlist.cxx cd /tmp/B._cawro/BUILD/museek+-0.2/build/museeq && /usr/lib/qt4/bin/moc @/tmp/B._cawro/BUILD/museek+-0.2/build/museeq/moc_banlist.cxx_parameters make[2]: Leaving directory '/tmp/B._cawro/BUILD/museek+-0.2/build' make[2]: Entering directory '/tmp/B._cawro/BUILD/museek+-0.2/build' [ 17%] Generating moc_browsers.cxx cd /tmp/B._cawro/BUILD/museek+-0.2/build/museeq && /usr/lib/qt4/bin/moc @/tmp/B._cawro/BUILD/museek+-0.2/build/museeq/moc_browsers.cxx_parameters make[2]: Leaving directory '/tmp/B._cawro/BUILD/museek+-0.2/build' make[2]: Entering directory '/tmp/B._cawro/BUILD/museek+-0.2/build' [ 17%] Generating moc_browser.cxx cd /tmp/B._cawro/BUILD/museek+-0.2/build/museeq && /usr/lib/qt4/bin/moc @/tmp/B._cawro/BUILD/museek+-0.2/build/museeq/moc_browser.cxx_parameters make[2]: Leaving directory '/tmp/B._cawro/BUILD/museek+-0.2/build' make[2]: Entering directory '/tmp/B._cawro/BUILD/museek+-0.2/build' [ 18%] Generating moc_buddylist.cxx cd /tmp/B._cawro/BUILD/museek+-0.2/build/museeq && /usr/lib/qt4/bin/moc @/tmp/B._cawro/BUILD/museek+-0.2/build/museeq/moc_buddylist.cxx_parameters make[2]: Leaving directory '/tmp/B._cawro/BUILD/museek+-0.2/build' make[2]: Entering directory '/tmp/B._cawro/BUILD/museek+-0.2/build' [ 18%] Generating moc_chatpanel.cxx cd /tmp/B._cawro/BUILD/museek+-0.2/build/museeq && /usr/lib/qt4/bin/moc @/tmp/B._cawro/BUILD/museek+-0.2/build/museeq/moc_chatpanel.cxx_parameters make[2]: Leaving directory '/tmp/B._cawro/BUILD/museek+-0.2/build' make[2]: Entering directory '/tmp/B._cawro/BUILD/museek+-0.2/build' [ 8%] Building CXX object Mucipher/PyMucipher/CMakeFiles/_mucipherc.dir/__/aes.cpp.o cd /tmp/B._cawro/BUILD/museek+-0.2/build/Mucipher/PyMucipher && /usr/bin/i686-pld-linux-g++ -DHAVE_CONFIG_H -DHAVE_SYSTEM_H -DNN_PTR_DEBUG -DNN_PTR_DEBUG_ASSERT -D_mucipherc_EXPORTS -I/tmp/B._cawro/BUILD/museek+-0.2/. -I/tmp/B._cawro/BUILD/museek+-0.2/build -I/usr/include/python2.7 -I/tmp/B._cawro/BUILD/museek+-0.2/Mucipher/PyMucipher -O2 -fwrapv -pipe -Wformat -Werror=format-security -gdwarf-4 -fno-debug-types-section -fvar-tracking-assignments -g2 -Wp,-D_FORTIFY_SOURCE=2 -fstack-protector-strong --param=ssp-buffer-size=4 -fomit-frame-pointer -march=i686 -fasynchronous-unwind-tables -mtune=pentium4 -gdwarf-4 -fno-debug-types-section -fvar-tracking-assignments -g2 -std=c++0x -fPIC -o CMakeFiles/_mucipherc.dir/__/aes.cpp.o -c /tmp/B._cawro/BUILD/museek+-0.2/Mucipher/aes.cpp /tmp/B._cawro/BUILD/museek+-0.2/Mucipher/aes.cpp: In function 'int aes_set_key(void*, const u8*, unsigned int)': /tmp/B._cawro/BUILD/museek+-0.2/Mucipher/aes.cpp:280:23: warning: iteration 6 invokes undefined behavior [-Waggressive-loop-optimizations] E_KEY[8 * i + 12] = t; \ ^ /tmp/B._cawro/BUILD/museek+-0.2/Mucipher/aes.cpp:323:4: note: in expansion of macro 'loop8' loop8 (i); ^~~~~ /tmp/B._cawro/BUILD/museek+-0.2/Mucipher/aes.cpp:322:17: note: within this loop for (i = 0; i < 7; ++i) ~~^~~ make[2]: Leaving directory '/tmp/B._cawro/BUILD/museek+-0.2/build' make[2]: Entering directory '/tmp/B._cawro/BUILD/museek+-0.2/build' [ 18%] Generating moc_chatrooms.cxx cd /tmp/B._cawro/BUILD/museek+-0.2/build/museeq && /usr/lib/qt4/bin/moc @/tmp/B._cawro/BUILD/museek+-0.2/build/museeq/moc_chatrooms.cxx_parameters make[2]: Leaving directory '/tmp/B._cawro/BUILD/museek+-0.2/build' make[2]: Entering directory '/tmp/B._cawro/BUILD/museek+-0.2/build' [ 19%] Generating moc_chatroom.cxx cd /tmp/B._cawro/BUILD/museek+-0.2/build/museeq && /usr/lib/qt4/bin/moc @/tmp/B._cawro/BUILD/museek+-0.2/build/museeq/moc_chatroom.cxx_parameters make[2]: Leaving directory '/tmp/B._cawro/BUILD/museek+-0.2/build' make[2]: Entering directory '/tmp/B._cawro/BUILD/museek+-0.2/build' [ 20%] Generating moc_chatticker.cxx cd /tmp/B._cawro/BUILD/museek+-0.2/build/museeq && /usr/lib/qt4/bin/moc @/tmp/B._cawro/BUILD/museek+-0.2/build/museeq/moc_chatticker.cxx_parameters make[2]: Leaving directory '/tmp/B._cawro/BUILD/museek+-0.2/build' make[2]: Entering directory '/tmp/B._cawro/BUILD/museek+-0.2/build' [ 19%] Generating moc_chattext.cxx cd /tmp/B._cawro/BUILD/museek+-0.2/build/museeq && /usr/lib/qt4/bin/moc @/tmp/B._cawro/BUILD/museek+-0.2/build/museeq/moc_chattext.cxx_parameters make[2]: Leaving directory '/tmp/B._cawro/BUILD/museek+-0.2/build' make[2]: Entering directory '/tmp/B._cawro/BUILD/museek+-0.2/build' [ 20%] Generating moc_codeccombo.cxx cd /tmp/B._cawro/BUILD/museek+-0.2/build/museeq && /usr/lib/qt4/bin/moc @/tmp/B._cawro/BUILD/museek+-0.2/build/museeq/moc_codeccombo.cxx_parameters make[2]: Leaving directory '/tmp/B._cawro/BUILD/museek+-0.2/build' make[2]: Entering directory '/tmp/B._cawro/BUILD/museek+-0.2/build' [ 21%] Generating moc_iconlistbox.cxx cd /tmp/B._cawro/BUILD/museek+-0.2/build/museeq && /usr/lib/qt4/bin/moc @/tmp/B._cawro/BUILD/museek+-0.2/build/museeq/moc_iconlistbox.cxx_parameters make[2]: Leaving directory '/tmp/B._cawro/BUILD/museek+-0.2/build' make[2]: Entering directory '/tmp/B._cawro/BUILD/museek+-0.2/build' [ 21%] Generating moc_ignorelist.cxx cd /tmp/B._cawro/BUILD/museek+-0.2/build/museeq && /usr/lib/qt4/bin/moc @/tmp/B._cawro/BUILD/museek+-0.2/build/museeq/moc_ignorelist.cxx_parameters make[2]: Leaving directory '/tmp/B._cawro/BUILD/museek+-0.2/build' make[2]: Entering directory '/tmp/B._cawro/BUILD/museek+-0.2/build' [ 22%] Generating moc_interestlist.cxx cd /tmp/B._cawro/BUILD/museek+-0.2/build/museeq && /usr/lib/qt4/bin/moc @/tmp/B._cawro/BUILD/museek+-0.2/build/museeq/moc_interestlist.cxx_parameters make[2]: Leaving directory '/tmp/B._cawro/BUILD/museek+-0.2/build' make[2]: Entering directory '/tmp/B._cawro/BUILD/museek+-0.2/build' [ 23%] Generating moc_interests.cxx cd /tmp/B._cawro/BUILD/museek+-0.2/build/museeq && /usr/lib/qt4/bin/moc @/tmp/B._cawro/BUILD/museek+-0.2/build/museeq/moc_interests.cxx_parameters make[2]: Leaving directory '/tmp/B._cawro/BUILD/museek+-0.2/build' make[2]: Entering directory '/tmp/B._cawro/BUILD/museek+-0.2/build' [ 22%] Generating moc_mainwin.cxx cd /tmp/B._cawro/BUILD/museek+-0.2/build/museeq && /usr/lib/qt4/bin/moc @/tmp/B._cawro/BUILD/museek+-0.2/build/museeq/moc_mainwin.cxx_parameters make[2]: Leaving directory '/tmp/B._cawro/BUILD/museek+-0.2/build' make[2]: Entering directory '/tmp/B._cawro/BUILD/museek+-0.2/build' [ 22%] Generating moc_interestlistview.cxx cd /tmp/B._cawro/BUILD/museek+-0.2/build/museeq && /usr/lib/qt4/bin/moc @/tmp/B._cawro/BUILD/museek+-0.2/build/museeq/moc_interestlistview.cxx_parameters make[2]: Leaving directory '/tmp/B._cawro/BUILD/museek+-0.2/build' make[2]: Entering directory '/tmp/B._cawro/BUILD/museek+-0.2/build' [ 22%] Generating moc_ipdialog.cxx cd /tmp/B._cawro/BUILD/museek+-0.2/build/museeq && /usr/lib/qt4/bin/moc @/tmp/B._cawro/BUILD/museek+-0.2/build/museeq/moc_ipdialog.cxx_parameters make[2]: Leaving directory '/tmp/B._cawro/BUILD/museek+-0.2/build' make[2]: Entering directory '/tmp/B._cawro/BUILD/museek+-0.2/build' [ 6%] Building CXX object NewNet/CMakeFiles/NewNet.dir/nnlog.cpp.o cd /tmp/B._cawro/BUILD/museek+-0.2/build/NewNet && /usr/bin/i686-pld-linux-g++ -DHAVE_CONFIG_H -DHAVE_SYSTEM_H -DNN_PTR_DEBUG -DNN_PTR_DEBUG_ASSERT -I/tmp/B._cawro/BUILD/museek+-0.2/. -I/tmp/B._cawro/BUILD/museek+-0.2/build -O2 -fwrapv -pipe -Wformat -Werror=format-security -gdwarf-4 -fno-debug-types-section -fvar-tracking-assignments -g2 -Wp,-D_FORTIFY_SOURCE=2 -fstack-protector-strong --param=ssp-buffer-size=4 -fomit-frame-pointer -march=i686 -fasynchronous-unwind-tables -mtune=pentium4 -gdwarf-4 -fno-debug-types-section -fvar-tracking-assignments -g2 -std=c++0x -o CMakeFiles/NewNet.dir/nnlog.cpp.o -c /tmp/B._cawro/BUILD/museek+-0.2/NewNet/nnlog.cpp make[2]: Leaving directory '/tmp/B._cawro/BUILD/museek+-0.2/build' make[1]: *** [CMakeFiles/Makefile2:89: NewNet/CMakeFiles/NewNet.dir/all] Error 2 make[1]: *** Waiting for unfinished jobs.... make[2]: Entering directory '/tmp/B._cawro/BUILD/museek+-0.2/build' [ 12%] Building CXX object Mucipher/PyMucipher/CMakeFiles/_mucipherc.dir/__/sha256.cpp.o cd /tmp/B._cawro/BUILD/museek+-0.2/build/Mucipher/PyMucipher && /usr/bin/i686-pld-linux-g++ -DHAVE_CONFIG_H -DHAVE_SYSTEM_H -DNN_PTR_DEBUG -DNN_PTR_DEBUG_ASSERT -D_mucipherc_EXPORTS -I/tmp/B._cawro/BUILD/museek+-0.2/. -I/tmp/B._cawro/BUILD/museek+-0.2/build -I/usr/include/python2.7 -I/tmp/B._cawro/BUILD/museek+-0.2/Mucipher/PyMucipher -O2 -fwrapv -pipe -Wformat -Werror=format-security -gdwarf-4 -fno-debug-types-section -fvar-tracking-assignments -g2 -Wp,-D_FORTIFY_SOURCE=2 -fstack-protector-strong --param=ssp-buffer-size=4 -fomit-frame-pointer -march=i686 -fasynchronous-unwind-tables -mtune=pentium4 -gdwarf-4 -fno-debug-types-section -fvar-tracking-assignments -g2 -std=c++0x -fPIC -o CMakeFiles/_mucipherc.dir/__/sha256.cpp.o -c /tmp/B._cawro/BUILD/museek+-0.2/Mucipher/sha256.cpp make[2]: Leaving directory '/tmp/B._cawro/BUILD/museek+-0.2/build' make[2]: Entering directory '/tmp/B._cawro/BUILD/museek+-0.2/build' [ 8%] Building CXX object Mucipher/PyMucipher/CMakeFiles/_mucipherc.dir/mucipherPYTHON_wrap.cxx.o cd /tmp/B._cawro/BUILD/museek+-0.2/build/Mucipher/PyMucipher && /usr/bin/i686-pld-linux-g++ -DHAVE_CONFIG_H -DHAVE_SYSTEM_H -DNN_PTR_DEBUG -DNN_PTR_DEBUG_ASSERT -D_mucipherc_EXPORTS -I/tmp/B._cawro/BUILD/museek+-0.2/. -I/tmp/B._cawro/BUILD/museek+-0.2/build -I/usr/include/python2.7 -I/tmp/B._cawro/BUILD/museek+-0.2/Mucipher/PyMucipher -O2 -fwrapv -pipe -Wformat -Werror=format-security -gdwarf-4 -fno-debug-types-section -fvar-tracking-assignments -g2 -Wp,-D_FORTIFY_SOURCE=2 -fstack-protector-strong --param=ssp-buffer-size=4 -fomit-frame-pointer -march=i686 -fasynchronous-unwind-tables -mtune=pentium4 -gdwarf-4 -fno-debug-types-section -fvar-tracking-assignments -g2 -std=c++0x -fPIC -o CMakeFiles/_mucipherc.dir/mucipherPYTHON_wrap.cxx.o -c /tmp/B._cawro/BUILD/museek+-0.2/build/Mucipher/PyMucipher/mucipherPYTHON_wrap.cxx make[2]: Leaving directory '/tmp/B._cawro/BUILD/museek+-0.2/build' make[2]: Entering directory '/tmp/B._cawro/BUILD/museek+-0.2/build' [ 5%] Building CXX object muscan/CMakeFiles/Tools.dir/scanner.cc.o cd /tmp/B._cawro/BUILD/museek+-0.2/build/muscan && /usr/bin/i686-pld-linux-g++ -DHAVE_CONFIG_H -DHAVE_SYSTEM_H -DNN_PTR_DEBUG -DNN_PTR_DEBUG_ASSERT -I/tmp/B._cawro/BUILD/museek+-0.2/. -I/tmp/B._cawro/BUILD/museek+-0.2/build -O2 -fwrapv -pipe -Wformat -Werror=format-security -gdwarf-4 -fno-debug-types-section -fvar-tracking-assignments -g2 -Wp,-D_FORTIFY_SOURCE=2 -fstack-protector-strong --param=ssp-buffer-size=4 -fomit-frame-pointer -march=i686 -fasynchronous-unwind-tables -mtune=pentium4 -gdwarf-4 -fno-debug-types-section -fvar-tracking-assignments -g2 -std=c++0x -I/usr/include/libxml++-2.6 -I/usr/lib/libxml++-2.6/include -I/usr/include/libxml2 -I/usr/include/glibmm-2.4 -I/usr/lib/glibmm-2.4/include -I/usr/include/glib-2.0 -I/usr/lib/glib-2.0/include -I/usr/include/sigc++-2.0 -I/usr/lib/sigc++-2.0/include -o CMakeFiles/Tools.dir/scanner.cc.o -c /tmp/B._cawro/BUILD/museek+-0.2/muscan/scanner.cc make[2]: Leaving directory '/tmp/B._cawro/BUILD/museek+-0.2/build' make[2]: Entering directory '/tmp/B._cawro/BUILD/museek+-0.2/build' [ 24%] Generating moc_marquee.cxx cd /tmp/B._cawro/BUILD/museek+-0.2/build/museeq && /usr/lib/qt4/bin/moc @/tmp/B._cawro/BUILD/museek+-0.2/build/museeq/moc_marquee.cxx_parameters make[2]: Leaving directory '/tmp/B._cawro/BUILD/museek+-0.2/build' make[2]: Entering directory '/tmp/B._cawro/BUILD/museek+-0.2/build' [ 25%] Generating moc_onlinealert.cxx cd /tmp/B._cawro/BUILD/museek+-0.2/build/museeq && /usr/lib/qt4/bin/moc @/tmp/B._cawro/BUILD/museek+-0.2/build/museeq/moc_onlinealert.cxx_parameters make[2]: Leaving directory '/tmp/B._cawro/BUILD/museek+-0.2/build' make[2]: Entering directory '/tmp/B._cawro/BUILD/museek+-0.2/build' [ 26%] Generating moc_privatechat.cxx cd /tmp/B._cawro/BUILD/museek+-0.2/build/museeq && /usr/lib/qt4/bin/moc @/tmp/B._cawro/BUILD/museek+-0.2/build/museeq/moc_privatechat.cxx_parameters make[2]: Leaving directory '/tmp/B._cawro/BUILD/museek+-0.2/build' make[2]: Entering directory '/tmp/B._cawro/BUILD/museek+-0.2/build' [ 26%] Generating moc_privatechats.cxx cd /tmp/B._cawro/BUILD/museek+-0.2/build/museeq && /usr/lib/qt4/bin/moc @/tmp/B._cawro/BUILD/museek+-0.2/build/museeq/moc_privatechats.cxx_parameters make[2]: Leaving directory '/tmp/B._cawro/BUILD/museek+-0.2/build' make[2]: Entering directory '/tmp/B._cawro/BUILD/museek+-0.2/build' [ 25%] Generating moc_museeq.cxx cd /tmp/B._cawro/BUILD/museek+-0.2/build/museeq && /usr/lib/qt4/bin/moc @/tmp/B._cawro/BUILD/museek+-0.2/build/museeq/moc_museeq.cxx_parameters make[2]: Leaving directory '/tmp/B._cawro/BUILD/museek+-0.2/build' make[2]: Entering directory '/tmp/B._cawro/BUILD/museek+-0.2/build' [ 27%] Linking CXX static library libTools.a cd /tmp/B._cawro/BUILD/museek+-0.2/build/muscan && /usr/bin/cmake -P CMakeFiles/Tools.dir/cmake_clean_target.cmake cd /tmp/B._cawro/BUILD/museek+-0.2/build/muscan && /usr/bin/cmake -E cmake_link_script CMakeFiles/Tools.dir/link.txt --verbose=1 /usr/bin/ar qc libTools.a CMakeFiles/Tools.dir/mp3.c.o CMakeFiles/Tools.dir/scandir.cc.o CMakeFiles/Tools.dir/scanner.cc.o /usr/bin/ranlib libTools.a make[2]: Leaving directory '/tmp/B._cawro/BUILD/museek+-0.2/build' make[2]: Entering directory '/tmp/B._cawro/BUILD/museek+-0.2/build' [ 27%] Generating moc_roomlist.cxx cd /tmp/B._cawro/BUILD/museek+-0.2/build/museeq && /usr/lib/qt4/bin/moc @/tmp/B._cawro/BUILD/museek+-0.2/build/museeq/moc_roomlist.cxx_parameters make[2]: Leaving directory '/tmp/B._cawro/BUILD/museek+-0.2/build' make[1]: Entering directory '/tmp/B._cawro/BUILD/museek+-0.2/build' [ 29%] Built target Tools make[1]: Leaving directory '/tmp/B._cawro/BUILD/museek+-0.2/build' make[2]: Entering directory '/tmp/B._cawro/BUILD/museek+-0.2/build' [ 28%] Generating moc_search.cxx cd /tmp/B._cawro/BUILD/museek+-0.2/build/museeq && /usr/lib/qt4/bin/moc @/tmp/B._cawro/BUILD/museek+-0.2/build/museeq/moc_search.cxx_parameters make[2]: Leaving directory '/tmp/B._cawro/BUILD/museek+-0.2/build' make[2]: Entering directory '/tmp/B._cawro/BUILD/museek+-0.2/build' [ 27%] Generating moc_recommendsview.cxx cd /tmp/B._cawro/BUILD/museek+-0.2/build/museeq && /usr/lib/qt4/bin/moc @/tmp/B._cawro/BUILD/museek+-0.2/build/museeq/moc_recommendsview.cxx_parameters make[2]: Leaving directory '/tmp/B._cawro/BUILD/museek+-0.2/build' make[2]: Entering directory '/tmp/B._cawro/BUILD/museek+-0.2/build' [ 29%] Generating moc_searches.cxx cd /tmp/B._cawro/BUILD/museek+-0.2/build/museeq && /usr/lib/qt4/bin/moc @/tmp/B._cawro/BUILD/museek+-0.2/build/museeq/moc_searches.cxx_parameters make[2]: Leaving directory '/tmp/B._cawro/BUILD/museek+-0.2/build' make[2]: Entering directory '/tmp/B._cawro/BUILD/museek+-0.2/build' [ 28%] Generating moc_roomlistview.cxx cd /tmp/B._cawro/BUILD/museek+-0.2/build/museeq && /usr/lib/qt4/bin/moc @/tmp/B._cawro/BUILD/museek+-0.2/build/museeq/moc_roomlistview.cxx_parameters make[2]: Leaving directory '/tmp/B._cawro/BUILD/museek+-0.2/build' make[2]: Entering directory '/tmp/B._cawro/BUILD/museek+-0.2/build' [ 31%] Generating moc_tabwidget.cxx cd /tmp/B._cawro/BUILD/museek+-0.2/build/museeq && /usr/lib/qt4/bin/moc @/tmp/B._cawro/BUILD/museek+-0.2/build/museeq/moc_tabwidget.cxx_parameters make[2]: Leaving directory '/tmp/B._cawro/BUILD/museek+-0.2/build' make[2]: Entering directory '/tmp/B._cawro/BUILD/museek+-0.2/build' [ 31%] Generating moc_tickerdialog.cxx cd /tmp/B._cawro/BUILD/museek+-0.2/build/museeq && /usr/lib/qt4/bin/moc @/tmp/B._cawro/BUILD/museek+-0.2/build/museeq/moc_tickerdialog.cxx_parameters make[2]: Leaving directory '/tmp/B._cawro/BUILD/museek+-0.2/build' make[2]: Entering directory '/tmp/B._cawro/BUILD/museek+-0.2/build' [ 31%] Generating moc_settingsdialog.cxx cd /tmp/B._cawro/BUILD/museek+-0.2/build/museeq && /usr/lib/qt4/bin/moc @/tmp/B._cawro/BUILD/museek+-0.2/build/museeq/moc_settingsdialog.cxx_parameters make[2]: Leaving directory '/tmp/B._cawro/BUILD/museek+-0.2/build' make[2]: Entering directory '/tmp/B._cawro/BUILD/museek+-0.2/build' [ 30%] Generating moc_searchlistview.cxx cd /tmp/B._cawro/BUILD/museek+-0.2/build/museeq && /usr/lib/qt4/bin/moc @/tmp/B._cawro/BUILD/museek+-0.2/build/museeq/moc_searchlistview.cxx_parameters make[2]: Leaving directory '/tmp/B._cawro/BUILD/museek+-0.2/build' make[2]: Entering directory '/tmp/B._cawro/BUILD/museek+-0.2/build' [ 32%] Generating moc_transferlistview.cxx cd /tmp/B._cawro/BUILD/museek+-0.2/build/museeq && /usr/lib/qt4/bin/moc @/tmp/B._cawro/BUILD/museek+-0.2/build/museeq/moc_transferlistview.cxx_parameters make[2]: Leaving directory '/tmp/B._cawro/BUILD/museek+-0.2/build' make[2]: Entering directory '/tmp/B._cawro/BUILD/museek+-0.2/build' [ 33%] Generating moc_trustlist.cxx cd /tmp/B._cawro/BUILD/museek+-0.2/build/museeq && /usr/lib/qt4/bin/moc @/tmp/B._cawro/BUILD/museek+-0.2/build/museeq/moc_trustlist.cxx_parameters make[2]: Leaving directory '/tmp/B._cawro/BUILD/museek+-0.2/build' make[2]: Entering directory '/tmp/B._cawro/BUILD/museek+-0.2/build' [ 32%] Generating moc_transfers.cxx cd /tmp/B._cawro/BUILD/museek+-0.2/build/museeq && /usr/lib/qt4/bin/moc @/tmp/B._cawro/BUILD/museek+-0.2/build/museeq/moc_transfers.cxx_parameters make[2]: Leaving directory '/tmp/B._cawro/BUILD/museek+-0.2/build' make[2]: Entering directory '/tmp/B._cawro/BUILD/museek+-0.2/build' [ 27%] Linking CXX shared module _mucipherc.so cd /tmp/B._cawro/BUILD/museek+-0.2/build/Mucipher/PyMucipher && /usr/bin/cmake -E cmake_link_script CMakeFiles/_mucipherc.dir/link.txt --verbose=1 /usr/bin/i686-pld-linux-g++ -fPIC -O2 -fwrapv -pipe -Wformat -Werror=format-security -gdwarf-4 -fno-debug-types-section -fvar-tracking-assignments -g2 -Wp,-D_FORTIFY_SOURCE=2 -fstack-protector-strong --param=ssp-buffer-size=4 -fomit-frame-pointer -march=i686 -fasynchronous-unwind-tables -mtune=pentium4 -gdwarf-4 -fno-debug-types-section -fvar-tracking-assignments -g2 -std=c++0x -Wl,--as-needed -Wl,--no-copy-dt-needed-entries -Wl,-z,relro -Wl,-z,combreloc -shared -o _mucipherc.so CMakeFiles/_mucipherc.dir/mucipherPYTHON_wrap.cxx.o CMakeFiles/_mucipherc.dir/__/aes.cpp.o CMakeFiles/_mucipherc.dir/__/hexdigest.cpp.o CMakeFiles/_mucipherc.dir/__/md5.cpp.o CMakeFiles/_mucipherc.dir/__/sha.cpp.o CMakeFiles/_mucipherc.dir/__/sha256.cpp.o CMakeFiles/_mucipherc.dir/__/wraphelp.cpp.o -lpython2.7 make[2]: Leaving directory '/tmp/B._cawro/BUILD/museek+-0.2/build' make[2]: Entering directory '/tmp/B._cawro/BUILD/museek+-0.2/build' [ 34%] Generating moc_userinfos.cxx cd /tmp/B._cawro/BUILD/museek+-0.2/build/museeq && /usr/lib/qt4/bin/moc @/tmp/B._cawro/BUILD/museek+-0.2/build/museeq/moc_userinfos.cxx_parameters make[2]: Leaving directory '/tmp/B._cawro/BUILD/museek+-0.2/build' make[1]: Entering directory '/tmp/B._cawro/BUILD/museek+-0.2/build' [ 35%] Built target _mucipherc make[1]: Leaving directory '/tmp/B._cawro/BUILD/museek+-0.2/build' make[2]: Entering directory '/tmp/B._cawro/BUILD/museek+-0.2/build' [ 35%] Generating moc_userlistview.cxx cd /tmp/B._cawro/BUILD/museek+-0.2/build/museeq && /usr/lib/qt4/bin/moc @/tmp/B._cawro/BUILD/museek+-0.2/build/museeq/moc_userlistview.cxx_parameters make[2]: Leaving directory '/tmp/B._cawro/BUILD/museek+-0.2/build' make[2]: Entering directory '/tmp/B._cawro/BUILD/museek+-0.2/build' [ 36%] Generating moc_wishlist.cxx cd /tmp/B._cawro/BUILD/museek+-0.2/build/museeq && /usr/lib/qt4/bin/moc @/tmp/B._cawro/BUILD/museek+-0.2/build/museeq/moc_wishlist.cxx_parameters make[2]: Leaving directory '/tmp/B._cawro/BUILD/museek+-0.2/build' make[2]: Entering directory '/tmp/B._cawro/BUILD/museek+-0.2/build' [ 36%] Generating moc_usertabwidget.cxx cd /tmp/B._cawro/BUILD/museek+-0.2/build/museeq && /usr/lib/qt4/bin/moc @/tmp/B._cawro/BUILD/museek+-0.2/build/museeq/moc_usertabwidget.cxx_parameters make[2]: Leaving directory '/tmp/B._cawro/BUILD/museek+-0.2/build' make[2]: Entering directory '/tmp/B._cawro/BUILD/museek+-0.2/build' [ 29%] Generating moc_searchfilter.cxx cd /tmp/B._cawro/BUILD/museek+-0.2/build/museeq && /usr/lib/qt4/bin/moc @/tmp/B._cawro/BUILD/museek+-0.2/build/museeq/moc_searchfilter.cxx_parameters make[2]: Leaving directory '/tmp/B._cawro/BUILD/museek+-0.2/build' make[2]: Entering directory '/tmp/B._cawro/BUILD/museek+-0.2/build' [ 33%] Generating moc_userinfo.cxx cd /tmp/B._cawro/BUILD/museek+-0.2/build/museeq && /usr/lib/qt4/bin/moc @/tmp/B._cawro/BUILD/museek+-0.2/build/museeq/moc_userinfo.cxx_parameters make[2]: Leaving directory '/tmp/B._cawro/BUILD/museek+-0.2/build' make[2]: Entering directory '/tmp/B._cawro/BUILD/museek+-0.2/build' [ 24%] Generating moc_museekdriver.cxx cd /tmp/B._cawro/BUILD/museek+-0.2/build/museeq && /usr/lib/qt4/bin/moc @/tmp/B._cawro/BUILD/museek+-0.2/build/museeq/moc_museekdriver.cxx_parameters make[2]: Leaving directory '/tmp/B._cawro/BUILD/museek+-0.2/build' make[2]: Entering directory '/tmp/B._cawro/BUILD/museek+-0.2/build' [ 32%] Generating moc_transferlistitemprogress.cxx cd /tmp/B._cawro/BUILD/museek+-0.2/build/museeq && /usr/lib/qt4/bin/moc @/tmp/B._cawro/BUILD/museek+-0.2/build/museeq/moc_transferlistitemprogress.cxx_parameters make[2]: Leaving directory '/tmp/B._cawro/BUILD/museek+-0.2/build' make[2]: Entering directory '/tmp/B._cawro/BUILD/museek+-0.2/build' [ 35%] Generating moc_usermenu.cxx cd /tmp/B._cawro/BUILD/museek+-0.2/build/museeq && /usr/lib/qt4/bin/moc @/tmp/B._cawro/BUILD/museek+-0.2/build/museeq/moc_usermenu.cxx_parameters make[2]: Leaving directory '/tmp/B._cawro/BUILD/museek+-0.2/build' make[2]: Entering directory '/tmp/B._cawro/BUILD/museek+-0.2/build' [ 28%] Generating moc_script.cxx cd /tmp/B._cawro/BUILD/museek+-0.2/build/museeq && /usr/lib/qt4/bin/moc @/tmp/B._cawro/BUILD/museek+-0.2/build/museeq/moc_script.cxx_parameters make[2]: Leaving directory '/tmp/B._cawro/BUILD/museek+-0.2/build' make[2]: Entering directory '/tmp/B._cawro/BUILD/museek+-0.2/build' cd /tmp/B._cawro/BUILD/museek+-0.2/build && /usr/bin/cmake -E cmake_depends "Unix Makefiles" /tmp/B._cawro/BUILD/museek+-0.2 /tmp/B._cawro/BUILD/museek+-0.2/museeq /tmp/B._cawro/BUILD/museek+-0.2/build /tmp/B._cawro/BUILD/museek+-0.2/build/museeq /tmp/B._cawro/BUILD/museek+-0.2/build/museeq/CMakeFiles/museeq.dir/DependInfo.cmake --color= Scanning dependencies of target museeq make[2]: Leaving directory '/tmp/B._cawro/BUILD/museek+-0.2/build' /usr/bin/make -f museeq/CMakeFiles/museeq.dir/build.make museeq/CMakeFiles/museeq.dir/build make[2]: Entering directory '/tmp/B._cawro/BUILD/museek+-0.2/build' [ 38%] Building CXX object museeq/CMakeFiles/museeq.dir/browsers.cpp.o cd /tmp/B._cawro/BUILD/museek+-0.2/build/museeq && /usr/bin/i686-pld-linux-g++ -DDATADIR=\"\"\"/usr/share\"\"\" -DHAVE_CONFIG_H -DHAVE_QTSCRIPT=1 -DHAVE_QTUITOOLS=1 -DHAVE_SYSTEM_H -DNN_PTR_DEBUG -DNN_PTR_DEBUG_ASSERT -DQT_CORE_LIB -DQT_GUI_LIB -DQT_NETWORK_LIB -DQT_NO_DEBUG -DQT_SCRIPT_LIB -DQT_UITOOLS_LIB -I/tmp/B._cawro/BUILD/museek+-0.2/. -I/tmp/B._cawro/BUILD/museek+-0.2/build -I/tmp/B._cawro/BUILD/museek+-0.2/museeq/. -isystem /usr/include/qt4 -isystem /usr/include/qt4/QtScript -isystem /usr/include/qt4/QtUiTools -isystem /usr/include/qt4/QtGui -isystem /usr/include/qt4/QtNetwork -isystem /usr/include/qt4/QtCore -O2 -fwrapv -pipe -Wformat -Werror=format-security -gdwarf-4 -fno-debug-types-section -fvar-tracking-assignments -g2 -Wp,-D_FORTIFY_SOURCE=2 -fstack-protector-strong --param=ssp-buffer-size=4 -fomit-frame-pointer -march=i686 -fasynchronous-unwind-tables -mtune=pentium4 -gdwarf-4 -fno-debug-types-section -fvar-tracking-assignments -g2 -std=c++0x -o CMakeFiles/museeq.dir/browsers.cpp.o -c /tmp/B._cawro/BUILD/museek+-0.2/museeq/browsers.cpp make[2]: Leaving directory '/tmp/B._cawro/BUILD/museek+-0.2/build' make[2]: Entering directory '/tmp/B._cawro/BUILD/museek+-0.2/build' [ 39%] Building CXX object museeq/CMakeFiles/museeq.dir/chatpanel.cpp.o cd /tmp/B._cawro/BUILD/museek+-0.2/build/museeq && /usr/bin/i686-pld-linux-g++ -DDATADIR=\"\"\"/usr/share\"\"\" -DHAVE_CONFIG_H -DHAVE_QTSCRIPT=1 -DHAVE_QTUITOOLS=1 -DHAVE_SYSTEM_H -DNN_PTR_DEBUG -DNN_PTR_DEBUG_ASSERT -DQT_CORE_LIB -DQT_GUI_LIB -DQT_NETWORK_LIB -DQT_NO_DEBUG -DQT_SCRIPT_LIB -DQT_UITOOLS_LIB -I/tmp/B._cawro/BUILD/museek+-0.2/. -I/tmp/B._cawro/BUILD/museek+-0.2/build -I/tmp/B._cawro/BUILD/museek+-0.2/museeq/. -isystem /usr/include/qt4 -isystem /usr/include/qt4/QtScript -isystem /usr/include/qt4/QtUiTools -isystem /usr/include/qt4/QtGui -isystem /usr/include/qt4/QtNetwork -isystem /usr/include/qt4/QtCore -O2 -fwrapv -pipe -Wformat -Werror=format-security -gdwarf-4 -fno-debug-types-section -fvar-tracking-assignments -g2 -Wp,-D_FORTIFY_SOURCE=2 -fstack-protector-strong --param=ssp-buffer-size=4 -fomit-frame-pointer -march=i686 -fasynchronous-unwind-tables -mtune=pentium4 -gdwarf-4 -fno-debug-types-section -fvar-tracking-assignments -g2 -std=c++0x -o CMakeFiles/museeq.dir/chatpanel.cpp.o -c /tmp/B._cawro/BUILD/museek+-0.2/museeq/chatpanel.cpp make[2]: Leaving directory '/tmp/B._cawro/BUILD/museek+-0.2/build' make[2]: Entering directory '/tmp/B._cawro/BUILD/museek+-0.2/build' [ 40%] Building CXX object museeq/CMakeFiles/museeq.dir/chatrooms.cpp.o cd /tmp/B._cawro/BUILD/museek+-0.2/build/museeq && /usr/bin/i686-pld-linux-g++ -DDATADIR=\"\"\"/usr/share\"\"\" -DHAVE_CONFIG_H -DHAVE_QTSCRIPT=1 -DHAVE_QTUITOOLS=1 -DHAVE_SYSTEM_H -DNN_PTR_DEBUG -DNN_PTR_DEBUG_ASSERT -DQT_CORE_LIB -DQT_GUI_LIB -DQT_NETWORK_LIB -DQT_NO_DEBUG -DQT_SCRIPT_LIB -DQT_UITOOLS_LIB -I/tmp/B._cawro/BUILD/museek+-0.2/. -I/tmp/B._cawro/BUILD/museek+-0.2/build -I/tmp/B._cawro/BUILD/museek+-0.2/museeq/. -isystem /usr/include/qt4 -isystem /usr/include/qt4/QtScript -isystem /usr/include/qt4/QtUiTools -isystem /usr/include/qt4/QtGui -isystem /usr/include/qt4/QtNetwork -isystem /usr/include/qt4/QtCore -O2 -fwrapv -pipe -Wformat -Werror=format-security -gdwarf-4 -fno-debug-types-section -fvar-tracking-assignments -g2 -Wp,-D_FORTIFY_SOURCE=2 -fstack-protector-strong --param=ssp-buffer-size=4 -fomit-frame-pointer -march=i686 -fasynchronous-unwind-tables -mtune=pentium4 -gdwarf-4 -fno-debug-types-section -fvar-tracking-assignments -g2 -std=c++0x -o CMakeFiles/museeq.dir/chatrooms.cpp.o -c /tmp/B._cawro/BUILD/museek+-0.2/museeq/chatrooms.cpp /tmp/B._cawro/BUILD/museek+-0.2/museeq/chatrooms.cpp: In member function 'void ChatRooms::joined(const QString&, const NRoom&)': /tmp/B._cawro/BUILD/museek+-0.2/museeq/chatrooms.cpp:58:50: error: no matching function for call to 'ChatRoom::ChatRoom(const QString&, ChatRooms*, bool)' ChatRoom* _room = new ChatRoom(room, this, false); ^ In file included from /tmp/B._cawro/BUILD/museek+-0.2/museeq/chatrooms.cpp:24:0: /tmp/B._cawro/BUILD/museek+-0.2/museeq/chatroom.h:37:2: note: candidate: ChatRoom::ChatRoom(QString, QWidget*, QString) ChatRoom(const QString, QWidget * = 0, const QString = "ChatRoom"); ^~~~~~~~ /tmp/B._cawro/BUILD/museek+-0.2/museeq/chatroom.h:37:2: note: no known conversion for argument 3 from 'bool' to 'QString' make[2]: *** [museeq/CMakeFiles/museeq.dir/build.make:500: museeq/CMakeFiles/museeq.dir/chatrooms.cpp.o] Error 1 make[2]: Leaving directory '/tmp/B._cawro/BUILD/museek+-0.2/build' make[2]: *** Waiting for unfinished jobs.... make[2]: Entering directory '/tmp/B._cawro/BUILD/museek+-0.2/build' [ 38%] Building CXX object museeq/CMakeFiles/museeq.dir/buddylist.cpp.o cd /tmp/B._cawro/BUILD/museek+-0.2/build/museeq && /usr/bin/i686-pld-linux-g++ -DDATADIR=\"\"\"/usr/share\"\"\" -DHAVE_CONFIG_H -DHAVE_QTSCRIPT=1 -DHAVE_QTUITOOLS=1 -DHAVE_SYSTEM_H -DNN_PTR_DEBUG -DNN_PTR_DEBUG_ASSERT -DQT_CORE_LIB -DQT_GUI_LIB -DQT_NETWORK_LIB -DQT_NO_DEBUG -DQT_SCRIPT_LIB -DQT_UITOOLS_LIB -I/tmp/B._cawro/BUILD/museek+-0.2/. -I/tmp/B._cawro/BUILD/museek+-0.2/build -I/tmp/B._cawro/BUILD/museek+-0.2/museeq/. -isystem /usr/include/qt4 -isystem /usr/include/qt4/QtScript -isystem /usr/include/qt4/QtUiTools -isystem /usr/include/qt4/QtGui -isystem /usr/include/qt4/QtNetwork -isystem /usr/include/qt4/QtCore -O2 -fwrapv -pipe -Wformat -Werror=format-security -gdwarf-4 -fno-debug-types-section -fvar-tracking-assignments -g2 -Wp,-D_FORTIFY_SOURCE=2 -fstack-protector-strong --param=ssp-buffer-size=4 -fomit-frame-pointer -march=i686 -fasynchronous-unwind-tables -mtune=pentium4 -gdwarf-4 -fno-debug-types-section -fvar-tracking-assignments -g2 -std=c++0x -o CMakeFiles/museeq.dir/buddylist.cpp.o -c /tmp/B._cawro/BUILD/museek+-0.2/museeq/buddylist.cpp make[2]: Leaving directory '/tmp/B._cawro/BUILD/museek+-0.2/build' make[2]: Entering directory '/tmp/B._cawro/BUILD/museek+-0.2/build' [ 37%] Building CXX object museeq/CMakeFiles/museeq.dir/banlist.cpp.o cd /tmp/B._cawro/BUILD/museek+-0.2/build/museeq && /usr/bin/i686-pld-linux-g++ -DDATADIR=\"\"\"/usr/share\"\"\" -DHAVE_CONFIG_H -DHAVE_QTSCRIPT=1 -DHAVE_QTUITOOLS=1 -DHAVE_SYSTEM_H -DNN_PTR_DEBUG -DNN_PTR_DEBUG_ASSERT -DQT_CORE_LIB -DQT_GUI_LIB -DQT_NETWORK_LIB -DQT_NO_DEBUG -DQT_SCRIPT_LIB -DQT_UITOOLS_LIB -I/tmp/B._cawro/BUILD/museek+-0.2/. -I/tmp/B._cawro/BUILD/museek+-0.2/build -I/tmp/B._cawro/BUILD/museek+-0.2/museeq/. -isystem /usr/include/qt4 -isystem /usr/include/qt4/QtScript -isystem /usr/include/qt4/QtUiTools -isystem /usr/include/qt4/QtGui -isystem /usr/include/qt4/QtNetwork -isystem /usr/include/qt4/QtCore -O2 -fwrapv -pipe -Wformat -Werror=format-security -gdwarf-4 -fno-debug-types-section -fvar-tracking-assignments -g2 -Wp,-D_FORTIFY_SOURCE=2 -fstack-protector-strong --param=ssp-buffer-size=4 -fomit-frame-pointer -march=i686 -fasynchronous-unwind-tables -mtune=pentium4 -gdwarf-4 -fno-debug-types-section -fvar-tracking-assignments -g2 -std=c++0x -o CMakeFiles/museeq.dir/banlist.cpp.o -c /tmp/B._cawro/BUILD/museek+-0.2/museeq/banlist.cpp make[2]: Leaving directory '/tmp/B._cawro/BUILD/museek+-0.2/build' make[2]: Entering directory '/tmp/B._cawro/BUILD/museek+-0.2/build' [ 36%] Building CXX object museeq/CMakeFiles/museeq.dir/aclineedit.cpp.o cd /tmp/B._cawro/BUILD/museek+-0.2/build/museeq && /usr/bin/i686-pld-linux-g++ -DDATADIR=\"\"\"/usr/share\"\"\" -DHAVE_CONFIG_H -DHAVE_QTSCRIPT=1 -DHAVE_QTUITOOLS=1 -DHAVE_SYSTEM_H -DNN_PTR_DEBUG -DNN_PTR_DEBUG_ASSERT -DQT_CORE_LIB -DQT_GUI_LIB -DQT_NETWORK_LIB -DQT_NO_DEBUG -DQT_SCRIPT_LIB -DQT_UITOOLS_LIB -I/tmp/B._cawro/BUILD/museek+-0.2/. -I/tmp/B._cawro/BUILD/museek+-0.2/build -I/tmp/B._cawro/BUILD/museek+-0.2/museeq/. -isystem /usr/include/qt4 -isystem /usr/include/qt4/QtScript -isystem /usr/include/qt4/QtUiTools -isystem /usr/include/qt4/QtGui -isystem /usr/include/qt4/QtNetwork -isystem /usr/include/qt4/QtCore -O2 -fwrapv -pipe -Wformat -Werror=format-security -gdwarf-4 -fno-debug-types-section -fvar-tracking-assignments -g2 -Wp,-D_FORTIFY_SOURCE=2 -fstack-protector-strong --param=ssp-buffer-size=4 -fomit-frame-pointer -march=i686 -fasynchronous-unwind-tables -mtune=pentium4 -gdwarf-4 -fno-debug-types-section -fvar-tracking-assignments -g2 -std=c++0x -o CMakeFiles/museeq.dir/aclineedit.cpp.o -c /tmp/B._cawro/BUILD/museek+-0.2/museeq/aclineedit.cpp make[2]: Leaving directory '/tmp/B._cawro/BUILD/museek+-0.2/build' make[2]: Entering directory '/tmp/B._cawro/BUILD/museek+-0.2/build' [ 40%] Building CXX object museeq/CMakeFiles/museeq.dir/chattext.cpp.o cd /tmp/B._cawro/BUILD/museek+-0.2/build/museeq && /usr/bin/i686-pld-linux-g++ -DDATADIR=\"\"\"/usr/share\"\"\" -DHAVE_CONFIG_H -DHAVE_QTSCRIPT=1 -DHAVE_QTUITOOLS=1 -DHAVE_SYSTEM_H -DNN_PTR_DEBUG -DNN_PTR_DEBUG_ASSERT -DQT_CORE_LIB -DQT_GUI_LIB -DQT_NETWORK_LIB -DQT_NO_DEBUG -DQT_SCRIPT_LIB -DQT_UITOOLS_LIB -I/tmp/B._cawro/BUILD/museek+-0.2/. -I/tmp/B._cawro/BUILD/museek+-0.2/build -I/tmp/B._cawro/BUILD/museek+-0.2/museeq/. -isystem /usr/include/qt4 -isystem /usr/include/qt4/QtScript -isystem /usr/include/qt4/QtUiTools -isystem /usr/include/qt4/QtGui -isystem /usr/include/qt4/QtNetwork -isystem /usr/include/qt4/QtCore -O2 -fwrapv -pipe -Wformat -Werror=format-security -gdwarf-4 -fno-debug-types-section -fvar-tracking-assignments -g2 -Wp,-D_FORTIFY_SOURCE=2 -fstack-protector-strong --param=ssp-buffer-size=4 -fomit-frame-pointer -march=i686 -fasynchronous-unwind-tables -mtune=pentium4 -gdwarf-4 -fno-debug-types-section -fvar-tracking-assignments -g2 -std=c++0x -o CMakeFiles/museeq.dir/chattext.cpp.o -c /tmp/B._cawro/BUILD/museek+-0.2/museeq/chattext.cpp make[2]: Leaving directory '/tmp/B._cawro/BUILD/museek+-0.2/build' make[2]: Entering directory '/tmp/B._cawro/BUILD/museek+-0.2/build' [ 40%] Building CXX object museeq/CMakeFiles/museeq.dir/chatticker.cpp.o cd /tmp/B._cawro/BUILD/museek+-0.2/build/museeq && /usr/bin/i686-pld-linux-g++ -DDATADIR=\"\"\"/usr/share\"\"\" -DHAVE_CONFIG_H -DHAVE_QTSCRIPT=1 -DHAVE_QTUITOOLS=1 -DHAVE_SYSTEM_H -DNN_PTR_DEBUG -DNN_PTR_DEBUG_ASSERT -DQT_CORE_LIB -DQT_GUI_LIB -DQT_NETWORK_LIB -DQT_NO_DEBUG -DQT_SCRIPT_LIB -DQT_UITOOLS_LIB -I/tmp/B._cawro/BUILD/museek+-0.2/. -I/tmp/B._cawro/BUILD/museek+-0.2/build -I/tmp/B._cawro/BUILD/museek+-0.2/museeq/. -isystem /usr/include/qt4 -isystem /usr/include/qt4/QtScript -isystem /usr/include/qt4/QtUiTools -isystem /usr/include/qt4/QtGui -isystem /usr/include/qt4/QtNetwork -isystem /usr/include/qt4/QtCore -O2 -fwrapv -pipe -Wformat -Werror=format-security -gdwarf-4 -fno-debug-types-section -fvar-tracking-assignments -g2 -Wp,-D_FORTIFY_SOURCE=2 -fstack-protector-strong --param=ssp-buffer-size=4 -fomit-frame-pointer -march=i686 -fasynchronous-unwind-tables -mtune=pentium4 -gdwarf-4 -fno-debug-types-section -fvar-tracking-assignments -g2 -std=c++0x -o CMakeFiles/museeq.dir/chatticker.cpp.o -c /tmp/B._cawro/BUILD/museek+-0.2/museeq/chatticker.cpp make[2]: Leaving directory '/tmp/B._cawro/BUILD/museek+-0.2/build' make[2]: Entering directory '/tmp/B._cawro/BUILD/museek+-0.2/build' [ 41%] Building CXX object museeq/CMakeFiles/museeq.dir/codeccombo.cpp.o cd /tmp/B._cawro/BUILD/museek+-0.2/build/museeq && /usr/bin/i686-pld-linux-g++ -DDATADIR=\"\"\"/usr/share\"\"\" -DHAVE_CONFIG_H -DHAVE_QTSCRIPT=1 -DHAVE_QTUITOOLS=1 -DHAVE_SYSTEM_H -DNN_PTR_DEBUG -DNN_PTR_DEBUG_ASSERT -DQT_CORE_LIB -DQT_GUI_LIB -DQT_NETWORK_LIB -DQT_NO_DEBUG -DQT_SCRIPT_LIB -DQT_UITOOLS_LIB -I/tmp/B._cawro/BUILD/museek+-0.2/. -I/tmp/B._cawro/BUILD/museek+-0.2/build -I/tmp/B._cawro/BUILD/museek+-0.2/museeq/. -isystem /usr/include/qt4 -isystem /usr/include/qt4/QtScript -isystem /usr/include/qt4/QtUiTools -isystem /usr/include/qt4/QtGui -isystem /usr/include/qt4/QtNetwork -isystem /usr/include/qt4/QtCore -O2 -fwrapv -pipe -Wformat -Werror=format-security -gdwarf-4 -fno-debug-types-section -fvar-tracking-assignments -g2 -Wp,-D_FORTIFY_SOURCE=2 -fstack-protector-strong --param=ssp-buffer-size=4 -fomit-frame-pointer -march=i686 -fasynchronous-unwind-tables -mtune=pentium4 -gdwarf-4 -fno-debug-types-section -fvar-tracking-assignments -g2 -std=c++0x -o CMakeFiles/museeq.dir/codeccombo.cpp.o -c /tmp/B._cawro/BUILD/museek+-0.2/museeq/codeccombo.cpp make[2]: Leaving directory '/tmp/B._cawro/BUILD/museek+-0.2/build' make[2]: Entering directory '/tmp/B._cawro/BUILD/museek+-0.2/build' [ 39%] Building CXX object museeq/CMakeFiles/museeq.dir/chatroom.cpp.o cd /tmp/B._cawro/BUILD/museek+-0.2/build/museeq && /usr/bin/i686-pld-linux-g++ -DDATADIR=\"\"\"/usr/share\"\"\" -DHAVE_CONFIG_H -DHAVE_QTSCRIPT=1 -DHAVE_QTUITOOLS=1 -DHAVE_SYSTEM_H -DNN_PTR_DEBUG -DNN_PTR_DEBUG_ASSERT -DQT_CORE_LIB -DQT_GUI_LIB -DQT_NETWORK_LIB -DQT_NO_DEBUG -DQT_SCRIPT_LIB -DQT_UITOOLS_LIB -I/tmp/B._cawro/BUILD/museek+-0.2/. -I/tmp/B._cawro/BUILD/museek+-0.2/build -I/tmp/B._cawro/BUILD/museek+-0.2/museeq/. -isystem /usr/include/qt4 -isystem /usr/include/qt4/QtScript -isystem /usr/include/qt4/QtUiTools -isystem /usr/include/qt4/QtGui -isystem /usr/include/qt4/QtNetwork -isystem /usr/include/qt4/QtCore -O2 -fwrapv -pipe -Wformat -Werror=format-security -gdwarf-4 -fno-debug-types-section -fvar-tracking-assignments -g2 -Wp,-D_FORTIFY_SOURCE=2 -fstack-protector-strong --param=ssp-buffer-size=4 -fomit-frame-pointer -march=i686 -fasynchronous-unwind-tables -mtune=pentium4 -gdwarf-4 -fno-debug-types-section -fvar-tracking-assignments -g2 -std=c++0x -o CMakeFiles/museeq.dir/chatroom.cpp.o -c /tmp/B._cawro/BUILD/museek+-0.2/museeq/chatroom.cpp make[2]: Leaving directory '/tmp/B._cawro/BUILD/museek+-0.2/build' make[2]: Entering directory '/tmp/B._cawro/BUILD/museek+-0.2/build' [ 37%] Building CXX object museeq/CMakeFiles/museeq.dir/browser.cpp.o cd /tmp/B._cawro/BUILD/museek+-0.2/build/museeq && /usr/bin/i686-pld-linux-g++ -DDATADIR=\"\"\"/usr/share\"\"\" -DHAVE_CONFIG_H -DHAVE_QTSCRIPT=1 -DHAVE_QTUITOOLS=1 -DHAVE_SYSTEM_H -DNN_PTR_DEBUG -DNN_PTR_DEBUG_ASSERT -DQT_CORE_LIB -DQT_GUI_LIB -DQT_NETWORK_LIB -DQT_NO_DEBUG -DQT_SCRIPT_LIB -DQT_UITOOLS_LIB -I/tmp/B._cawro/BUILD/museek+-0.2/. -I/tmp/B._cawro/BUILD/museek+-0.2/build -I/tmp/B._cawro/BUILD/museek+-0.2/museeq/. -isystem /usr/include/qt4 -isystem /usr/include/qt4/QtScript -isystem /usr/include/qt4/QtUiTools -isystem /usr/include/qt4/QtGui -isystem /usr/include/qt4/QtNetwork -isystem /usr/include/qt4/QtCore -O2 -fwrapv -pipe -Wformat -Werror=format-security -gdwarf-4 -fno-debug-types-section -fvar-tracking-assignments -g2 -Wp,-D_FORTIFY_SOURCE=2 -fstack-protector-strong --param=ssp-buffer-size=4 -fomit-frame-pointer -march=i686 -fasynchronous-unwind-tables -mtune=pentium4 -gdwarf-4 -fno-debug-types-section -fvar-tracking-assignments -g2 -std=c++0x -o CMakeFiles/museeq.dir/browser.cpp.o -c /tmp/B._cawro/BUILD/museek+-0.2/museeq/browser.cpp make[2]: Leaving directory '/tmp/B._cawro/BUILD/museek+-0.2/build' make[1]: *** [CMakeFiles/Makefile2:593: museeq/CMakeFiles/museeq.dir/all] Error 2 make: *** [Makefile:131: all] Error 2 error: Bad exit status from /tmp/B._cawro/BUILD/tmp/rpm-tmp.18932 (%build) RPM build errors: Bad exit status from /tmp/B._cawro/BUILD/tmp/rpm-tmp.18932 (%build) ended at: Thu Apr 13 20:34:30 2017, done in 0:00:18.760325 error: No files produced. + chmod -R u+rwX /tmp/B._cawro/BUILD + rm -rf /tmp/B._cawro/tmp /tmp/B._cawro/BUILD + rm -rf /tmp/B._cawro Begin-PLD-Builder-Info Build-Time: user:33.11s sys:3.06s real:24.37s (faults io:0 non-io:952887) End-PLD-Builder-Info
[Back to list of logs] [View rpm -qa of builder]