FailedOk

th/SRPMS[OK]
th/x32[OK]
th/i686[OK]
th/x86_64[OK]

ac/SRPMS[OK]
ac/i386[OK]
ac/i586[OK]
ac/i686[OK]
ac/alpha[OK]
ac/amd64[OK]
ac/athlon[OK]
ac/ppc[OK]
ac/sparc[OK]
ac/sparc64[OK]

Advanced Search
main()
Powered by PLD Linux
(c) 2002-2018 PLD Team
$Revision: 1.37 $
Powered by power.
Your IP: 54.196.190.32

mysql 2cb0a77b-4375-48a6-ba6b-d6357826b8f9

Status:Failed
Source URL:ftp://buildlogs.pld-linux.org/th/i686/FAIL/mysql,2cb0a77b-4375-48a6-ba6b-d6357826b8f9.bz2
text/plain URL:View!
rpm -qa of builder:View!
Date:2018/09/13 21:01:32
Runtime:0:01:19.750398

Toc:

  • error 1
  • rpm: error: Failed build dependencies:
  • error 2
  • rpm: error: Failed build dependencies:
  • prep
  • Executing(%prep): /bin/sh -e /tmp/B.xnuEsf/BUILD/tmp/rpm-tmp.37336
  • build
  • Executing(%build): /bin/sh -e /tmp/B.xnuEsf/BUILD/tmp/rpm-tmp.59285
  • error 3
  • /tmp/B.xnuEsf/BUILD/mysql-5.7.22/vio/viosslfactories.c:124:7: error: dereferencing pointer to incomplete type 'DH' {aka 'struct dh_st'}
  • error 4
  • make[2]: *** [vio/CMakeFiles/vio.dir/build.make:105: vio/CMakeFiles/vio.dir/viosslfactories.c.o] Error 1
  • error 5
  • make[1]: *** [CMakeFiles/Makefile2:489: vio/CMakeFiles/vio.dir/all] Error 2
  • error 6
  • error: Bad exit status from /tmp/B.xnuEsf/BUILD/tmp/rpm-tmp.59285 (%build)
  • error 7
  • RPM build errors:
  • error 8
  • error: No files produced.

Content:

request from: arekm
checking if we should skip the build
started at: Thu Sep 13 20:59:07 2018
killing old processes on a builder
sending signal 9 to pid -1
Killed
cleaning up /tmp
fetching https://srcbuilder.pld-linux.org/th//srpms/2cb0a77b-4375-48a6-ba6b-d6357826b8f9/mysql-5.7.22-2.src.rpm
fetched 122674160 bytes, 3501.2 K/s
installing srpm: mysql-5.7.22-2.src.rpm
+ install -d /tmp/B.xnuEsf/BUILD /tmp/B.xnuEsf/RPMS
+ LC_ALL=en_US.UTF-8
+ rpm -qp --changelog mysql-5.7.22-2.src.rpm
* Thu Sep 13 2018 PLD Linux Team <feedback@pld-linux.org>
- For complete changelog see: http://git.pld-linux.org/?p=packages/mysql.git;a=log;h=master
* Thu Sep 13 2018 Arkadiusz Miśkiewicz <arekm@maven.pl> 2eabbad
- release 2 (by relup.sh) * Fri Jun 01 2018 Arkadiusz Miśkiewicz <arekm@maven.pl> cf0970d
- up to 5.7.22 * Sat Mar 31 2018 Adam Osuchowski <adwol@pld-linux.org> 9c2f854
- remove non-existent cmake options WITH_FAST_MUTEXES and WITH_PAM * Sat Mar 31 2018 Adam Osuchowski <adwol@pld-linux.org> bd62a2c
- fix readline support for client - rel 3 * Thu Mar 08 2018 Jan Rękorajski <baggins@pld-linux.org> 31921b4
- mysqlhotcopy is gone from upstream, do not require it - rel 2 * Mon Mar 05 2018 Jan Rękorajski <baggins@pld-linux.org> c710454
- up to 5.7.21 * Mon Mar 05 2018 Jan Rękorajski <baggins@pld-linux.org> 54e3d63
- builds and passes tests, rel 1 + rpm -Uhv --nodeps --define '_topdir /tmp/B.xnuEsf' --define '_specdir %{_topdir}' --define '_sourcedir %{_specdir}' --define '_rpmdir %{_topdir}/RPMS' --define '_builddir %{_topdir}/BUILD' mysql-5.7.22-2.src.rpm Preparing... ################################################## mysql ################################################## + rm -f mysql-5.7.22-2.src.rpm + install -m 700 -d /tmp/B.xnuEsf/BUILD/tmp + TMPDIR=/tmp/B.xnuEsf/BUILD/tmp + exec nice -n 0 rpmbuild -bp --short-circuit --nodeps --define '_topdir /tmp/B.xnuEsf' --define '_specdir %{_topdir}' --define '_sourcedir %{_specdir}' --define '_rpmdir %{_topdir}/RPMS' --define '_builddir %{_topdir}/BUILD' --target i686-pld-linux --define 'prep exit 0' /tmp/B.xnuEsf/mysql.spec Building target platforms: i686-pld-linux checking BuildConflict-ing packages no BuildConflicts found checking BR rpm: error: Failed build dependencies: rpm: libhsclient-devel is needed by mysql-5.7.22-2.src rpm: Building target platforms: i686-pld-linux updating poldek cache... ready is up to date Retrieving th::packages.ndir.md... th is up to date Retrieving th::packages.ndir.md... th is up to date Retrieving th-ready::packages.ndir.md... th-ready is up to date Retrieving th-ready::packages.ndir.md... th-ready is up to date Retrieving th-test::packages.ndir.md... Retrieving th-test::packages.ndir.diff.toc.gz... ..............................done Retrieving diff::packages.ndir.2018.09.13-11.15.02.gz... ..............................done Retrieving diff::packages.ndir.dscr.2018.09.13-11.15.02.gz... Loading [pndir]th-test... Applying packages.ndir.2018.09.13-11.15.02.gz... Retrieving diff::packages.ndir.2018.09.13-11.33.01.gz... ..............................done Retrieving diff::packages.ndir.dscr.2018.09.13-11.33.01.gz... ..............................done Applying packages.ndir.2018.09.13-11.33.01.gz... Retrieving diff::packages.ndir.2018.09.13-11.51.04.gz... ..............................done Retrieving diff::packages.ndir.dscr.2018.09.13-11.51.04.gz... Applying packages.ndir.2018.09.13-11.51.04.gz... Retrieving diff::packages.ndir.2018.09.13-12.27.01.gz... ..............................done Retrieving diff::packages.ndir.dscr.2018.09.13-12.27.01.gz... Applying packages.ndir.2018.09.13-12.27.01.gz... Writing /root/tmp/poldek-cache-root/[...]/packages.ndir.gz... Retrieving th-test::packages.ndir.md... Retrieving th-test::packages.ndir.diff.toc.gz... Retrieving diff::packages.ndir.2018.09.13-01.47.02.gz... ..............................done Retrieving diff::packages.ndir.dscr.2018.09.13-01.47.02.gz... Loading [pndir]th-test... Applying packages.ndir.2018.09.13-01.47.02.gz... Writing /root/tmp/poldek-cache-root/[...]/packages.ndir.gz... checking conflicting packages in BRed packages poldek: Loading [pndir]ready... poldek: Loading [pndir]th-test... poldek: Loading [pndir]th-test... poldek: Loading [pndir]th-ready... poldek: Loading [pndir]th-ready... poldek: Loading [pndir]th... poldek: Loading [pndir]th... poldek: 30496 packages read poldek: Removed 3421 duplicate packages from available set poldek: Processing dependencies... poldek: libhsclient-devel-1.1.2-5.i686 marks libhsclient-1.1.2-5.i686 (cap libhsclient = 1.1.2-5) poldek: There are 2 packages to install (1 marked by dependencies): poldek: I libhsclient-devel-1.1.2-5.i686 poldek: D libhsclient-1.1.2-5.i686 poldek: This operation will use 77.8KB of disk space. poldek: Need to get 33.7KB of archives (33.7KB to download). poldek: poldek: Retrieving [1/2] th-test::libhsclient-1.1.2-5.i686.rpm... poldek: ..............................done poldek: Retrieving [2/2] th-test::libhsclient-devel-1.1.2-5.i686.rpm... poldek: ..............................done poldek: Executing pm-command.sh --upgrade -vh --test --root / --define _check_dirname_deps 1... poldek: Preparing... ################################################## no conflicts found checking BR rpm: error: Failed build dependencies: rpm: libhsclient-devel is needed by mysql-5.7.22-2.src rpm: Building target platforms: i686-pld-linux installing BR: libhsclient\-devel + poldek --noask --caplookup -Q -v '--ignore=hhvm-*' '--ignore=php4-*' '--ignore=php52-*' '--ignore=php54-*' '--ignore=php55-*' '--ignore=php56-*' '--ignore=php70-*' '--ignore=php71-*' '--ignore=php72-*' --upgrade libhsclient-devel Loading [pndir]ready... Loading [pndir]th-test... Loading [pndir]th-test... Loading [pndir]th-ready... Loading [pndir]th-ready... Loading [pndir]th... Loading [pndir]th... 30496 packages read Removed 3421 duplicate packages from available set Processing dependencies... libhsclient-devel-1.1.2-5.i686 marks libhsclient-1.1.2-5.i686 (cap libhsclient = 1.1.2-5) There are 2 packages to install (1 marked by dependencies): I libhsclient-devel-1.1.2-5.i686 D libhsclient-1.1.2-5.i686 This operation will use 77.8KB of disk space. Need to get 33.7KB of archives. Executing pm-command.sh --upgrade -vh --root / --define _check_dirname_deps 1... Preparing... ################################################## libhsclient ################################################## libhsclient-devel ################################################## building RPM using: set -ex; : build-id: 2cb0a77b-4375-48a6-ba6b-d6357826b8f9; TMPDIR=/tmp/B.xnuEsf/BUILD/tmp exec nice -n 0 rpmbuild -bb --define '_smp_mflags -j9' --define '_make_opts -Otarget' --define '_pld_builder 1' --define '_topdir /tmp/B.xnuEsf' --define '_specdir %{_topdir}' --define '_sourcedir %{_specdir}' --define '_rpmdir %{_topdir}/RPMS' --define '_builddir %{_topdir}/BUILD' --target i686-pld-linux /tmp/B.xnuEsf/mysql.spec + : build-id: 2cb0a77b-4375-48a6-ba6b-d6357826b8f9 + TMPDIR=/tmp/B.xnuEsf/BUILD/tmp + exec nice -n 0 rpmbuild -bb --define '_smp_mflags -j9' --define '_make_opts -Otarget' --define '_pld_builder 1' --define '_topdir /tmp/B.xnuEsf' --define '_specdir %{_topdir}' --define '_sourcedir %{_specdir}' --define '_rpmdir %{_topdir}/RPMS' --define '_builddir %{_topdir}/BUILD' --target i686-pld-linux /tmp/B.xnuEsf/mysql.spec Building target platforms: i686-pld-linux Executing(%prep): /bin/sh -e /tmp/B.xnuEsf/BUILD/tmp/rpm-tmp.37336 + umask 022 + cd /tmp/B.xnuEsf/BUILD + cd /tmp/B.xnuEsf/BUILD + rm -rf mysql-5.7.22 + /usr/bin/gzip -dc /tmp/B.xnuEsf/mysql-5.7.22.tar.gz + /bin/tar -xf - + STATUS=0 + '[' 0 -ne 0 ']' + cd mysql-5.7.22 + /usr/bin/gzip -dc /tmp/B.xnuEsf/sphinx-2.2.11-release.tar.gz + /bin/tar -xf - + STATUS=0 + '[' 0 -ne 0 ']' + /usr/bin/bzip2 -dc /tmp/B.xnuEsf/boost_1_59_0.tar.bz2 + /bin/tar -xf - + STATUS=0 + '[' 0 -ne 0 ']' + /bin/id -u + '[' 1001 '=' 0 ']' + /bin/id -u + '[' 1001 '=' 0 ']' + /bin/chmod -Rf a+rX,u+w,g-w,o-w . + echo 'Patch #0 (mysql-opt.patch):' Patch #0 (mysql-opt.patch): + '[' -f /tmp/B.xnuEsf/mysql-opt.patch ']' + /bin/cat /tmp/B.xnuEsf/mysql-opt.patch + /usr/bin/patch -s -p1 + echo 'Patch #1 (lz4.patch):' Patch #1 (lz4.patch): + '[' -f /tmp/B.xnuEsf/lz4.patch ']' + /bin/cat /tmp/B.xnuEsf/lz4.patch + /usr/bin/patch -s -p1 + mv sphinx-2.2.11-release/mysqlse storage/sphinx + echo 'Patch #17 (mysql-5.7-sphinx.patch):' Patch #17 (mysql-5.7-sphinx.patch): + '[' -f /tmp/B.xnuEsf/mysql-5.7-sphinx.patch ']' + /bin/cat /tmp/B.xnuEsf/mysql-5.7-sphinx.patch + /usr/bin/patch -s -p1 + echo 'Patch #18 (mysql-sphinx.patch):' Patch #18 (mysql-sphinx.patch): + '[' -f /tmp/B.xnuEsf/mysql-sphinx.patch ']' + /bin/cat /tmp/B.xnuEsf/mysql-sphinx.patch + /usr/bin/patch -s -p1 + echo 'Patch #19 (mysql-chain-certs.patch):' Patch #19 (mysql-chain-certs.patch): + '[' -f /tmp/B.xnuEsf/mysql-chain-certs.patch ']' + /bin/cat /tmp/B.xnuEsf/mysql-chain-certs.patch + /usr/bin/patch -s -p1 + echo 'Patch #24 (mysql-cmake.patch):' Patch #24 (mysql-cmake.patch): + '[' -f /tmp/B.xnuEsf/mysql-cmake.patch ']' + /bin/cat /tmp/B.xnuEsf/mysql-cmake.patch + /usr/bin/patch -s -p1 + echo 'Patch #25 (mysql-readline.patch):' Patch #25 (mysql-readline.patch): + '[' -f /tmp/B.xnuEsf/mysql-readline.patch ']' + /bin/cat /tmp/B.xnuEsf/mysql-readline.patch + /usr/bin/patch -s -p1 + echo 'Patch #26 (mysqldumpslow-clusters.patch):' Patch #26 (mysqldumpslow-clusters.patch): + '[' -f /tmp/B.xnuEsf/mysqldumpslow-clusters.patch ']' + /bin/cat /tmp/B.xnuEsf/mysqldumpslow-clusters.patch + /usr/bin/patch -s -p1 + '[' -f sql/sql_yacc.cc ']' + /bin/rm '--interactive=never' sql/sql_yacc.cc + '[' -f sql/sql_yacc.h ']' + /bin/rm '--interactive=never' sql/sql_yacc.h + /bin/rm '--interactive=never' -rv extra/lz4/lz4.c extra/lz4/lz4.h extra/lz4/lz4frame.c extra/lz4/lz4frame.h extra/lz4/lz4frame_static.h extra/lz4/lz4hc.c extra/lz4/lz4hc.h removed 'extra/lz4/lz4.c' removed 'extra/lz4/lz4.h' removed 'extra/lz4/lz4frame.c' removed 'extra/lz4/lz4frame.h' removed 'extra/lz4/lz4frame_static.h' removed 'extra/lz4/lz4hc.c' removed 'extra/lz4/lz4hc.h' + exit 0 Executing(%build): /bin/sh -e /tmp/B.xnuEsf/BUILD/tmp/rpm-tmp.59285 TMP=/home/users/builder/tmp HOME=/home/users/builder PATH=/usr/local/bin:/usr/bin:/bin:/home/users/builder/bin TMPDIR=/tmp/B.xnuEsf/BUILD/tmp + umask 022 + cd /tmp/B.xnuEsf/BUILD + cd mysql-5.7.22 + install -d build + cd build + CPPFLAGS= + pwd + ls -1d ../boost_1_59_0 + CC=i686-pld-linux-gcc CXX=i686-pld-linux-g++ CPPFLAGS= /usr/bin/cmake '-DCMAKE_VERBOSE_MAKEFILE=ON' '-DCMAKE_BUILD_TYPE=PLD' '-DCMAKE_INSTALL_BINDIR:PATH=/usr/bin' '-DCMAKE_INSTALL_SBINDIR:PATH=/usr/sbin' '-DCMAKE_INSTALL_LIBEXECDIR:PATH=/usr/sbin' '-DCMAKE_INSTALL_SYSCONFDIR:PATH=/etc' '-DCMAKE_INSTALL_SHAREDSTATEDIRPATH:PATH=/var/lib' '-DCMAKE_INSTALL_LOCALSTATEDIRPATH:PATH=/var/lib/mysql' '-DCMAKE_INSTALL_LIBDIR:PATH=/usr/lib' '-DCMAKE_INSTALL_INCLUDEDIR:PATH=/usr/include' '-DCMAKE_INSTALL_OLDINCLUDEDIR:PATH=/usr/include' '-DCMAKE_INSTALL_DATAROOTDIR:PATH=/usr/share' '-DCMAKE_INSTALL_DATADIR:PATH=/usr/share' '-DCMAKE_INSTALL_INFODIR:PATH=/usr/share/info' '-DCMAKE_INSTALL_LOCALEDIR:PATH=/usr/share/locale' '-DCMAKE_INSTALL_MANDIR:PATH=/usr/share/man' '-DCMAKE_INSTALL_DOCDIR:PATH=/usr/share/doc' '-DCMAKE_INSTALL_PREFIX:PATH=/usr' '-DSYSCONF_INSTALL_DIR:PATH=/etc' '-DCMAKE_CXX_FLAGS_PLD=-O2 -fwrapv -pipe -Wformat -Werror=format-security -gdwarf-4 -fno-debug-types-section -fvar-tracking-assignments -g2 -Wp,-D_FORTIFY_SOURCE=2 -fstack-protector-strong --param=ssp-buffer-size=4 -fomit-frame-pointer -march=i686 -fasynchronous-unwind-tables -mtune=pentium4 -gdwarf-4 -fno-debug-types-section -fvar-tracking-assignments -g2 -DNDEBUG -DQT_NO_DEBUG' '-DCMAKE_C_FLAGS_PLD=-O2 -fwrapv -pipe -Wformat -Werror=format-security -gdwarf-4 -fno-debug-types-section -fvar-tracking-assignments -g2 -Wp,-D_FORTIFY_SOURCE=2 -fstack-protector-strong --param=ssp-buffer-size=4 -fomit-frame-pointer -march=i686 -fasynchronous-unwind-tables -mtune=pentium4 -gdwarf-4 -fno-debug-types-section -fvar-tracking-assignments -g2 -DNDEBUG -DQT_NO_DEBUG' '-DCMAKE_Fortran_FLAGS_PLD=-O2 -fwrapv -pipe -Wformat -Werror=format-security -gdwarf-4 -fno-debug-types-section -fvar-tracking-assignments -g2 -Wp,-D_FORTIFY_SOURCE=2 -fstack-protector-strong --param=ssp-buffer-size=4 -fomit-frame-pointer -march=i686 -fasynchronous-unwind-tables -mtune=pentium4 -gdwarf-4 -fno-debug-types-section -fvar-tracking-assignments -g2 -DNDEBUG -DQT_NO_DEBUG' '-DCMAKE_EXE_LINKER_FLAGS_PLD=-Wl,--as-needed -Wl,--no-copy-dt-needed-entries -Wl,-z,relro -Wl,-z,combreloc ' '-DCMAKE_SHARED_LINKER_FLAGS_PLD=-Wl,--as-needed -Wl,--no-copy-dt-needed-entries -Wl,-z,relro -Wl,-z,combreloc ' '-DCMAKE_MODULE_LINKER_FLAGS_PLD=-Wl,--as-needed -Wl,--no-copy-dt-needed-entries -Wl,-z,relro -Wl,-z,combreloc ' '-DBUILD_SHARED_LIBS:BOOL=ON' .. '-DCMAKE_BUILD_TYPE=RelWithDebInfo' '-DCMAKE_C_FLAGS_RELWITHDEBINFO=-O2 -fwrapv -pipe -Wformat -Werror=format-security -gdwarf-4 -fno-debug-types-section -fvar-tracking-assignments -g2 -Wp,-D_FORTIFY_SOURCE=2 -fstack-protector-strong --param=ssp-buffer-size=4 -fomit-frame-pointer -march=i686 -fasynchronous-unwind-tables -mtune=pentium4 -gdwarf-4 -fno-debug-types-section -fvar-tracking-assignments -g2 -DNDEBUG -fno-omit-frame-pointer -fno-strict-aliasing' '-DCMAKE_CXX_FLAGS_RELWITHDEBINFO=-O2 -fwrapv -pipe -Wformat -Werror=format-security -gdwarf-4 -fno-debug-types-section -fvar-tracking-assignments -g2 -Wp,-D_FORTIFY_SOURCE=2 -fstack-protector-strong --param=ssp-buffer-size=4 -fomit-frame-pointer -march=i686 -fasynchronous-unwind-tables -mtune=pentium4 -gdwarf-4 -fno-debug-types-section -fvar-tracking-assignments -g2 -DNDEBUG -fno-omit-frame-pointer -fno-strict-aliasing' '-DCOMPILATION_COMMENT=PLD/Linux Distribution MySQL RPM' '-DCURSES_INCLUDE_PATH=/usr/include/ncurses' '-DENABLE_DTRACE=ON' '-DFEATURE_SET=community' '-DINSTALL_LAYOUT=RPM' '-DINSTALL_LIBDIR=lib' '-DINSTALL_MYSQLTESTDIR_RPM=' '-DINSTALL_PLUGINDIR=lib/mysql/plugin' '-DINSTALL_SQLBENCHDIR=/usr/share' '-DINSTALL_SUPPORTFILESDIR=share/mysql-support' '-DINSTALL_MYSQLSHAREDIR=share/mysql' '-DMYSQL_UNIX_ADDR=/var/lib/mysql/mysql.sock' '-DWITHOUT_EXAMPLE_STORAGE_ENGINE=1' '-DWITH_LIBWRAP=ON' '-DWITH_PERFSCHEMA_STORAGE_ENGINE=1' '-DWITH_PIC=ON' '-DWITH_LZ4=system' '-DWITH_LIBEVENT=system' '-DWITH_PROTOBUF=system' '-DWITH_SSL=system' '-DWITH_UNIT_TESTS=ON' '-DWITH_BOOST=/tmp/B.xnuEsf/BUILD/mysql-5.7.22/build/../boost_1_59_0' '-DWITH_ZLIB=system' '-DWITH_EDITLINE=system' '-DWITH_MECAB=system' '-DTMPDIR=/var/tmp' CMake Deprecation Warning at CMakeLists.txt:28 (CMAKE_POLICY): The OLD behavior for policy CMP0018 will be removed from a future version of CMake. The cmake-policies(7) manual explains that the OLD behaviors of all policies are deprecated and that a policy should be set to OLD only under specific short-term circumstances. Projects should be ported to the NEW behavior and not rely on setting a policy to OLD. CMake Deprecation Warning at CMakeLists.txt:34 (CMAKE_POLICY): The OLD behavior for policy CMP0022 will be removed from a future version of CMake. The cmake-policies(7) manual explains that the OLD behaviors of all policies are deprecated and that a policy should be set to OLD only under specific short-term circumstances. Projects should be ported to the NEW behavior and not rely on setting a policy to OLD. CMake Deprecation Warning at CMakeLists.txt:41 (CMAKE_POLICY): The OLD behavior for policy CMP0045 will be removed from a future version of CMake. The cmake-policies(7) manual explains that the OLD behaviors of all policies are deprecated and that a policy should be set to OLD only under specific short-term circumstances. Projects should be ported to the NEW behavior and not rely on setting a policy to OLD. CMake Deprecation Warning at CMakeLists.txt:42 (CMAKE_POLICY): The OLD behavior for policy CMP0042 will be removed from a future version of CMake. The cmake-policies(7) manual explains that the OLD behaviors of all policies are deprecated and that a policy should be set to OLD only under specific short-term circumstances. Projects should be ported to the NEW behavior and not rely on setting a policy to OLD. -- Running cmake version 3.11.4 -- Found Git: /usr/bin/git (found version "2.19.0") -- Configuring with MAX_INDEXES = 64U -- The C compiler identification is GNU 8.2.0 -- The CXX compiler identification is GNU 8.2.0 -- Check for working C compiler: /usr/bin/i686-pld-linux-gcc -- Check for working C compiler: /usr/bin/i686-pld-linux-gcc -- works -- Detecting C compiler ABI info -- Detecting C compiler ABI info - done -- Detecting C compile features -- Detecting C compile features - done -- Check for working CXX compiler: /usr/bin/i686-pld-linux-g++ -- Check for working CXX compiler: /usr/bin/i686-pld-linux-g++ -- works -- Detecting CXX compiler ABI info -- Detecting CXX compiler ABI info - done -- Detecting CXX compile features -- Detecting CXX compile features - done -- CMAKE_GENERATOR: Unix Makefiles -- Looking for SHM_HUGETLB -- Looking for SHM_HUGETLB - found -- Looking for sys/types.h -- Looking for sys/types.h - found -- Looking for stdint.h -- Looking for stdint.h - found -- Looking for stddef.h -- Looking for stddef.h - found -- Check size of void * -- Check size of void * - done -- SIZEOF_VOIDP 4 -- Performing Test HAVE_C_SHIFT_OR_OPTIMIZATION_BUG -- Performing Test HAVE_C_SHIFT_OR_OPTIMIZATION_BUG - Failed -- Performing Test HAVE_CXX_SHIFT_OR_OPTIMIZATION_BUG -- Performing Test HAVE_CXX_SHIFT_OR_OPTIMIZATION_BUG - Failed -- Performing Test HAVE_C_FLOATING_POINT_FUSED_MADD -- Performing Test HAVE_C_FLOATING_POINT_FUSED_MADD - Success -- Performing Test HAVE_CXX_FLOATING_POINT_FUSED_MADD -- Performing Test HAVE_CXX_FLOATING_POINT_FUSED_MADD - Success -- Performing Test HAVE_C_FP_CONTRACT_FLAG -- Performing Test HAVE_C_FP_CONTRACT_FLAG - Success -- Performing Test HAVE_CXX_FP_CONTRACT_FLAG -- Performing Test HAVE_CXX_FP_CONTRACT_FLAG - Success -- MySQL 5.7.22 -- Packaging as: mysql-5.7.22-Linux-i686 -- Local boost dir /tmp/B.xnuEsf/BUILD/mysql-5.7.22/boost_1_59_0 -- Found /tmp/B.xnuEsf/BUILD/mysql-5.7.22/boost_1_59_0/boost/version.hpp -- BOOST_VERSION_NUMBER is #define BOOST_VERSION 105900 -- BOOST_INCLUDE_DIR /tmp/B.xnuEsf/BUILD/mysql-5.7.22/boost_1_59_0 -- Performing Test HAVE_LLVM_LIBCPP -- Performing Test HAVE_LLVM_LIBCPP - Failed -- Looking for pthread.h -- Looking for pthread.h - found -- Looking for pthread_create -- Looking for pthread_create - not found -- Looking for pthread_create in pthreads -- Looking for pthread_create in pthreads - not found -- Looking for pthread_create in pthread -- Looking for pthread_create in pthread - found -- Found Threads: TRUE -- Looking for floor -- Looking for floor - not found -- Looking for floor in m -- Looking for floor in m - found -- Looking for gethostbyname_r -- Looking for gethostbyname_r - found -- Looking for bind -- Looking for bind - found -- Looking for crypt -- Looking for crypt - not found -- Looking for crypt in crypt -- Looking for crypt in crypt - found -- Looking for setsockopt -- Looking for setsockopt - found -- Looking for dlopen -- Looking for dlopen - not found -- Looking for dlopen in dl -- Looking for dlopen in dl - found -- Looking for sched_yield -- Looking for sched_yield - found -- Looking for clock_gettime -- Looking for clock_gettime - found -- Looking for timer_create -- Looking for timer_create - not found -- Looking for timer_create in rt -- Looking for timer_create in rt - found -- Looking for atomic_thread_fence -- Looking for atomic_thread_fence - not found -- Looking for atomic_thread_fence in atomic -- Looking for atomic_thread_fence in atomic - found -- Looking for backtrace -- Looking for backtrace - found -- Performing Test HAVE_LIBWRAP -- Performing Test HAVE_LIBWRAP - Success -- Performing Test HAVE_LIBWRAP_PROTOTYPES -- Performing Test HAVE_LIBWRAP_PROTOTYPES - Success -- Looking for include file alloca.h -- Looking for include file alloca.h - found -- Looking for include file arpa/inet.h -- Looking for include file arpa/inet.h - found -- Looking for include file crypt.h -- Looking for include file crypt.h - found -- Looking for include file dlfcn.h -- Looking for include file dlfcn.h - found -- Looking for include file execinfo.h -- Looking for include file execinfo.h - found -- Looking for include file fpu_control.h -- Looking for include file fpu_control.h - found -- Looking for include file grp.h -- Looking for include file grp.h - found -- Looking for include file ieeefp.h -- Looking for include file ieeefp.h - not found -- Looking for include file langinfo.h -- Looking for include file langinfo.h - found -- Looking for include file malloc.h -- Looking for include file malloc.h - found -- Looking for include file netinet/in.h -- Looking for include file netinet/in.h - found -- Looking for include file poll.h -- Looking for include file poll.h - found -- Looking for include file pwd.h -- Looking for include file pwd.h - found -- Looking for include file strings.h -- Looking for include file strings.h - found -- Looking for include file sys/cdefs.h -- Looking for include file sys/cdefs.h - found -- Looking for include file sys/ioctl.h -- Looking for include file sys/ioctl.h - found -- Looking for include file sys/mman.h -- Looking for include file sys/mman.h - found -- Looking for include file sys/resource.h -- Looking for include file sys/resource.h - found -- Looking for include file sys/select.h -- Looking for include file sys/select.h - found -- Looking for include file sys/socket.h -- Looking for include file sys/socket.h - found -- Looking for include files curses.h, term.h -- Looking for include files curses.h, term.h - found -- Looking for include file termios.h -- Looking for include file termios.h - found -- Looking for include file termio.h -- Looking for include file termio.h - found -- Looking for include file unistd.h -- Looking for include file unistd.h - found -- Looking for include file sys/wait.h -- Looking for include file sys/wait.h - found -- Looking for include file sys/param.h -- Looking for include file sys/param.h - found -- Looking for include file fnmatch.h -- Looking for include file fnmatch.h - found -- Looking for include file sys/un.h -- Looking for include file sys/un.h - found -- Looking for include file vis.h -- Looking for include file vis.h - not found -- Looking for include file sasl/sasl.h -- Looking for include file sasl/sasl.h - found -- Looking for include file sys/devpoll.h -- Looking for include file sys/devpoll.h - not found -- Looking for include file sys/epoll.h -- Looking for include file sys/epoll.h - found -- Looking for TAILQ_FOREACH -- Looking for TAILQ_FOREACH - found -- Looking for _aligned_malloc -- Looking for _aligned_malloc - not found -- Looking for backtrace -- Looking for backtrace - found -- Looking for printstack -- Looking for printstack - not found -- Looking for index -- Looking for index - found -- Looking for clock_gettime -- Looking for clock_gettime - found -- Looking for cuserid -- Looking for cuserid - found -- Looking for directio -- Looking for directio - not found -- Looking for ftruncate -- Looking for ftruncate - found -- Looking for compress -- Looking for compress - not found -- Looking for crypt -- Looking for crypt - found -- Looking for dlopen -- Looking for dlopen - found -- Looking for fchmod -- Looking for fchmod - found -- Looking for fcntl -- Looking for fcntl - found -- Looking for fdatasync -- Looking for fdatasync - found -- Looking for fdatasync -- Looking for fdatasync - found -- Looking for fedisableexcept -- Looking for fedisableexcept - found -- Looking for fseeko -- Looking for fseeko - found -- Looking for fsync -- Looking for fsync - found -- Looking for gethostbyaddr_r -- Looking for gethostbyaddr_r - found -- Looking for gethrtime -- Looking for gethrtime - not found -- Looking for getnameinfo -- Looking for getnameinfo - found -- Looking for getpass -- Looking for getpass - found -- Looking for getpassphrase -- Looking for getpassphrase - not found -- Looking for getpwnam -- Looking for getpwnam - found -- Looking for getpwuid -- Looking for getpwuid - found -- Looking for getrlimit -- Looking for getrlimit - found -- Looking for getrusage -- Looking for getrusage - found -- Looking for initgroups -- Looking for initgroups - found -- Looking for issetugid -- Looking for issetugid - not found -- Looking for getuid -- Looking for getuid - found -- Looking for geteuid -- Looking for geteuid - found -- Looking for getgid -- Looking for getgid - found -- Looking for getegid -- Looking for getegid - found -- Looking for lstat -- Looking for lstat - found -- Looking for madvise -- Looking for madvise - found -- Looking for malloc_info -- Looking for malloc_info - found -- Looking for memrchr -- Looking for memrchr - found -- Looking for mlock -- Looking for mlock - found -- Looking for mlockall -- Looking for mlockall - found -- Looking for mmap64 -- Looking for mmap64 - found -- Looking for poll -- Looking for poll - found -- Looking for posix_fallocate -- Looking for posix_fallocate - found -- Looking for posix_memalign -- Looking for posix_memalign - found -- Looking for pread -- Looking for pread - found -- Looking for pthread_condattr_setclock -- Looking for pthread_condattr_setclock - found -- Looking for pthread_sigmask -- Looking for pthread_sigmask - found -- Looking for readlink -- Looking for readlink - found -- Looking for realpath -- Looking for realpath - found -- Looking for setfd -- Looking for setfd - not found -- Looking for sigaction -- Looking for sigaction - found -- Looking for sleep -- Looking for sleep - found -- Looking for stpcpy -- Looking for stpcpy - found -- Looking for stpncpy -- Looking for stpncpy - found -- Looking for strlcpy -- Looking for strlcpy - not found -- Looking for strndup -- Looking for strndup - found -- Looking for strnlen -- Looking for strnlen - found -- Looking for strlcat -- Looking for strlcat - not found -- Looking for strsignal -- Looking for strsignal - found -- Looking for fgetln -- Looking for fgetln - not found -- Looking for strsep -- Looking for strsep - found -- Looking for tell -- Looking for tell - not found -- Looking for vasprintf -- Looking for vasprintf - found -- Looking for memalign -- Looking for memalign - found -- Looking for nl_langinfo -- Looking for nl_langinfo - found -- Looking for ntohll -- Looking for ntohll - not found -- Looking for clock_gettime -- Looking for clock_gettime - found -- Looking for epoll_create -- Looking for epoll_create - found -- Looking for inet_ntop -- Looking for inet_ntop - found -- Looking for kqueue -- Looking for kqueue - not found -- Looking for timeradd -- Looking for timeradd - found -- Looking for timerclear -- Looking for timerclear - found -- Looking for timercmp -- Looking for timercmp - found -- Looking for timerisset -- Looking for timerisset - found -- Looking for include file sys/time.h -- Looking for include file sys/time.h - found -- Looking for include file sys/times.h -- Looking for include file sys/times.h - found -- Looking for times -- Looking for times - found -- Looking for gettimeofday -- Looking for gettimeofday - found -- Looking for lrand48 -- Looking for lrand48 - found -- Looking for TIOCGWINSZ -- Looking for TIOCGWINSZ - found -- Looking for FIONREAD -- Looking for FIONREAD - found -- Looking for FIONREAD -- Looking for FIONREAD - not found -- Looking for SIGEV_THREAD_ID -- Looking for SIGEV_THREAD_ID - found -- Looking for SIGEV_PORT -- Looking for SIGEV_PORT - not found -- Looking for log2 -- Looking for log2 - found -- Looking for isinf -- Looking for isinf - found -- Performing Test HAVE_CXX_ISINF -- Performing Test HAVE_CXX_ISINF - Success -- Looking for timer_create -- Looking for timer_create - found -- Looking for timer_settime -- Looking for timer_settime - found -- Looking for kqueue -- Looking for kqueue - not found -- Looking for EVFILT_TIMER -- Looking for EVFILT_TIMER - not found -- Check if the system is big endian -- Searching 16 bit integer -- Check size of unsigned short -- Check size of unsigned short - done -- Using unsigned short -- Check if the system is big endian - little endian -- Check size of char * -- Check size of char * - done -- Check size of long -- Check size of long - done -- Check size of short -- Check size of short - done -- Check size of int -- Check size of int - done -- Check size of long long -- Check size of long long - done -- Check size of off_t -- Check size of off_t - done -- Check size of time_t -- Check size of time_t - done -- Check size of struct timespec -- Check size of struct timespec - done -- Check size of uint -- Check size of uint - done -- Check size of ulong -- Check size of ulong - done -- Check size of u_int32_t -- Check size of u_int32_t - done -- Performing Test HAVE_VISIBILITY_HIDDEN -- Performing Test HAVE_VISIBILITY_HIDDEN - Success -- Checking stack direction : -1 -- Looking for include files time.h, sys/time.h -- Looking for include files time.h, sys/time.h - found -- Looking for O_NONBLOCK -- Looking for O_NONBLOCK - found -- Performing Test HAVE_PAUSE_INSTRUCTION -- Performing Test HAVE_PAUSE_INSTRUCTION - Success -- Performing Test HAVE_BUILTIN_UNREACHABLE -- Performing Test HAVE_BUILTIN_UNREACHABLE - Success -- Performing Test HAVE_BUILTIN_EXPECT -- Performing Test HAVE_BUILTIN_EXPECT - Success -- Performing Test HAVE_BUILTIN_STPCPY -- Performing Test HAVE_BUILTIN_STPCPY - Success -- Performing Test HAVE_GCC_ATOMIC_BUILTINS -- Performing Test HAVE_GCC_ATOMIC_BUILTINS - Success -- Performing Test HAVE_GCC_SYNC_BUILTINS -- Performing Test HAVE_GCC_SYNC_BUILTINS - Success -- Looking for netinet/in6.h -- Looking for netinet/in6.h - not found -- Check size of struct sockaddr_in6 -- Check size of struct sockaddr_in6 - done -- Check size of struct in6_addr -- Check size of struct in6_addr - done -- Performing Test HAVE_SOCKADDR_STORAGE_SS_FAMILY -- Performing Test HAVE_SOCKADDR_STORAGE_SS_FAMILY - Success -- Performing Test HAVE_SOCKADDR_IN_SIN_LEN -- Performing Test HAVE_SOCKADDR_IN_SIN_LEN - Failed -- Performing Test HAVE_SOCKADDR_IN6_SIN6_LEN -- Performing Test HAVE_SOCKADDR_IN6_SIN6_LEN - Failed -- Performing Test HAVE_PTHREAD_THREADID_NP -- Performing Test HAVE_PTHREAD_THREADID_NP - Failed -- Performing Test HAVE_IMPLICIT_DEPENDENT_NAME_TYPING -- Performing Test HAVE_IMPLICIT_DEPENDENT_NAME_TYPING - Failed -- Looking for chown -- Looking for chown - found -- Looking for include file numa.h -- Looking for include file numa.h - found -- Looking for include file numaif.h -- Looking for include file numaif.h - found -- Performing Test HAVE_LIBNUMA -- Performing Test HAVE_LIBNUMA - Success -- Check size of socklen_t -- Check size of socklen_t - failed -- Looking for crc32 -- Looking for crc32 - found -- Looking for compressBound -- Looking for compressBound - found -- Looking for deflateBound -- Looking for deflateBound - found -- OPENSSL_INCLUDE_DIR = /usr/include -- OPENSSL_LIBRARY = /usr/lib/libssl.so -- CRYPTO_LIBRARY = /usr/lib/libcrypto.so -- OPENSSL_MAJOR_VERSION = 1 -- Looking for SHA512_DIGEST_LENGTH -- Looking for SHA512_DIGEST_LENGTH - found -- SSL_LIBRARIES = /usr/lib/libssl.so;/usr/lib/libcrypto.so;dl -- Check size of mbstate_t -- Check size of mbstate_t - done -- Performing Test HAVE_LANGINFO_CODESET -- Performing Test HAVE_LANGINFO_CODESET - Success -- Looking for wcsdup -- Looking for wcsdup - found -- Check size of wchar_t -- Check size of wchar_t - done -- Check size of wint_t -- Check size of wint_t - done -- EDITLINE_INCLUDE_DIR /usr/include/readline -- EDITLINE_LIBRARY /usr/lib/libreadline.so -- Performing Test EDITLINE_HAVE_HIST_ENTRY -- Performing Test EDITLINE_HAVE_HIST_ENTRY - Success -- Performing Test EDITLINE_HAVE_COMPLETION_INT -- Performing Test EDITLINE_HAVE_COMPLETION_INT - Success -- Performing Test EDITLINE_HAVE_COMPLETION_CHAR -- Performing Test EDITLINE_HAVE_COMPLETION_CHAR - Success -- LZ4_INCLUDE_DIR /usr/include -- LZ4_LIBRARY /usr/lib/liblz4.so -- WITH_PROTOBUF=system -- Found Protobuf: /usr/lib/libprotobuf.so;-lpthread (found version "3.5.1") -- protobuf version is 3.5 -- You need to set WITH_CURL. This variable needs to point to curl library. -- Performing Test HAVE_SYS_THREAD_SELFID -- Performing Test HAVE_SYS_THREAD_SELFID - Failed -- Performing Test HAVE_SYS_GETTID -- Performing Test HAVE_SYS_GETTID - Success -- Performing Test HAVE_PTHREAD_SETNAME_NP -- Performing Test HAVE_PTHREAD_SETNAME_NP - Failed -- Performing Test HAVE_PTHREAD_GETTHREADID_NP -- Performing Test HAVE_PTHREAD_GETTHREADID_NP - Failed -- Performing Test HAVE_INTEGER_PTHREAD_SELF -- Performing Test HAVE_INTEGER_PTHREAD_SELF - Success -- Performing Test HAVE_IMPLICIT_FALLTHROUGH -- Performing Test HAVE_IMPLICIT_FALLTHROUGH - Success -- Creating LDAP authentication SASL client library. -- Looking for include file sasl/sasl.h -- Looking for include file sasl/sasl.h - found -- Looking for include file lber.h -- Looking for include file lber.h - found -- Library mysqlclient depends on OSLIBS -lpthread;/usr/lib/libz.so;m;rt;atomic;/usr/lib/libssl.so;/usr/lib/libcrypto.so;dl -- MERGE_CONVENIENCE_LIBRARIES TARGET mysqlclient -- MERGE_CONVENIENCE_LIBRARIES LIBS clientlib;dbug;strings;vio;mysys;mysys_ssl;/usr/lib/libz.so;/usr/lib/libssl.so;/usr/lib/libcrypto.so;dl;dl -- MERGE_CONVENIENCE_LIBRARIES MYLIBS clientlib;dbug;strings;vio;mysys;mysys_ssl -- Looking for include file endian.h -- Looking for include file endian.h - found -- Looking for le64toh -- Looking for le64toh - found -- Looking for le32toh -- Looking for le32toh - found -- Looking for le16toh -- Looking for le16toh - found -- Check size of long long -- Check size of long long - done -- Check size of long -- Check size of long - done -- Check size of int -- Check size of int - done -- Check if the system is big endian -- Searching 16 bit integer -- Using unsigned short -- Check if the system is big endian - little endian -- Looking for include file libaio.h -- Looking for include file libaio.h - found -- Looking for io_queue_init in aio -- Looking for io_queue_init in aio - found -- Looking for sched_getcpu -- Looking for sched_getcpu - found -- Looking for nanosleep -- Looking for nanosleep - found -- Performing Test HAVE_FALLOC_PUNCH_HOLE_AND_KEEP_SIZE -- Performing Test HAVE_FALLOC_PUNCH_HOLE_AND_KEEP_SIZE - Success -- Performing Test HAVE_IB_GCC_SYNC_SYNCHRONISE -- Performing Test HAVE_IB_GCC_SYNC_SYNCHRONISE - Success -- Performing Test HAVE_IB_GCC_ATOMIC_THREAD_FENCE -- Performing Test HAVE_IB_GCC_ATOMIC_THREAD_FENCE - Success -- Performing Test HAVE_IB_GCC_ATOMIC_COMPARE_EXCHANGE -- Performing Test HAVE_IB_GCC_ATOMIC_COMPARE_EXCHANGE - Success -- Performing Test HAVE_IB_ATOMIC_PTHREAD_T_GCC -- Performing Test HAVE_IB_ATOMIC_PTHREAD_T_GCC - Success -- Performing Test HAVE_IB_LINUX_FUTEX -- Performing Test HAVE_IB_LINUX_FUTEX - Success -- Looking for asprintf -- Looking for asprintf - found -- Using cmake version 3.11.4 -- Performing Test HAVE_UNUSED_BUT_SET_VARIABLE -- Performing Test HAVE_UNUSED_BUT_SET_VARIABLE - Success -- Disabling -Wunused-but-set-variable warning for building NDB -- Performing Test HAVE_STRICT_ALIASING -- Performing Test HAVE_STRICT_ALIASING - Success -- Disabling -Wstrict-aliasing warning for building NDB -- Not building NDB -- Performing Test HAVE_PEERCRED -- Performing Test HAVE_PEERCRED - Success -- MECAB_INCLUDE_DIR = /usr/include -- MECAB_LIBRARY = /usr/lib/libmecab.so -- Performing Test HAVE_UNUSED_TYPEDEFS -- Performing Test HAVE_UNUSED_TYPEDEFS - Success -- Looking for htole64 -- Looking for htole64 - found -- Looking for htole32 -- Looking for htole32 - found -- Looking for htole16 -- Looking for htole16 - found -- Performing Test HAVE_STRUCT_SOCKADDR_SA_LEN -- Performing Test HAVE_STRUCT_SOCKADDR_SA_LEN - Failed -- Performing Test HAVE_STRUCT_IFREQ_IFR_NAME -- Performing Test HAVE_STRUCT_IFREQ_IFR_NAME - Success -- Performing Test HAVE_XDR_OPS_X_PUTINT32 -- Performing Test HAVE_XDR_OPS_X_PUTINT32 - Failed -- Performing Test HAVE_XDR_OPS_X_GETINT32 -- Performing Test HAVE_XDR_OPS_X_GETINT32 - Failed -- Performing Test HAVE___CONST -- Performing Test HAVE___CONST - Success -- Performing Test HAVE_RPC_INLINE_T -- Performing Test HAVE_RPC_INLINE_T - Success -- Performing Test OLD_XDR -- Performing Test OLD_XDR - Failed -- Performing Test X_GETPOSTN_NOT_USE_CONST -- Performing Test X_GETPOSTN_NOT_USE_CONST - Success -- Performing Test HAS_INCOMPATIBLE_POINTER_TYPES -- Performing Test HAS_INCOMPATIBLE_POINTER_TYPES - Success -- Performing Test X_PUTLONG_NOT_USE_CONST -- Performing Test X_PUTLONG_NOT_USE_CONST - Failed -- RPC_INCLUDE_DIR /usr/include/tirpc -- Using Boost headers from /tmp/B.xnuEsf/BUILD/mysql-5.7.22/boost_1_59_0 -- Performing Test HAVE_NO_IGNORED_QUALIFIERS -- Performing Test HAVE_NO_IGNORED_QUALIFIERS - Success -- Performing Test CXX_HAVE_SIGN_COMPARE -- Performing Test CXX_HAVE_SIGN_COMPARE - Success -- Performing Test CXX_HAVE_UNUSED_VARIABLE -- Performing Test CXX_HAVE_UNUSED_VARIABLE - Success -- MYSQLX - Text log of protobuf messages enabled -- Performing Test HAVE_UNUSED_BUT_SET -- Performing Test HAVE_UNUSED_BUT_SET - Success -- Performing Test HAVE_UNUSED_PARAMETER -- Performing Test HAVE_UNUSED_PARAMETER - Success -- Googletest was not found. gtest-based unit tests will be disabled. You can run cmake . -DENABLE_DOWNLOADS=1 to automatically download and build required components from source. -- If you are inside a firewall, you may need to use an https proxy: export https_proxy=http://example.com:80 -- Performing Test HAVE_NO_UNUSED_TYPEDEFS -- Performing Test HAVE_NO_UNUSED_TYPEDEFS - Success -- Performing Test HAVE_MISLEADING_INDENTATION -- Performing Test HAVE_MISLEADING_INDENTATION - Success -- Performing Test HAVE_MAYBE_UNINITIALIZED -- Performing Test HAVE_MAYBE_UNINITIALIZED - Success -- Performing Test HAVE_NO_BUILTIN_MEMCMP -- Performing Test HAVE_NO_BUILTIN_MEMCMP - Success -- executable target mysqld debug_target /tmp/B.xnuEsf/BUILD/mysql-5.7.22/debug/sql/mysqld -- Library mysqlserver depends on OSLIBS -lpthread;/usr/lib/libz.so;m;rt;atomic;/usr/lib/libssl.so;/usr/lib/libcrypto.so;dl;crypt;aio;/usr/lib/liblz4.so;numa -- MERGE_CONVENIENCE_LIBRARIES TARGET mysqlserver -- MERGE_CONVENIENCE_LIBRARIES LIBS dbug;strings;regex;mysys;mysys_ssl;vio;/usr/lib/libz.so;/usr/lib/libssl.so;/usr/lib/libcrypto.so;dl;crypt;archive_embedded;blackhole_embedded;csv_embedded;federated_embedded;heap_embedded;innobase;/usr/lib/liblz4.so;numa;myisam_embedded;myisammrg_embedded;partition_embedded;ngram_parser;sql_embedded -- MERGE_CONVENIENCE_LIBRARIES MYLIBS dbug;strings;regex;mysys;mysys_ssl;vio;archive_embedded;blackhole_embedded;csv_embedded;federated_embedded;heap_embedded;innobase;myisam_embedded;myisammrg_embedded;partition_embedded;ngram_parser;sql_embedded -- library target mysqlserver debug_target /tmp/B.xnuEsf/BUILD/mysql-5.7.22/debug/archive_output_directory/libmysqld.a -- INSTALL mysqlclient.pc lib/pkgconfig -- Skipping deb packaging on unsupported platform . -- CMAKE_BUILD_TYPE: RelWithDebInfo -- COMPILE_DEFINITIONS: _GNU_SOURCE;_FILE_OFFSET_BITS=64;BOOST_GEOMETRY_SQRT_CHECK_FINITENESS;HAVE_CONFIG_H;HAVE_LIBEVENT2 -- CMAKE_C_FLAGS: -fPIC -Wall -Wextra -Wformat-security -Wvla -Wimplicit-fallthrough=2 -Wwrite-strings -Wdeclaration-after-statement -- CMAKE_CXX_FLAGS: -fPIC -Wall -Wextra -Wformat-security -Wvla -Wimplicit-fallthrough=2 -Woverloaded-virtual -Wno-unused-parameter -- CMAKE_C_LINK_FLAGS: -- CMAKE_CXX_LINK_FLAGS: -- CMAKE_C_FLAGS_RELWITHDEBINFO: -O3 -O2 -fwrapv -pipe -Wformat -Werror=format-security -gdwarf-4 -fno-debug-types-section -fvar-tracking-assignments -g2 -Wp,-D_FORTIFY_SOURCE=2 -fstack-protector-strong --param=ssp-buffer-size=4 -fomit-frame-pointer -march=i686 -fasynchronous-unwind-tables -mtune=pentium4 -gdwarf-4 -fno-debug-types-section -fvar-tracking-assignments -g2 -DNDEBUG -fno-omit-frame-pointer -fno-strict-aliasing -g -fabi-version=2 -fno-omit-frame-pointer -fno-strict-aliasing -ffp-contract=off -DDBUG_OFF -- CMAKE_CXX_FLAGS_RELWITHDEBINFO: -O3 -O2 -fwrapv -pipe -Wformat -Werror=format-security -gdwarf-4 -fno-debug-types-section -fvar-tracking-assignments -g2 -Wp,-D_FORTIFY_SOURCE=2 -fstack-protector-strong --param=ssp-buffer-size=4 -fomit-frame-pointer -march=i686 -fasynchronous-unwind-tables -mtune=pentium4 -gdwarf-4 -fno-debug-types-section -fvar-tracking-assignments -g2 -DNDEBUG -fno-omit-frame-pointer -fno-strict-aliasing -g -fabi-version=2 -fno-omit-frame-pointer -fno-strict-aliasing -std=gnu++03 -ffp-contract=off -DDBUG_OFF -- Configuring done -- Generating done CMake Warning: Manually-specified variables were not used by the project: CMAKE_CXX_FLAGS_PLD CMAKE_C_FLAGS_PLD CMAKE_EXE_LINKER_FLAGS_PLD CMAKE_Fortran_FLAGS_PLD CMAKE_INSTALL_BINDIR CMAKE_INSTALL_DATADIR CMAKE_INSTALL_DATAROOTDIR CMAKE_INSTALL_DOCDIR CMAKE_INSTALL_INCLUDEDIR CMAKE_INSTALL_INFODIR CMAKE_INSTALL_LIBDIR CMAKE_INSTALL_LIBEXECDIR CMAKE_INSTALL_LOCALEDIR CMAKE_INSTALL_LOCALSTATEDIRPATH CMAKE_INSTALL_MANDIR CMAKE_INSTALL_OLDINCLUDEDIR CMAKE_INSTALL_SBINDIR CMAKE_INSTALL_SHAREDSTATEDIRPATH CMAKE_INSTALL_SYSCONFDIR CMAKE_MODULE_LINKER_FLAGS_PLD CMAKE_SHARED_LINKER_FLAGS_PLD CURSES_INCLUDE_PATH INSTALL_SQLBENCHDIR SYSCONF_INSTALL_DIR -- Build files have been written to: /tmp/B.xnuEsf/BUILD/mysql-5.7.22/build + /usr/bin/make -Otarget -j9 /usr/bin/cmake -H/tmp/B.xnuEsf/BUILD/mysql-5.7.22 -B/tmp/B.xnuEsf/BUILD/mysql-5.7.22/build --check-build-system CMakeFiles/Makefile.cmake 0 /usr/bin/cmake -E cmake_progress_start /tmp/B.xnuEsf/BUILD/mysql-5.7.22/build/CMakeFiles /tmp/B.xnuEsf/BUILD/mysql-5.7.22/build/CMakeFiles/progress.marks /usr/bin/make -f CMakeFiles/Makefile2 all /usr/bin/make -f CMakeFiles/INFO_BIN.dir/build.make CMakeFiles/INFO_BIN.dir/depend /usr/bin/make -f CMakeFiles/abi_check.dir/build.make CMakeFiles/abi_check.dir/depend /usr/bin/make -f CMakeFiles/INFO_SRC.dir/build.make CMakeFiles/INFO_SRC.dir/depend /usr/bin/make -f strings/CMakeFiles/strings.dir/build.make strings/CMakeFiles/strings.dir/depend /usr/bin/make -f CMakeFiles/gen_dtrace_header.dir/build.make CMakeFiles/gen_dtrace_header.dir/depend /usr/bin/make -f vio/CMakeFiles/vio.dir/build.make vio/CMakeFiles/vio.dir/depend /usr/bin/make -f regex/CMakeFiles/regex.dir/build.make regex/CMakeFiles/regex.dir/depend /usr/bin/make -f libbinlogstandalone/src/CMakeFiles/binlogstandalone_shared.dir/build.make libbinlogstandalone/src/CMakeFiles/binlogstandalone_shared.dir/depend /usr/bin/make -f libbinlogstandalone/src/CMakeFiles/binlogstandalone_static.dir/build.make libbinlogstandalone/src/CMakeFiles/binlogstandalone_static.dir/depend make[2]: Entering directory '/tmp/B.xnuEsf/BUILD/mysql-5.7.22/build' cd /tmp/B.xnuEsf/BUILD/mysql-5.7.22/build && /usr/bin/cmake -E cmake_depends "Unix Makefiles" /tmp/B.xnuEsf/BUILD/mysql-5.7.22 /tmp/B.xnuEsf/BUILD/mysql-5.7.22 /tmp/B.xnuEsf/BUILD/mysql-5.7.22/build /tmp/B.xnuEsf/BUILD/mysql-5.7.22/build /tmp/B.xnuEsf/BUILD/mysql-5.7.22/build/CMakeFiles/abi_check.dir/DependInfo.cmake --color= Scanning dependencies of target abi_check make[2]: Leaving directory '/tmp/B.xnuEsf/BUILD/mysql-5.7.22/build' make[2]: Entering directory '/tmp/B.xnuEsf/BUILD/mysql-5.7.22/build' cd /tmp/B.xnuEsf/BUILD/mysql-5.7.22/build && /usr/bin/cmake -E cmake_depends "Unix Makefiles" /tmp/B.xnuEsf/BUILD/mysql-5.7.22 /tmp/B.xnuEsf/BUILD/mysql-5.7.22 /tmp/B.xnuEsf/BUILD/mysql-5.7.22/build /tmp/B.xnuEsf/BUILD/mysql-5.7.22/build /tmp/B.xnuEsf/BUILD/mysql-5.7.22/build/CMakeFiles/INFO_SRC.dir/DependInfo.cmake --color= Scanning dependencies of target INFO_SRC make[2]: Leaving directory '/tmp/B.xnuEsf/BUILD/mysql-5.7.22/build' /usr/bin/make -f CMakeFiles/abi_check.dir/build.make CMakeFiles/abi_check.dir/build make[2]: Entering directory '/tmp/B.xnuEsf/BUILD/mysql-5.7.22/build' cd /tmp/B.xnuEsf/BUILD/mysql-5.7.22/build && /usr/bin/cmake -E cmake_depends "Unix Makefiles" /tmp/B.xnuEsf/BUILD/mysql-5.7.22 /tmp/B.xnuEsf/BUILD/mysql-5.7.22 /tmp/B.xnuEsf/BUILD/mysql-5.7.22/build /tmp/B.xnuEsf/BUILD/mysql-5.7.22/build /tmp/B.xnuEsf/BUILD/mysql-5.7.22/build/CMakeFiles/gen_dtrace_header.dir/DependInfo.cmake --color= Scanning dependencies of target gen_dtrace_header make[2]: Leaving directory '/tmp/B.xnuEsf/BUILD/mysql-5.7.22/build' /usr/bin/make -f CMakeFiles/INFO_SRC.dir/build.make CMakeFiles/INFO_SRC.dir/build /usr/bin/make -f CMakeFiles/gen_dtrace_header.dir/build.make CMakeFiles/gen_dtrace_header.dir/build make[2]: Entering directory '/tmp/B.xnuEsf/BUILD/mysql-5.7.22/build' cd /tmp/B.xnuEsf/BUILD/mysql-5.7.22/build && /usr/bin/cmake -E cmake_depends "Unix Makefiles" /tmp/B.xnuEsf/BUILD/mysql-5.7.22 /tmp/B.xnuEsf/BUILD/mysql-5.7.22 /tmp/B.xnuEsf/BUILD/mysql-5.7.22/build /tmp/B.xnuEsf/BUILD/mysql-5.7.22/build /tmp/B.xnuEsf/BUILD/mysql-5.7.22/build/CMakeFiles/INFO_BIN.dir/DependInfo.cmake --color= Scanning dependencies of target INFO_BIN make[2]: Leaving directory '/tmp/B.xnuEsf/BUILD/mysql-5.7.22/build' /usr/bin/make -f CMakeFiles/INFO_BIN.dir/build.make CMakeFiles/INFO_BIN.dir/build make[2]: Entering directory '/tmp/B.xnuEsf/BUILD/mysql-5.7.22/build' cd /tmp/B.xnuEsf/BUILD/mysql-5.7.22/build && /usr/bin/cmake -E cmake_depends "Unix Makefiles" /tmp/B.xnuEsf/BUILD/mysql-5.7.22 /tmp/B.xnuEsf/BUILD/mysql-5.7.22/regex /tmp/B.xnuEsf/BUILD/mysql-5.7.22/build /tmp/B.xnuEsf/BUILD/mysql-5.7.22/build/regex /tmp/B.xnuEsf/BUILD/mysql-5.7.22/build/regex/CMakeFiles/regex.dir/DependInfo.cmake --color= Scanning dependencies of target regex make[2]: Leaving directory '/tmp/B.xnuEsf/BUILD/mysql-5.7.22/build' /usr/bin/make -f regex/CMakeFiles/regex.dir/build.make regex/CMakeFiles/regex.dir/build make[2]: Entering directory '/tmp/B.xnuEsf/BUILD/mysql-5.7.22/build' cd /tmp/B.xnuEsf/BUILD/mysql-5.7.22/build && /usr/bin/cmake -E cmake_depends "Unix Makefiles" /tmp/B.xnuEsf/BUILD/mysql-5.7.22 /tmp/B.xnuEsf/BUILD/mysql-5.7.22/libbinlogstandalone/src /tmp/B.xnuEsf/BUILD/mysql-5.7.22/build /tmp/B.xnuEsf/BUILD/mysql-5.7.22/build/libbinlogstandalone/src /tmp/B.xnuEsf/BUILD/mysql-5.7.22/build/libbinlogstandalone/src/CMakeFiles/binlogstandalone_static.dir/DependInfo.cmake --color= Scanning dependencies of target binlogstandalone_static make[2]: Leaving directory '/tmp/B.xnuEsf/BUILD/mysql-5.7.22/build' make[2]: Entering directory '/tmp/B.xnuEsf/BUILD/mysql-5.7.22/build' cd /tmp/B.xnuEsf/BUILD/mysql-5.7.22/build && /usr/bin/cmake -E cmake_depends "Unix Makefiles" /tmp/B.xnuEsf/BUILD/mysql-5.7.22 /tmp/B.xnuEsf/BUILD/mysql-5.7.22/libbinlogstandalone/src /tmp/B.xnuEsf/BUILD/mysql-5.7.22/build /tmp/B.xnuEsf/BUILD/mysql-5.7.22/build/libbinlogstandalone/src /tmp/B.xnuEsf/BUILD/mysql-5.7.22/build/libbinlogstandalone/src/CMakeFiles/binlogstandalone_shared.dir/DependInfo.cmake --color= Scanning dependencies of target binlogstandalone_shared make[2]: Leaving directory '/tmp/B.xnuEsf/BUILD/mysql-5.7.22/build' /usr/bin/make -f libbinlogstandalone/src/CMakeFiles/binlogstandalone_static.dir/build.make libbinlogstandalone/src/CMakeFiles/binlogstandalone_static.dir/build make[2]: Entering directory '/tmp/B.xnuEsf/BUILD/mysql-5.7.22/build' cd /tmp/B.xnuEsf/BUILD/mysql-5.7.22/build && /usr/bin/cmake -E cmake_depends "Unix Makefiles" /tmp/B.xnuEsf/BUILD/mysql-5.7.22 /tmp/B.xnuEsf/BUILD/mysql-5.7.22/vio /tmp/B.xnuEsf/BUILD/mysql-5.7.22/build /tmp/B.xnuEsf/BUILD/mysql-5.7.22/build/vio /tmp/B.xnuEsf/BUILD/mysql-5.7.22/build/vio/CMakeFiles/vio.dir/DependInfo.cmake --color= Scanning dependencies of target vio make[2]: Leaving directory '/tmp/B.xnuEsf/BUILD/mysql-5.7.22/build' /usr/bin/make -f libbinlogstandalone/src/CMakeFiles/binlogstandalone_shared.dir/build.make libbinlogstandalone/src/CMakeFiles/binlogstandalone_shared.dir/build /usr/bin/make -f vio/CMakeFiles/vio.dir/build.make vio/CMakeFiles/vio.dir/build make[2]: Entering directory '/tmp/B.xnuEsf/BUILD/mysql-5.7.22/build' /usr/bin/cmake -P /tmp/B.xnuEsf/BUILD/mysql-5.7.22/cmake/info_src.cmake make[2]: Leaving directory '/tmp/B.xnuEsf/BUILD/mysql-5.7.22/build' make[1]: Entering directory '/tmp/B.xnuEsf/BUILD/mysql-5.7.22/build' [ 1%] Built target INFO_SRC make[1]: Leaving directory '/tmp/B.xnuEsf/BUILD/mysql-5.7.22/build' /usr/bin/make -f scripts/CMakeFiles/comp_sql.dir/build.make scripts/CMakeFiles/comp_sql.dir/depend make[2]: Entering directory '/tmp/B.xnuEsf/BUILD/mysql-5.7.22/build' /usr/bin/cmake -P /tmp/B.xnuEsf/BUILD/mysql-5.7.22/cmake/info_bin.cmake make[2]: Leaving directory '/tmp/B.xnuEsf/BUILD/mysql-5.7.22/build' make[1]: Entering directory '/tmp/B.xnuEsf/BUILD/mysql-5.7.22/build' [ 1%] Built target INFO_BIN make[1]: Leaving directory '/tmp/B.xnuEsf/BUILD/mysql-5.7.22/build' /usr/bin/make -f sql/CMakeFiles/gen_lex_hash.dir/build.make sql/CMakeFiles/gen_lex_hash.dir/depend make[2]: Entering directory '/tmp/B.xnuEsf/BUILD/mysql-5.7.22/build' cd /tmp/B.xnuEsf/BUILD/mysql-5.7.22/build && /usr/bin/cmake -E cmake_depends "Unix Makefiles" /tmp/B.xnuEsf/BUILD/mysql-5.7.22 /tmp/B.xnuEsf/BUILD/mysql-5.7.22/scripts /tmp/B.xnuEsf/BUILD/mysql-5.7.22/build /tmp/B.xnuEsf/BUILD/mysql-5.7.22/build/scripts /tmp/B.xnuEsf/BUILD/mysql-5.7.22/build/scripts/CMakeFiles/comp_sql.dir/DependInfo.cmake --color= Scanning dependencies of target comp_sql make[2]: Leaving directory '/tmp/B.xnuEsf/BUILD/mysql-5.7.22/build' /usr/bin/make -f scripts/CMakeFiles/comp_sql.dir/build.make scripts/CMakeFiles/comp_sql.dir/build make[2]: Entering directory '/tmp/B.xnuEsf/BUILD/mysql-5.7.22/build' cd /tmp/B.xnuEsf/BUILD/mysql-5.7.22/build && /usr/bin/cmake -E cmake_depends "Unix Makefiles" /tmp/B.xnuEsf/BUILD/mysql-5.7.22 /tmp/B.xnuEsf/BUILD/mysql-5.7.22/sql /tmp/B.xnuEsf/BUILD/mysql-5.7.22/build /tmp/B.xnuEsf/BUILD/mysql-5.7.22/build/sql /tmp/B.xnuEsf/BUILD/mysql-5.7.22/build/sql/CMakeFiles/gen_lex_hash.dir/DependInfo.cmake --color= Scanning dependencies of target gen_lex_hash make[2]: Leaving directory '/tmp/B.xnuEsf/BUILD/mysql-5.7.22/build' /usr/bin/make -f sql/CMakeFiles/gen_lex_hash.dir/build.make sql/CMakeFiles/gen_lex_hash.dir/build make[2]: Entering directory '/tmp/B.xnuEsf/BUILD/mysql-5.7.22/build' cd /tmp/B.xnuEsf/BUILD/mysql-5.7.22/build && /usr/bin/cmake -E cmake_depends "Unix Makefiles" /tmp/B.xnuEsf/BUILD/mysql-5.7.22 /tmp/B.xnuEsf/BUILD/mysql-5.7.22/strings /tmp/B.xnuEsf/BUILD/mysql-5.7.22/build /tmp/B.xnuEsf/BUILD/mysql-5.7.22/build/strings /tmp/B.xnuEsf/BUILD/mysql-5.7.22/build/strings/CMakeFiles/strings.dir/DependInfo.cmake --color= Scanning dependencies of target strings make[2]: Leaving directory '/tmp/B.xnuEsf/BUILD/mysql-5.7.22/build' /usr/bin/make -f strings/CMakeFiles/strings.dir/build.make strings/CMakeFiles/strings.dir/build make[2]: Entering directory '/tmp/B.xnuEsf/BUILD/mysql-5.7.22/build' /usr/bin/cmake -DCOMPILER=/usr/bin/i686-pld-linux-gcc -DSOURCE_DIR=/tmp/B.xnuEsf/BUILD/mysql-5.7.22 -DBINARY_DIR=/tmp/B.xnuEsf/BUILD/mysql-5.7.22/build "-DABI_HEADERS=/tmp/B.xnuEsf/BUILD/mysql-5.7.22/include/mysql/plugin_audit.h;/tmp/B.xnuEsf/BUILD/mysql-5.7.22/include/mysql/plugin_ftparser.h;/tmp/B.xnuEsf/BUILD/mysql-5.7.22/include/mysql.h;/tmp/B.xnuEsf/BUILD/mysql-5.7.22/include/mysql/psi/psi_abi_v0.h;/tmp/B.xnuEsf/BUILD/mysql-5.7.22/include/mysql/psi/psi_abi_v1.h;/tmp/B.xnuEsf/BUILD/mysql-5.7.22/include/mysql/psi/psi_abi_v2.h;/tmp/B.xnuEsf/BUILD/mysql-5.7.22/include/mysql/client_plugin.h;/tmp/B.xnuEsf/BUILD/mysql-5.7.22/include/mysql/plugin_auth.h;/tmp/B.xnuEsf/BUILD/mysql-5.7.22/include/mysql/services.h;/tmp/B.xnuEsf/BUILD/mysql-5.7.22/include/mysql/plugin_keyring.h" -P /tmp/B.xnuEsf/BUILD/mysql-5.7.22/cmake/do_abi_check.cmake make[2]: Leaving directory '/tmp/B.xnuEsf/BUILD/mysql-5.7.22/build' make[2]: Entering directory '/tmp/B.xnuEsf/BUILD/mysql-5.7.22/build' [ 0%] Generating include/probes_mysql_dtrace.h, include/probes_mysql_nodtrace.h /usr/bin/dtrace -h -s /tmp/B.xnuEsf/BUILD/mysql-5.7.22/build/include/probes_mysql.d -o /tmp/B.xnuEsf/BUILD/mysql-5.7.22/build/include/probes_mysql_dtrace.h perl /tmp/B.xnuEsf/BUILD/mysql-5.7.22/scripts/dheadgen.pl -f /tmp/B.xnuEsf/BUILD/mysql-5.7.22/build/include/probes_mysql.d > /tmp/B.xnuEsf/BUILD/mysql-5.7.22/build/include/probes_mysql_nodtrace.h make[2]: Leaving directory '/tmp/B.xnuEsf/BUILD/mysql-5.7.22/build' make[1]: Entering directory '/tmp/B.xnuEsf/BUILD/mysql-5.7.22/build' [ 1%] Built target gen_dtrace_header make[1]: Leaving directory '/tmp/B.xnuEsf/BUILD/mysql-5.7.22/build' /usr/bin/make -f libservices/CMakeFiles/mysqlservices.dir/build.make libservices/CMakeFiles/mysqlservices.dir/depend make[1]: Entering directory '/tmp/B.xnuEsf/BUILD/mysql-5.7.22/build' [ 1%] Built target abi_check make[1]: Leaving directory '/tmp/B.xnuEsf/BUILD/mysql-5.7.22/build' make[2]: Entering directory '/tmp/B.xnuEsf/BUILD/mysql-5.7.22/build' [ 1%] Building C object scripts/CMakeFiles/comp_sql.dir/comp_sql.c.o cd /tmp/B.xnuEsf/BUILD/mysql-5.7.22/build/scripts && /usr/bin/i686-pld-linux-gcc -DBOOST_GEOMETRY_SQRT_CHECK_FINITENESS -DHAVE_CONFIG_H -DHAVE_LIBEVENT2 -D_FILE_OFFSET_BITS=64 -D_GNU_SOURCE -I/tmp/B.xnuEsf/BUILD/mysql-5.7.22/build/include -I/tmp/B.xnuEsf/BUILD/mysql-5.7.22/extra/rapidjson/include -I/tmp/B.xnuEsf/BUILD/mysql-5.7.22/build/libbinlogevents/include -I/tmp/B.xnuEsf/BUILD/mysql-5.7.22/libbinlogevents/export -fPIC -Wall -Wextra -Wformat-security -Wvla -Wimplicit-fallthrough=2 -Wwrite-strings -Wdeclaration-after-statement -O3 -O2 -fwrapv -pipe -Wformat -Werror=format-security -gdwarf-4 -fno-debug-types-section -fvar-tracking-assignments -g2 -Wp,-D_FORTIFY_SOURCE=2 -fstack-protector-strong --param=ssp-buffer-size=4 -fomit-frame-pointer -march=i686 -fasynchronous-unwind-tables -mtune=pentium4 -gdwarf-4 -fno-debug-types-section -fvar-tracking-assignments -g2 -DNDEBUG -fno-omit-frame-pointer -fno-strict-aliasing -g -fabi-version=2 -fno-omit-frame-pointer -fno-strict-aliasing -ffp-contract=off -DDBUG_OFF -o CMakeFiles/comp_sql.dir/comp_sql.c.o -c /tmp/B.xnuEsf/BUILD/mysql-5.7.22/scripts/comp_sql.c make[2]: Leaving directory '/tmp/B.xnuEsf/BUILD/mysql-5.7.22/build' make[2]: Entering directory '/tmp/B.xnuEsf/BUILD/mysql-5.7.22/build' cd /tmp/B.xnuEsf/BUILD/mysql-5.7.22/build && /usr/bin/cmake -E cmake_depends "Unix Makefiles" /tmp/B.xnuEsf/BUILD/mysql-5.7.22 /tmp/B.xnuEsf/BUILD/mysql-5.7.22/libservices /tmp/B.xnuEsf/BUILD/mysql-5.7.22/build /tmp/B.xnuEsf/BUILD/mysql-5.7.22/build/libservices /tmp/B.xnuEsf/BUILD/mysql-5.7.22/build/libservices/CMakeFiles/mysqlservices.dir/DependInfo.cmake --color= Scanning dependencies of target mysqlservices make[2]: Leaving directory '/tmp/B.xnuEsf/BUILD/mysql-5.7.22/build' /usr/bin/make -f libservices/CMakeFiles/mysqlservices.dir/build.make libservices/CMakeFiles/mysqlservices.dir/build make[2]: Entering directory '/tmp/B.xnuEsf/BUILD/mysql-5.7.22/build' [ 1%] Building C object strings/CMakeFiles/strings.dir/bchange.c.o cd /tmp/B.xnuEsf/BUILD/mysql-5.7.22/build/strings && /usr/bin/i686-pld-linux-gcc -DBOOST_GEOMETRY_SQRT_CHECK_FINITENESS -DDISABLE_MYSQL_THREAD_H -DHAVE_CONFIG_H -DHAVE_LIBEVENT2 -D_FILE_OFFSET_BITS=64 -D_GNU_SOURCE -I/tmp/B.xnuEsf/BUILD/mysql-5.7.22/build/include -I/tmp/B.xnuEsf/BUILD/mysql-5.7.22/extra/rapidjson/include -I/tmp/B.xnuEsf/BUILD/mysql-5.7.22/build/libbinlogevents/include -I/tmp/B.xnuEsf/BUILD/mysql-5.7.22/libbinlogevents/export -I/tmp/B.xnuEsf/BUILD/mysql-5.7.22/include -fPIC -Wall -Wextra -Wformat-security -Wvla -Wimplicit-fallthrough=2 -Wwrite-strings -Wdeclaration-after-statement -O3 -O2 -fwrapv -pipe -Wformat -Werror=format-security -gdwarf-4 -fno-debug-types-section -fvar-tracking-assignments -g2 -Wp,-D_FORTIFY_SOURCE=2 -fstack-protector-strong --param=ssp-buffer-size=4 -fomit-frame-pointer -march=i686 -fasynchronous-unwind-tables -mtune=pentium4 -gdwarf-4 -fno-debug-types-section -fvar-tracking-assignments -g2 -DNDEBUG -fno-omit-frame-pointer -fno-strict-aliasing -g -fabi-version=2 -fno-omit-frame-pointer -fno-strict-aliasing -ffp-contract=off -DDBUG_OFF -o CMakeFiles/strings.dir/bchange.c.o -c /tmp/B.xnuEsf/BUILD/mysql-5.7.22/strings/bchange.c make[2]: Leaving directory '/tmp/B.xnuEsf/BUILD/mysql-5.7.22/build' make[2]: Entering directory '/tmp/B.xnuEsf/BUILD/mysql-5.7.22/build' [ 1%] Linking C executable comp_sql cd /tmp/B.xnuEsf/BUILD/mysql-5.7.22/build/scripts && /usr/bin/cmake -E cmake_link_script CMakeFiles/comp_sql.dir/link.txt --verbose=1 /usr/bin/i686-pld-linux-gcc -fPIC -Wall -Wextra -Wformat-security -Wvla -Wimplicit-fallthrough=2 -Wwrite-strings -Wdeclaration-after-statement -O3 -O2 -fwrapv -pipe -Wformat -Werror=format-security -gdwarf-4 -fno-debug-types-section -fvar-tracking-assignments -g2 -Wp,-D_FORTIFY_SOURCE=2 -fstack-protector-strong --param=ssp-buffer-size=4 -fomit-frame-pointer -march=i686 -fasynchronous-unwind-tables -mtune=pentium4 -gdwarf-4 -fno-debug-types-section -fvar-tracking-assignments -g2 -DNDEBUG -fno-omit-frame-pointer -fno-strict-aliasing -g -fabi-version=2 -fno-omit-frame-pointer -fno-strict-aliasing -ffp-contract=off -DDBUG_OFF CMakeFiles/comp_sql.dir/comp_sql.c.o -o comp_sql -lpthread make[2]: Leaving directory '/tmp/B.xnuEsf/BUILD/mysql-5.7.22/build' make[2]: Entering directory '/tmp/B.xnuEsf/BUILD/mysql-5.7.22/build' [ 1%] Building C object libservices/CMakeFiles/mysqlservices.dir/service_command.c.o cd /tmp/B.xnuEsf/BUILD/mysql-5.7.22/build/libservices && /usr/bin/i686-pld-linux-gcc -DBOOST_GEOMETRY_SQRT_CHECK_FINITENESS -DHAVE_CONFIG_H -DHAVE_LIBEVENT2 -D_FILE_OFFSET_BITS=64 -D_GNU_SOURCE -I/tmp/B.xnuEsf/BUILD/mysql-5.7.22/build/include -I/tmp/B.xnuEsf/BUILD/mysql-5.7.22/extra/rapidjson/include -I/tmp/B.xnuEsf/BUILD/mysql-5.7.22/build/libbinlogevents/include -I/tmp/B.xnuEsf/BUILD/mysql-5.7.22/libbinlogevents/export -I/tmp/B.xnuEsf/BUILD/mysql-5.7.22/include -fPIC -Wall -Wextra -Wformat-security -Wvla -Wimplicit-fallthrough=2 -Wwrite-strings -Wdeclaration-after-statement -O3 -O2 -fwrapv -pipe -Wformat -Werror=format-security -gdwarf-4 -fno-debug-types-section -fvar-tracking-assignments -g2 -Wp,-D_FORTIFY_SOURCE=2 -fstack-protector-strong --param=ssp-buffer-size=4 -fomit-frame-pointer -march=i686 -fasynchronous-unwind-tables -mtune=pentium4 -gdwarf-4 -fno-debug-types-section -fvar-tracking-assignments -g2 -DNDEBUG -fno-omit-frame-pointer -fno-strict-aliasing -g -fabi-version=2 -fno-omit-frame-pointer -fno-strict-aliasing -ffp-contract=off -DDBUG_OFF -o CMakeFiles/mysqlservices.dir/service_command.c.o -c /tmp/B.xnuEsf/BUILD/mysql-5.7.22/libservices/service_command.c make[2]: Leaving directory '/tmp/B.xnuEsf/BUILD/mysql-5.7.22/build' make[1]: Entering directory '/tmp/B.xnuEsf/BUILD/mysql-5.7.22/build' [ 1%] Built target comp_sql make[1]: Leaving directory '/tmp/B.xnuEsf/BUILD/mysql-5.7.22/build' make[2]: Entering directory '/tmp/B.xnuEsf/BUILD/mysql-5.7.22/build' [ 1%] Building C object libservices/CMakeFiles/mysqlservices.dir/locking_service.c.o cd /tmp/B.xnuEsf/BUILD/mysql-5.7.22/build/libservices && /usr/bin/i686-pld-linux-gcc -DBOOST_GEOMETRY_SQRT_CHECK_FINITENESS -DHAVE_CONFIG_H -DHAVE_LIBEVENT2 -D_FILE_OFFSET_BITS=64 -D_GNU_SOURCE -I/tmp/B.xnuEsf/BUILD/mysql-5.7.22/build/include -I/tmp/B.xnuEsf/BUILD/mysql-5.7.22/extra/rapidjson/include -I/tmp/B.xnuEsf/BUILD/mysql-5.7.22/build/libbinlogevents/include -I/tmp/B.xnuEsf/BUILD/mysql-5.7.22/libbinlogevents/export -I/tmp/B.xnuEsf/BUILD/mysql-5.7.22/include -fPIC -Wall -Wextra -Wformat-security -Wvla -Wimplicit-fallthrough=2 -Wwrite-strings -Wdeclaration-after-statement -O3 -O2 -fwrapv -pipe -Wformat -Werror=format-security -gdwarf-4 -fno-debug-types-section -fvar-tracking-assignments -g2 -Wp,-D_FORTIFY_SOURCE=2 -fstack-protector-strong --param=ssp-buffer-size=4 -fomit-frame-pointer -march=i686 -fasynchronous-unwind-tables -mtune=pentium4 -gdwarf-4 -fno-debug-types-section -fvar-tracking-assignments -g2 -DNDEBUG -fno-omit-frame-pointer -fno-strict-aliasing -g -fabi-version=2 -fno-omit-frame-pointer -fno-strict-aliasing -ffp-contract=off -DDBUG_OFF -o CMakeFiles/mysqlservices.dir/locking_service.c.o -c /tmp/B.xnuEsf/BUILD/mysql-5.7.22/libservices/locking_service.c make[2]: Leaving directory '/tmp/B.xnuEsf/BUILD/mysql-5.7.22/build' make[2]: Entering directory '/tmp/B.xnuEsf/BUILD/mysql-5.7.22/build' [ 1%] Building C object libservices/CMakeFiles/mysqlservices.dir/srv_session_service.c.o cd /tmp/B.xnuEsf/BUILD/mysql-5.7.22/build/libservices && /usr/bin/i686-pld-linux-gcc -DBOOST_GEOMETRY_SQRT_CHECK_FINITENESS -DHAVE_CONFIG_H -DHAVE_LIBEVENT2 -D_FILE_OFFSET_BITS=64 -D_GNU_SOURCE -I/tmp/B.xnuEsf/BUILD/mysql-5.7.22/build/include -I/tmp/B.xnuEsf/BUILD/mysql-5.7.22/extra/rapidjson/include -I/tmp/B.xnuEsf/BUILD/mysql-5.7.22/build/libbinlogevents/include -I/tmp/B.xnuEsf/BUILD/mysql-5.7.22/libbinlogevents/export -I/tmp/B.xnuEsf/BUILD/mysql-5.7.22/include -fPIC -Wall -Wextra -Wformat-security -Wvla -Wimplicit-fallthrough=2 -Wwrite-strings -Wdeclaration-after-statement -O3 -O2 -fwrapv -pipe -Wformat -Werror=format-security -gdwarf-4 -fno-debug-types-section -fvar-tracking-assignments -g2 -Wp,-D_FORTIFY_SOURCE=2 -fstack-protector-strong --param=ssp-buffer-size=4 -fomit-frame-pointer -march=i686 -fasynchronous-unwind-tables -mtune=pentium4 -gdwarf-4 -fno-debug-types-section -fvar-tracking-assignments -g2 -DNDEBUG -fno-omit-frame-pointer -fno-strict-aliasing -g -fabi-version=2 -fno-omit-frame-pointer -fno-strict-aliasing -ffp-contract=off -DDBUG_OFF -o CMakeFiles/mysqlservices.dir/srv_session_service.c.o -c /tmp/B.xnuEsf/BUILD/mysql-5.7.22/libservices/srv_session_service.c make[2]: Leaving directory '/tmp/B.xnuEsf/BUILD/mysql-5.7.22/build' make[2]: Entering directory '/tmp/B.xnuEsf/BUILD/mysql-5.7.22/build' [ 1%] Building C object libservices/CMakeFiles/mysqlservices.dir/my_snprintf_service.c.o cd /tmp/B.xnuEsf/BUILD/mysql-5.7.22/build/libservices && /usr/bin/i686-pld-linux-gcc -DBOOST_GEOMETRY_SQRT_CHECK_FINITENESS -DHAVE_CONFIG_H -DHAVE_LIBEVENT2 -D_FILE_OFFSET_BITS=64 -D_GNU_SOURCE -I/tmp/B.xnuEsf/BUILD/mysql-5.7.22/build/include -I/tmp/B.xnuEsf/BUILD/mysql-5.7.22/extra/rapidjson/include -I/tmp/B.xnuEsf/BUILD/mysql-5.7.22/build/libbinlogevents/include -I/tmp/B.xnuEsf/BUILD/mysql-5.7.22/libbinlogevents/export -I/tmp/B.xnuEsf/BUILD/mysql-5.7.22/include -fPIC -Wall -Wextra -Wformat-security -Wvla -Wimplicit-fallthrough=2 -Wwrite-strings -Wdeclaration-after-statement -O3 -O2 -fwrapv -pipe -Wformat -Werror=format-security -gdwarf-4 -fno-debug-types-section -fvar-tracking-assignments -g2 -Wp,-D_FORTIFY_SOURCE=2 -fstack-protector-strong --param=ssp-buffer-size=4 -fomit-frame-pointer -march=i686 -fasynchronous-unwind-tables -mtune=pentium4 -gdwarf-4 -fno-debug-types-section -fvar-tracking-assignments -g2 -DNDEBUG -fno-omit-frame-pointer -fno-strict-aliasing -g -fabi-version=2 -fno-omit-frame-pointer -fno-strict-aliasing -ffp-contract=off -DDBUG_OFF -o CMakeFiles/mysqlservices.dir/my_snprintf_service.c.o -c /tmp/B.xnuEsf/BUILD/mysql-5.7.22/libservices/my_snprintf_service.c make[2]: Leaving directory '/tmp/B.xnuEsf/BUILD/mysql-5.7.22/build' make[2]: Entering directory '/tmp/B.xnuEsf/BUILD/mysql-5.7.22/build' [ 1%] Building C object regex/CMakeFiles/regex.dir/regerror.c.o cd /tmp/B.xnuEsf/BUILD/mysql-5.7.22/build/regex && /usr/bin/i686-pld-linux-gcc -DBOOST_GEOMETRY_SQRT_CHECK_FINITENESS -DHAVE_CONFIG_H -DHAVE_LIBEVENT2 -D_FILE_OFFSET_BITS=64 -D_GNU_SOURCE -I/tmp/B.xnuEsf/BUILD/mysql-5.7.22/build/include -I/tmp/B.xnuEsf/BUILD/mysql-5.7.22/extra/rapidjson/include -I/tmp/B.xnuEsf/BUILD/mysql-5.7.22/build/libbinlogevents/include -I/tmp/B.xnuEsf/BUILD/mysql-5.7.22/libbinlogevents/export -I/tmp/B.xnuEsf/BUILD/mysql-5.7.22/include -fPIC -Wall -Wextra -Wformat-security -Wvla -Wimplicit-fallthrough=2 -Wwrite-strings -Wdeclaration-after-statement -O3 -O2 -fwrapv -pipe -Wformat -Werror=format-security -gdwarf-4 -fno-debug-types-section -fvar-tracking-assignments -g2 -Wp,-D_FORTIFY_SOURCE=2 -fstack-protector-strong --param=ssp-buffer-size=4 -fomit-frame-pointer -march=i686 -fasynchronous-unwind-tables -mtune=pentium4 -gdwarf-4 -fno-debug-types-section -fvar-tracking-assignments -g2 -DNDEBUG -fno-omit-frame-pointer -fno-strict-aliasing -g -fabi-version=2 -fno-omit-frame-pointer -fno-strict-aliasing -ffp-contract=off -DDBUG_OFF -o CMakeFiles/regex.dir/regerror.c.o -c /tmp/B.xnuEsf/BUILD/mysql-5.7.22/regex/regerror.c make[2]: Leaving directory '/tmp/B.xnuEsf/BUILD/mysql-5.7.22/build' make[2]: Entering directory '/tmp/B.xnuEsf/BUILD/mysql-5.7.22/build' [ 1%] Building C object vio/CMakeFiles/vio.dir/vio.c.o cd /tmp/B.xnuEsf/BUILD/mysql-5.7.22/build/vio && /usr/bin/i686-pld-linux-gcc -DBOOST_GEOMETRY_SQRT_CHECK_FINITENESS -DHAVE_CONFIG_H -DHAVE_LIBEVENT2 -DHAVE_OPENSSL -D_FILE_OFFSET_BITS=64 -D_GNU_SOURCE -I/tmp/B.xnuEsf/BUILD/mysql-5.7.22/build/include -I/tmp/B.xnuEsf/BUILD/mysql-5.7.22/extra/rapidjson/include -I/tmp/B.xnuEsf/BUILD/mysql-5.7.22/build/libbinlogevents/include -I/tmp/B.xnuEsf/BUILD/mysql-5.7.22/libbinlogevents/export -I/tmp/B.xnuEsf/BUILD/mysql-5.7.22/include -fPIC -Wall -Wextra -Wformat-security -Wvla -Wimplicit-fallthrough=2 -Wwrite-strings -Wdeclaration-after-statement -O3 -O2 -fwrapv -pipe -Wformat -Werror=format-security -gdwarf-4 -fno-debug-types-section -fvar-tracking-assignments -g2 -Wp,-D_FORTIFY_SOURCE=2 -fstack-protector-strong --param=ssp-buffer-size=4 -fomit-frame-pointer -march=i686 -fasynchronous-unwind-tables -mtune=pentium4 -gdwarf-4 -fno-debug-types-section -fvar-tracking-assignments -g2 -DNDEBUG -fno-omit-frame-pointer -fno-strict-aliasing -g -fabi-version=2 -fno-omit-frame-pointer -fno-strict-aliasing -ffp-contract=off -DDBUG_OFF -o CMakeFiles/vio.dir/vio.c.o -c /tmp/B.xnuEsf/BUILD/mysql-5.7.22/vio/vio.c make[2]: Leaving directory '/tmp/B.xnuEsf/BUILD/mysql-5.7.22/build' make[2]: Entering directory '/tmp/B.xnuEsf/BUILD/mysql-5.7.22/build' [ 1%] Building CXX object sql/CMakeFiles/gen_lex_hash.dir/gen_lex_hash.cc.o cd /tmp/B.xnuEsf/BUILD/mysql-5.7.22/build/sql && /usr/bin/i686-pld-linux-g++ -DBOOST_GEOMETRY_SQRT_CHECK_FINITENESS -DHAVE_CONFIG_H -DHAVE_LIBEVENT2 -DHAVE_OPENSSL -DHAVE_REPLICATION -DMYSQL_SERVER -D_FILE_OFFSET_BITS=64 -D_GNU_SOURCE -I/tmp/B.xnuEsf/BUILD/mysql-5.7.22/build/include -I/tmp/B.xnuEsf/BUILD/mysql-5.7.22/extra/rapidjson/include -I/tmp/B.xnuEsf/BUILD/mysql-5.7.22/build/libbinlogevents/include -I/tmp/B.xnuEsf/BUILD/mysql-5.7.22/libbinlogevents/export -I/tmp/B.xnuEsf/BUILD/mysql-5.7.22/include -I/tmp/B.xnuEsf/BUILD/mysql-5.7.22/sql/conn_handler -I/tmp/B.xnuEsf/BUILD/mysql-5.7.22/libbinlogevents/include -I/tmp/B.xnuEsf/BUILD/mysql-5.7.22/sql -I/tmp/B.xnuEsf/BUILD/mysql-5.7.22/sql/auth -I/tmp/B.xnuEsf/BUILD/mysql-5.7.22/regex -I/tmp/B.xnuEsf/BUILD/mysql-5.7.22/build/sql -fPIC -Wall -Wextra -Wformat-security -Wvla -Wimplicit-fallthrough=2 -Woverloaded-virtual -Wno-unused-parameter -O3 -O2 -fwrapv -pipe -Wformat -Werror=format-security -gdwarf-4 -fno-debug-types-section -fvar-tracking-assignments -g2 -Wp,-D_FORTIFY_SOURCE=2 -fstack-protector-strong --param=ssp-buffer-size=4 -fomit-frame-pointer -march=i686 -fasynchronous-unwind-tables -mtune=pentium4 -gdwarf-4 -fno-debug-types-section -fvar-tracking-assignments -g2 -DNDEBUG -fno-omit-frame-pointer -fno-strict-aliasing -g -fabi-version=2 -fno-omit-frame-pointer -fno-strict-aliasing -std=gnu++03 -ffp-contract=off -DDBUG_OFF -o CMakeFiles/gen_lex_hash.dir/gen_lex_hash.cc.o -c /tmp/B.xnuEsf/BUILD/mysql-5.7.22/sql/gen_lex_hash.cc make[2]: Leaving directory '/tmp/B.xnuEsf/BUILD/mysql-5.7.22/build' make[2]: Entering directory '/tmp/B.xnuEsf/BUILD/mysql-5.7.22/build' [ 2%] Linking CXX executable gen_lex_hash cd /tmp/B.xnuEsf/BUILD/mysql-5.7.22/build/sql && /usr/bin/cmake -E cmake_link_script CMakeFiles/gen_lex_hash.dir/link.txt --verbose=1 /usr/bin/i686-pld-linux-g++ -fPIC -Wall -Wextra -Wformat-security -Wvla -Wimplicit-fallthrough=2 -Woverloaded-virtual -Wno-unused-parameter -O3 -O2 -fwrapv -pipe -Wformat -Werror=format-security -gdwarf-4 -fno-debug-types-section -fvar-tracking-assignments -g2 -Wp,-D_FORTIFY_SOURCE=2 -fstack-protector-strong --param=ssp-buffer-size=4 -fomit-frame-pointer -march=i686 -fasynchronous-unwind-tables -mtune=pentium4 -gdwarf-4 -fno-debug-types-section -fvar-tracking-assignments -g2 -DNDEBUG -fno-omit-frame-pointer -fno-strict-aliasing -g -fabi-version=2 -fno-omit-frame-pointer -fno-strict-aliasing -std=gnu++03 -ffp-contract=off -DDBUG_OFF CMakeFiles/gen_lex_hash.dir/gen_lex_hash.cc.o -o gen_lex_hash -lpthread make[2]: Leaving directory '/tmp/B.xnuEsf/BUILD/mysql-5.7.22/build' make[1]: Entering directory '/tmp/B.xnuEsf/BUILD/mysql-5.7.22/build' [ 2%] Built target gen_lex_hash make[1]: Leaving directory '/tmp/B.xnuEsf/BUILD/mysql-5.7.22/build' make[2]: Entering directory '/tmp/B.xnuEsf/BUILD/mysql-5.7.22/build' [ 0%] Building CXX object libbinlogstandalone/src/CMakeFiles/binlogstandalone_static.dir/__/__/libbinlogevents/src/load_data_events.cpp.o cd /tmp/B.xnuEsf/BUILD/mysql-5.7.22/build/libbinlogstandalone/src && /usr/bin/i686-pld-linux-g++ -DBOOST_GEOMETRY_SQRT_CHECK_FINITENESS -DHAVE_CONFIG_H -DHAVE_LIBEVENT2 -DSTANDALONE_BINLOG -D_FILE_OFFSET_BITS=64 -D_GNU_SOURCE -I/tmp/B.xnuEsf/BUILD/mysql-5.7.22/build/include -I/tmp/B.xnuEsf/BUILD/mysql-5.7.22/extra/rapidjson/include -I/tmp/B.xnuEsf/BUILD/mysql-5.7.22/build/libbinlogevents/include -I/tmp/B.xnuEsf/BUILD/mysql-5.7.22/libbinlogevents/export -I/tmp/B.xnuEsf/BUILD/mysql-5.7.22/include -I/tmp/B.xnuEsf/BUILD/mysql-5.7.22/libbinlogevents/include -I/tmp/B.xnuEsf/BUILD/mysql-5.7.22/build/libbinlogstandalone/../libbinlogevents/include -I/tmp/B.xnuEsf/BUILD/mysql-5.7.22/build/libbinlogstandalone/libbinlogevents/export -fPIC -Wall -Wextra -Wformat-security -Wvla -Wimplicit-fallthrough=2 -Woverloaded-virtual -Wno-unused-parameter -O3 -O2 -fwrapv -pipe -Wformat -Werror=format-security -gdwarf-4 -fno-debug-types-section -fvar-tracking-assignments -g2 -Wp,-D_FORTIFY_SOURCE=2 -fstack-protector-strong --param=ssp-buffer-size=4 -fomit-frame-pointer -march=i686 -fasynchronous-unwind-tables -mtune=pentium4 -gdwarf-4 -fno-debug-types-section -fvar-tracking-assignments -g2 -DNDEBUG -fno-omit-frame-pointer -fno-strict-aliasing -g -fabi-version=2 -fno-omit-frame-pointer -fno-strict-aliasing -std=gnu++03 -ffp-contract=off -DDBUG_OFF -o CMakeFiles/binlogstandalone_static.dir/__/__/libbinlogevents/src/load_data_events.cpp.o -c /tmp/B.xnuEsf/BUILD/mysql-5.7.22/libbinlogevents/src/load_data_events.cpp make[2]: Leaving directory '/tmp/B.xnuEsf/BUILD/mysql-5.7.22/build' make[2]: Entering directory '/tmp/B.xnuEsf/BUILD/mysql-5.7.22/build' [ 1%] Building CXX object libbinlogstandalone/src/CMakeFiles/binlogstandalone_shared.dir/__/__/libbinlogevents/src/load_data_events.cpp.o cd /tmp/B.xnuEsf/BUILD/mysql-5.7.22/build/libbinlogstandalone/src && /usr/bin/i686-pld-linux-g++ -DBOOST_GEOMETRY_SQRT_CHECK_FINITENESS -DHAVE_CONFIG_H -DHAVE_LIBEVENT2 -DSTANDALONE_BINLOG -D_FILE_OFFSET_BITS=64 -D_GNU_SOURCE -Dbinlogstandalone_shared_EXPORTS -I/tmp/B.xnuEsf/BUILD/mysql-5.7.22/build/include -I/tmp/B.xnuEsf/BUILD/mysql-5.7.22/extra/rapidjson/include -I/tmp/B.xnuEsf/BUILD/mysql-5.7.22/build/libbinlogevents/include -I/tmp/B.xnuEsf/BUILD/mysql-5.7.22/libbinlogevents/export -I/tmp/B.xnuEsf/BUILD/mysql-5.7.22/include -I/tmp/B.xnuEsf/BUILD/mysql-5.7.22/libbinlogevents/include -I/tmp/B.xnuEsf/BUILD/mysql-5.7.22/build/libbinlogstandalone/../libbinlogevents/include -I/tmp/B.xnuEsf/BUILD/mysql-5.7.22/build/libbinlogstandalone/libbinlogevents/export -fPIC -Wall -Wextra -Wformat-security -Wvla -Wimplicit-fallthrough=2 -Woverloaded-virtual -Wno-unused-parameter -O3 -O2 -fwrapv -pipe -Wformat -Werror=format-security -gdwarf-4 -fno-debug-types-section -fvar-tracking-assignments -g2 -Wp,-D_FORTIFY_SOURCE=2 -fstack-protector-strong --param=ssp-buffer-size=4 -fomit-frame-pointer -march=i686 -fasynchronous-unwind-tables -mtune=pentium4 -gdwarf-4 -fno-debug-types-section -fvar-tracking-assignments -g2 -DNDEBUG -fno-omit-frame-pointer -fno-strict-aliasing -g -fabi-version=2 -fno-omit-frame-pointer -fno-strict-aliasing -std=gnu++03 -ffp-contract=off -DDBUG_OFF -fPIC -o CMakeFiles/binlogstandalone_shared.dir/__/__/libbinlogevents/src/load_data_events.cpp.o -c /tmp/B.xnuEsf/BUILD/mysql-5.7.22/libbinlogevents/src/load_data_events.cpp make[2]: Leaving directory '/tmp/B.xnuEsf/BUILD/mysql-5.7.22/build' make[2]: Entering directory '/tmp/B.xnuEsf/BUILD/mysql-5.7.22/build' [ 0%] Building C object regex/CMakeFiles/regex.dir/regcomp.c.o cd /tmp/B.xnuEsf/BUILD/mysql-5.7.22/build/regex && /usr/bin/i686-pld-linux-gcc -DBOOST_GEOMETRY_SQRT_CHECK_FINITENESS -DHAVE_CONFIG_H -DHAVE_LIBEVENT2 -D_FILE_OFFSET_BITS=64 -D_GNU_SOURCE -I/tmp/B.xnuEsf/BUILD/mysql-5.7.22/build/include -I/tmp/B.xnuEsf/BUILD/mysql-5.7.22/extra/rapidjson/include -I/tmp/B.xnuEsf/BUILD/mysql-5.7.22/build/libbinlogevents/include -I/tmp/B.xnuEsf/BUILD/mysql-5.7.22/libbinlogevents/export -I/tmp/B.xnuEsf/BUILD/mysql-5.7.22/include -fPIC -Wall -Wextra -Wformat-security -Wvla -Wimplicit-fallthrough=2 -Wwrite-strings -Wdeclaration-after-statement -O3 -O2 -fwrapv -pipe -Wformat -Werror=format-security -gdwarf-4 -fno-debug-types-section -fvar-tracking-assignments -g2 -Wp,-D_FORTIFY_SOURCE=2 -fstack-protector-strong --param=ssp-buffer-size=4 -fomit-frame-pointer -march=i686 -fasynchronous-unwind-tables -mtune=pentium4 -gdwarf-4 -fno-debug-types-section -fvar-tracking-assignments -g2 -DNDEBUG -fno-omit-frame-pointer -fno-strict-aliasing -g -fabi-version=2 -fno-omit-frame-pointer -fno-strict-aliasing -ffp-contract=off -DDBUG_OFF -o CMakeFiles/regex.dir/regcomp.c.o -c /tmp/B.xnuEsf/BUILD/mysql-5.7.22/regex/regcomp.c make[2]: Leaving directory '/tmp/B.xnuEsf/BUILD/mysql-5.7.22/build' make[2]: Entering directory '/tmp/B.xnuEsf/BUILD/mysql-5.7.22/build' [ 1%] Building C object libservices/CMakeFiles/mysqlservices.dir/thd_alloc_service.c.o cd /tmp/B.xnuEsf/BUILD/mysql-5.7.22/build/libservices && /usr/bin/i686-pld-linux-gcc -DBOOST_GEOMETRY_SQRT_CHECK_FINITENESS -DHAVE_CONFIG_H -DHAVE_LIBEVENT2 -D_FILE_OFFSET_BITS=64 -D_GNU_SOURCE -I/tmp/B.xnuEsf/BUILD/mysql-5.7.22/build/include -I/tmp/B.xnuEsf/BUILD/mysql-5.7.22/extra/rapidjson/include -I/tmp/B.xnuEsf/BUILD/mysql-5.7.22/build/libbinlogevents/include -I/tmp/B.xnuEsf/BUILD/mysql-5.7.22/libbinlogevents/export -I/tmp/B.xnuEsf/BUILD/mysql-5.7.22/include -fPIC -Wall -Wextra -Wformat-security -Wvla -Wimplicit-fallthrough=2 -Wwrite-strings -Wdeclaration-after-statement -O3 -O2 -fwrapv -pipe -Wformat -Werror=format-security -gdwarf-4 -fno-debug-types-section -fvar-tracking-assignments -g2 -Wp,-D_FORTIFY_SOURCE=2 -fstack-protector-strong --param=ssp-buffer-size=4 -fomit-frame-pointer -march=i686 -fasynchronous-unwind-tables -mtune=pentium4 -gdwarf-4 -fno-debug-types-section -fvar-tracking-assignments -g2 -DNDEBUG -fno-omit-frame-pointer -fno-strict-aliasing -g -fabi-version=2 -fno-omit-frame-pointer -fno-strict-aliasing -ffp-contract=off -DDBUG_OFF -o CMakeFiles/mysqlservices.dir/thd_alloc_service.c.o -c /tmp/B.xnuEsf/BUILD/mysql-5.7.22/libservices/thd_alloc_service.c make[2]: Leaving directory '/tmp/B.xnuEsf/BUILD/mysql-5.7.22/build' make[2]: Entering directory '/tmp/B.xnuEsf/BUILD/mysql-5.7.22/build' [ 2%] Building C object libservices/CMakeFiles/mysqlservices.dir/thd_wait_service.c.o cd /tmp/B.xnuEsf/BUILD/mysql-5.7.22/build/libservices && /usr/bin/i686-pld-linux-gcc -DBOOST_GEOMETRY_SQRT_CHECK_FINITENESS -DHAVE_CONFIG_H -DHAVE_LIBEVENT2 -D_FILE_OFFSET_BITS=64 -D_GNU_SOURCE -I/tmp/B.xnuEsf/BUILD/mysql-5.7.22/build/include -I/tmp/B.xnuEsf/BUILD/mysql-5.7.22/extra/rapidjson/include -I/tmp/B.xnuEsf/BUILD/mysql-5.7.22/build/libbinlogevents/include -I/tmp/B.xnuEsf/BUILD/mysql-5.7.22/libbinlogevents/export -I/tmp/B.xnuEsf/BUILD/mysql-5.7.22/include -fPIC -Wall -Wextra -Wformat-security -Wvla -Wimplicit-fallthrough=2 -Wwrite-strings -Wdeclaration-after-statement -O3 -O2 -fwrapv -pipe -Wformat -Werror=format-security -gdwarf-4 -fno-debug-types-section -fvar-tracking-assignments -g2 -Wp,-D_FORTIFY_SOURCE=2 -fstack-protector-strong --param=ssp-buffer-size=4 -fomit-frame-pointer -march=i686 -fasynchronous-unwind-tables -mtune=pentium4 -gdwarf-4 -fno-debug-types-section -fvar-tracking-assignments -g2 -DNDEBUG -fno-omit-frame-pointer -fno-strict-aliasing -g -fabi-version=2 -fno-omit-frame-pointer -fno-strict-aliasing -ffp-contract=off -DDBUG_OFF -o CMakeFiles/mysqlservices.dir/thd_wait_service.c.o -c /tmp/B.xnuEsf/BUILD/mysql-5.7.22/libservices/thd_wait_service.c make[2]: Leaving directory '/tmp/B.xnuEsf/BUILD/mysql-5.7.22/build' make[2]: Entering directory '/tmp/B.xnuEsf/BUILD/mysql-5.7.22/build' [ 2%] Building C object vio/CMakeFiles/vio.dir/viosocket.c.o cd /tmp/B.xnuEsf/BUILD/mysql-5.7.22/build/vio && /usr/bin/i686-pld-linux-gcc -DBOOST_GEOMETRY_SQRT_CHECK_FINITENESS -DHAVE_CONFIG_H -DHAVE_LIBEVENT2 -DHAVE_OPENSSL -D_FILE_OFFSET_BITS=64 -D_GNU_SOURCE -I/tmp/B.xnuEsf/BUILD/mysql-5.7.22/build/include -I/tmp/B.xnuEsf/BUILD/mysql-5.7.22/extra/rapidjson/include -I/tmp/B.xnuEsf/BUILD/mysql-5.7.22/build/libbinlogevents/include -I/tmp/B.xnuEsf/BUILD/mysql-5.7.22/libbinlogevents/export -I/tmp/B.xnuEsf/BUILD/mysql-5.7.22/include -fPIC -Wall -Wextra -Wformat-security -Wvla -Wimplicit-fallthrough=2 -Wwrite-strings -Wdeclaration-after-statement -O3 -O2 -fwrapv -pipe -Wformat -Werror=format-security -gdwarf-4 -fno-debug-types-section -fvar-tracking-assignments -g2 -Wp,-D_FORTIFY_SOURCE=2 -fstack-protector-strong --param=ssp-buffer-size=4 -fomit-frame-pointer -march=i686 -fasynchronous-unwind-tables -mtune=pentium4 -gdwarf-4 -fno-debug-types-section -fvar-tracking-assignments -g2 -DNDEBUG -fno-omit-frame-pointer -fno-strict-aliasing -g -fabi-version=2 -fno-omit-frame-pointer -fno-strict-aliasing -ffp-contract=off -DDBUG_OFF -o CMakeFiles/vio.dir/viosocket.c.o -c /tmp/B.xnuEsf/BUILD/mysql-5.7.22/vio/viosocket.c make[2]: Leaving directory '/tmp/B.xnuEsf/BUILD/mysql-5.7.22/build' make[2]: Entering directory '/tmp/B.xnuEsf/BUILD/mysql-5.7.22/build' [ 2%] Building C object libservices/CMakeFiles/mysqlservices.dir/my_plugin_log_service.c.o cd /tmp/B.xnuEsf/BUILD/mysql-5.7.22/build/libservices && /usr/bin/i686-pld-linux-gcc -DBOOST_GEOMETRY_SQRT_CHECK_FINITENESS -DHAVE_CONFIG_H -DHAVE_LIBEVENT2 -D_FILE_OFFSET_BITS=64 -D_GNU_SOURCE -I/tmp/B.xnuEsf/BUILD/mysql-5.7.22/build/include -I/tmp/B.xnuEsf/BUILD/mysql-5.7.22/extra/rapidjson/include -I/tmp/B.xnuEsf/BUILD/mysql-5.7.22/build/libbinlogevents/include -I/tmp/B.xnuEsf/BUILD/mysql-5.7.22/libbinlogevents/export -I/tmp/B.xnuEsf/BUILD/mysql-5.7.22/include -fPIC -Wall -Wextra -Wformat-security -Wvla -Wimplicit-fallthrough=2 -Wwrite-strings -Wdeclaration-after-statement -O3 -O2 -fwrapv -pipe -Wformat -Werror=format-security -gdwarf-4 -fno-debug-types-section -fvar-tracking-assignments -g2 -Wp,-D_FORTIFY_SOURCE=2 -fstack-protector-strong --param=ssp-buffer-size=4 -fomit-frame-pointer -march=i686 -fasynchronous-unwind-tables -mtune=pentium4 -gdwarf-4 -fno-debug-types-section -fvar-tracking-assignments -g2 -DNDEBUG -fno-omit-frame-pointer -fno-strict-aliasing -g -fabi-version=2 -fno-omit-frame-pointer -fno-strict-aliasing -ffp-contract=off -DDBUG_OFF -o CMakeFiles/mysqlservices.dir/my_plugin_log_service.c.o -c /tmp/B.xnuEsf/BUILD/mysql-5.7.22/libservices/my_plugin_log_service.c make[2]: Leaving directory '/tmp/B.xnuEsf/BUILD/mysql-5.7.22/build' make[2]: Entering directory '/tmp/B.xnuEsf/BUILD/mysql-5.7.22/build' [ 2%] Building C object libservices/CMakeFiles/mysqlservices.dir/my_thread_scheduler_service.c.o cd /tmp/B.xnuEsf/BUILD/mysql-5.7.22/build/libservices && /usr/bin/i686-pld-linux-gcc -DBOOST_GEOMETRY_SQRT_CHECK_FINITENESS -DHAVE_CONFIG_H -DHAVE_LIBEVENT2 -D_FILE_OFFSET_BITS=64 -D_GNU_SOURCE -I/tmp/B.xnuEsf/BUILD/mysql-5.7.22/build/include -I/tmp/B.xnuEsf/BUILD/mysql-5.7.22/extra/rapidjson/include -I/tmp/B.xnuEsf/BUILD/mysql-5.7.22/build/libbinlogevents/include -I/tmp/B.xnuEsf/BUILD/mysql-5.7.22/libbinlogevents/export -I/tmp/B.xnuEsf/BUILD/mysql-5.7.22/include -fPIC -Wall -Wextra -Wformat-security -Wvla -Wimplicit-fallthrough=2 -Wwrite-strings -Wdeclaration-after-statement -O3 -O2 -fwrapv -pipe -Wformat -Werror=format-security -gdwarf-4 -fno-debug-types-section -fvar-tracking-assignments -g2 -Wp,-D_FORTIFY_SOURCE=2 -fstack-protector-strong --param=ssp-buffer-size=4 -fomit-frame-pointer -march=i686 -fasynchronous-unwind-tables -mtune=pentium4 -gdwarf-4 -fno-debug-types-section -fvar-tracking-assignments -g2 -DNDEBUG -fno-omit-frame-pointer -fno-strict-aliasing -g -fabi-version=2 -fno-omit-frame-pointer -fno-strict-aliasing -ffp-contract=off -DDBUG_OFF -o CMakeFiles/mysqlservices.dir/my_thread_scheduler_service.c.o -c /tmp/B.xnuEsf/BUILD/mysql-5.7.22/libservices/my_thread_scheduler_service.c make[2]: Leaving directory '/tmp/B.xnuEsf/BUILD/mysql-5.7.22/build' make[2]: Entering directory '/tmp/B.xnuEsf/BUILD/mysql-5.7.22/build' [ 2%] Building C object libservices/CMakeFiles/mysqlservices.dir/mysql_string_service.c.o cd /tmp/B.xnuEsf/BUILD/mysql-5.7.22/build/libservices && /usr/bin/i686-pld-linux-gcc -DBOOST_GEOMETRY_SQRT_CHECK_FINITENESS -DHAVE_CONFIG_H -DHAVE_LIBEVENT2 -D_FILE_OFFSET_BITS=64 -D_GNU_SOURCE -I/tmp/B.xnuEsf/BUILD/mysql-5.7.22/build/include -I/tmp/B.xnuEsf/BUILD/mysql-5.7.22/extra/rapidjson/include -I/tmp/B.xnuEsf/BUILD/mysql-5.7.22/build/libbinlogevents/include -I/tmp/B.xnuEsf/BUILD/mysql-5.7.22/libbinlogevents/export -I/tmp/B.xnuEsf/BUILD/mysql-5.7.22/include -fPIC -Wall -Wextra -Wformat-security -Wvla -Wimplicit-fallthrough=2 -Wwrite-strings -Wdeclaration-after-statement -O3 -O2 -fwrapv -pipe -Wformat -Werror=format-security -gdwarf-4 -fno-debug-types-section -fvar-tracking-assignments -g2 -Wp,-D_FORTIFY_SOURCE=2 -fstack-protector-strong --param=ssp-buffer-size=4 -fomit-frame-pointer -march=i686 -fasynchronous-unwind-tables -mtune=pentium4 -gdwarf-4 -fno-debug-types-section -fvar-tracking-assignments -g2 -DNDEBUG -fno-omit-frame-pointer -fno-strict-aliasing -g -fabi-version=2 -fno-omit-frame-pointer -fno-strict-aliasing -ffp-contract=off -DDBUG_OFF -o CMakeFiles/mysqlservices.dir/mysql_string_service.c.o -c /tmp/B.xnuEsf/BUILD/mysql-5.7.22/libservices/mysql_string_service.c make[2]: Leaving directory '/tmp/B.xnuEsf/BUILD/mysql-5.7.22/build' make[2]: Entering directory '/tmp/B.xnuEsf/BUILD/mysql-5.7.22/build' [ 2%] Building C object libservices/CMakeFiles/mysqlservices.dir/mysql_malloc_service.c.o cd /tmp/B.xnuEsf/BUILD/mysql-5.7.22/build/libservices && /usr/bin/i686-pld-linux-gcc -DBOOST_GEOMETRY_SQRT_CHECK_FINITENESS -DHAVE_CONFIG_H -DHAVE_LIBEVENT2 -D_FILE_OFFSET_BITS=64 -D_GNU_SOURCE -I/tmp/B.xnuEsf/BUILD/mysql-5.7.22/build/include -I/tmp/B.xnuEsf/BUILD/mysql-5.7.22/extra/rapidjson/include -I/tmp/B.xnuEsf/BUILD/mysql-5.7.22/build/libbinlogevents/include -I/tmp/B.xnuEsf/BUILD/mysql-5.7.22/libbinlogevents/export -I/tmp/B.xnuEsf/BUILD/mysql-5.7.22/include -fPIC -Wall -Wextra -Wformat-security -Wvla -Wimplicit-fallthrough=2 -Wwrite-strings -Wdeclaration-after-statement -O3 -O2 -fwrapv -pipe -Wformat -Werror=format-security -gdwarf-4 -fno-debug-types-section -fvar-tracking-assignments -g2 -Wp,-D_FORTIFY_SOURCE=2 -fstack-protector-strong --param=ssp-buffer-size=4 -fomit-frame-pointer -march=i686 -fasynchronous-unwind-tables -mtune=pentium4 -gdwarf-4 -fno-debug-types-section -fvar-tracking-assignments -g2 -DNDEBUG -fno-omit-frame-pointer -fno-strict-aliasing -g -fabi-version=2 -fno-omit-frame-pointer -fno-strict-aliasing -ffp-contract=off -DDBUG_OFF -o CMakeFiles/mysqlservices.dir/mysql_malloc_service.c.o -c /tmp/B.xnuEsf/BUILD/mysql-5.7.22/libservices/mysql_malloc_service.c make[2]: Leaving directory '/tmp/B.xnuEsf/BUILD/mysql-5.7.22/build' make[2]: Entering directory '/tmp/B.xnuEsf/BUILD/mysql-5.7.22/build' [ 2%] Building C object libservices/CMakeFiles/mysqlservices.dir/mysql_password_policy_service.c.o cd /tmp/B.xnuEsf/BUILD/mysql-5.7.22/build/libservices && /usr/bin/i686-pld-linux-gcc -DBOOST_GEOMETRY_SQRT_CHECK_FINITENESS -DHAVE_CONFIG_H -DHAVE_LIBEVENT2 -D_FILE_OFFSET_BITS=64 -D_GNU_SOURCE -I/tmp/B.xnuEsf/BUILD/mysql-5.7.22/build/include -I/tmp/B.xnuEsf/BUILD/mysql-5.7.22/extra/rapidjson/include -I/tmp/B.xnuEsf/BUILD/mysql-5.7.22/build/libbinlogevents/include -I/tmp/B.xnuEsf/BUILD/mysql-5.7.22/libbinlogevents/export -I/tmp/B.xnuEsf/BUILD/mysql-5.7.22/include -fPIC -Wall -Wextra -Wformat-security -Wvla -Wimplicit-fallthrough=2 -Wwrite-strings -Wdeclaration-after-statement -O3 -O2 -fwrapv -pipe -Wformat -Werror=format-security -gdwarf-4 -fno-debug-types-section -fvar-tracking-assignments -g2 -Wp,-D_FORTIFY_SOURCE=2 -fstack-protector-strong --param=ssp-buffer-size=4 -fomit-frame-pointer -march=i686 -fasynchronous-unwind-tables -mtune=pentium4 -gdwarf-4 -fno-debug-types-section -fvar-tracking-assignments -g2 -DNDEBUG -fno-omit-frame-pointer -fno-strict-aliasing -g -fabi-version=2 -fno-omit-frame-pointer -fno-strict-aliasing -ffp-contract=off -DDBUG_OFF -o CMakeFiles/mysqlservices.dir/mysql_password_policy_service.c.o -c /tmp/B.xnuEsf/BUILD/mysql-5.7.22/libservices/mysql_password_policy_service.c make[2]: Leaving directory '/tmp/B.xnuEsf/BUILD/mysql-5.7.22/build' make[2]: Entering directory '/tmp/B.xnuEsf/BUILD/mysql-5.7.22/build' [ 2%] Building C object libservices/CMakeFiles/mysqlservices.dir/parser_service.c.o cd /tmp/B.xnuEsf/BUILD/mysql-5.7.22/build/libservices && /usr/bin/i686-pld-linux-gcc -DBOOST_GEOMETRY_SQRT_CHECK_FINITENESS -DHAVE_CONFIG_H -DHAVE_LIBEVENT2 -D_FILE_OFFSET_BITS=64 -D_GNU_SOURCE -I/tmp/B.xnuEsf/BUILD/mysql-5.7.22/build/include -I/tmp/B.xnuEsf/BUILD/mysql-5.7.22/extra/rapidjson/include -I/tmp/B.xnuEsf/BUILD/mysql-5.7.22/build/libbinlogevents/include -I/tmp/B.xnuEsf/BUILD/mysql-5.7.22/libbinlogevents/export -I/tmp/B.xnuEsf/BUILD/mysql-5.7.22/include -fPIC -Wall -Wextra -Wformat-security -Wvla -Wimplicit-fallthrough=2 -Wwrite-strings -Wdeclaration-after-statement -O3 -O2 -fwrapv -pipe -Wformat -Werror=format-security -gdwarf-4 -fno-debug-types-section -fvar-tracking-assignments -g2 -Wp,-D_FORTIFY_SOURCE=2 -fstack-protector-strong --param=ssp-buffer-size=4 -fomit-frame-pointer -march=i686 -fasynchronous-unwind-tables -mtune=pentium4 -gdwarf-4 -fno-debug-types-section -fvar-tracking-assignments -g2 -DNDEBUG -fno-omit-frame-pointer -fno-strict-aliasing -g -fabi-version=2 -fno-omit-frame-pointer -fno-strict-aliasing -ffp-contract=off -DDBUG_OFF -o CMakeFiles/mysqlservices.dir/parser_service.c.o -c /tmp/B.xnuEsf/BUILD/mysql-5.7.22/libservices/parser_service.c make[2]: Leaving directory '/tmp/B.xnuEsf/BUILD/mysql-5.7.22/build' make[2]: Entering directory '/tmp/B.xnuEsf/BUILD/mysql-5.7.22/build' [ 2%] Building C object libservices/CMakeFiles/mysqlservices.dir/srv_session_info_service.c.o cd /tmp/B.xnuEsf/BUILD/mysql-5.7.22/build/libservices && /usr/bin/i686-pld-linux-gcc -DBOOST_GEOMETRY_SQRT_CHECK_FINITENESS -DHAVE_CONFIG_H -DHAVE_LIBEVENT2 -D_FILE_OFFSET_BITS=64 -D_GNU_SOURCE -I/tmp/B.xnuEsf/BUILD/mysql-5.7.22/build/include -I/tmp/B.xnuEsf/BUILD/mysql-5.7.22/extra/rapidjson/include -I/tmp/B.xnuEsf/BUILD/mysql-5.7.22/build/libbinlogevents/include -I/tmp/B.xnuEsf/BUILD/mysql-5.7.22/libbinlogevents/export -I/tmp/B.xnuEsf/BUILD/mysql-5.7.22/include -fPIC -Wall -Wextra -Wformat-security -Wvla -Wimplicit-fallthrough=2 -Wwrite-strings -Wdeclaration-after-statement -O3 -O2 -fwrapv -pipe -Wformat -Werror=format-security -gdwarf-4 -fno-debug-types-section -fvar-tracking-assignments -g2 -Wp,-D_FORTIFY_SOURCE=2 -fstack-protector-strong --param=ssp-buffer-size=4 -fomit-frame-pointer -march=i686 -fasynchronous-unwind-tables -mtune=pentium4 -gdwarf-4 -fno-debug-types-section -fvar-tracking-assignments -g2 -DNDEBUG -fno-omit-frame-pointer -fno-strict-aliasing -g -fabi-version=2 -fno-omit-frame-pointer -fno-strict-aliasing -ffp-contract=off -DDBUG_OFF -o CMakeFiles/mysqlservices.dir/srv_session_info_service.c.o -c /tmp/B.xnuEsf/BUILD/mysql-5.7.22/libservices/srv_session_info_service.c make[2]: Leaving directory '/tmp/B.xnuEsf/BUILD/mysql-5.7.22/build' make[2]: Entering directory '/tmp/B.xnuEsf/BUILD/mysql-5.7.22/build' [ 2%] Building C object libservices/CMakeFiles/mysqlservices.dir/rpl_transaction_ctx_service.c.o cd /tmp/B.xnuEsf/BUILD/mysql-5.7.22/build/libservices && /usr/bin/i686-pld-linux-gcc -DBOOST_GEOMETRY_SQRT_CHECK_FINITENESS -DHAVE_CONFIG_H -DHAVE_LIBEVENT2 -D_FILE_OFFSET_BITS=64 -D_GNU_SOURCE -I/tmp/B.xnuEsf/BUILD/mysql-5.7.22/build/include -I/tmp/B.xnuEsf/BUILD/mysql-5.7.22/extra/rapidjson/include -I/tmp/B.xnuEsf/BUILD/mysql-5.7.22/build/libbinlogevents/include -I/tmp/B.xnuEsf/BUILD/mysql-5.7.22/libbinlogevents/export -I/tmp/B.xnuEsf/BUILD/mysql-5.7.22/include -fPIC -Wall -Wextra -Wformat-security -Wvla -Wimplicit-fallthrough=2 -Wwrite-strings -Wdeclaration-after-statement -O3 -O2 -fwrapv -pipe -Wformat -Werror=format-security -gdwarf-4 -fno-debug-types-section -fvar-tracking-assignments -g2 -Wp,-D_FORTIFY_SOURCE=2 -fstack-protector-strong --param=ssp-buffer-size=4 -fomit-frame-pointer -march=i686 -fasynchronous-unwind-tables -mtune=pentium4 -gdwarf-4 -fno-debug-types-section -fvar-tracking-assignments -g2 -DNDEBUG -fno-omit-frame-pointer -fno-strict-aliasing -g -fabi-version=2 -fno-omit-frame-pointer -fno-strict-aliasing -ffp-contract=off -DDBUG_OFF -o CMakeFiles/mysqlservices.dir/rpl_transaction_ctx_service.c.o -c /tmp/B.xnuEsf/BUILD/mysql-5.7.22/libservices/rpl_transaction_ctx_service.c make[2]: Leaving directory '/tmp/B.xnuEsf/BUILD/mysql-5.7.22/build' make[2]: Entering directory '/tmp/B.xnuEsf/BUILD/mysql-5.7.22/build' [ 2%] Building C object libservices/CMakeFiles/mysqlservices.dir/rpl_transaction_write_set_service.c.o cd /tmp/B.xnuEsf/BUILD/mysql-5.7.22/build/libservices && /usr/bin/i686-pld-linux-gcc -DBOOST_GEOMETRY_SQRT_CHECK_FINITENESS -DHAVE_CONFIG_H -DHAVE_LIBEVENT2 -D_FILE_OFFSET_BITS=64 -D_GNU_SOURCE -I/tmp/B.xnuEsf/BUILD/mysql-5.7.22/build/include -I/tmp/B.xnuEsf/BUILD/mysql-5.7.22/extra/rapidjson/include -I/tmp/B.xnuEsf/BUILD/mysql-5.7.22/build/libbinlogevents/include -I/tmp/B.xnuEsf/BUILD/mysql-5.7.22/libbinlogevents/export -I/tmp/B.xnuEsf/BUILD/mysql-5.7.22/include -fPIC -Wall -Wextra -Wformat-security -Wvla -Wimplicit-fallthrough=2 -Wwrite-strings -Wdeclaration-after-statement -O3 -O2 -fwrapv -pipe -Wformat -Werror=format-security -gdwarf-4 -fno-debug-types-section -fvar-tracking-assignments -g2 -Wp,-D_FORTIFY_SOURCE=2 -fstack-protector-strong --param=ssp-buffer-size=4 -fomit-frame-pointer -march=i686 -fasynchronous-unwind-tables -mtune=pentium4 -gdwarf-4 -fno-debug-types-section -fvar-tracking-assignments -g2 -DNDEBUG -fno-omit-frame-pointer -fno-strict-aliasing -g -fabi-version=2 -fno-omit-frame-pointer -fno-strict-aliasing -ffp-contract=off -DDBUG_OFF -o CMakeFiles/mysqlservices.dir/rpl_transaction_write_set_service.c.o -c /tmp/B.xnuEsf/BUILD/mysql-5.7.22/libservices/rpl_transaction_write_set_service.c make[2]: Leaving directory '/tmp/B.xnuEsf/BUILD/mysql-5.7.22/build' make[2]: Entering directory '/tmp/B.xnuEsf/BUILD/mysql-5.7.22/build' [ 2%] Building C object libservices/CMakeFiles/mysqlservices.dir/security_context_service.c.o cd /tmp/B.xnuEsf/BUILD/mysql-5.7.22/build/libservices && /usr/bin/i686-pld-linux-gcc -DBOOST_GEOMETRY_SQRT_CHECK_FINITENESS -DHAVE_CONFIG_H -DHAVE_LIBEVENT2 -D_FILE_OFFSET_BITS=64 -D_GNU_SOURCE -I/tmp/B.xnuEsf/BUILD/mysql-5.7.22/build/include -I/tmp/B.xnuEsf/BUILD/mysql-5.7.22/extra/rapidjson/include -I/tmp/B.xnuEsf/BUILD/mysql-5.7.22/build/libbinlogevents/include -I/tmp/B.xnuEsf/BUILD/mysql-5.7.22/libbinlogevents/export -I/tmp/B.xnuEsf/BUILD/mysql-5.7.22/include -fPIC -Wall -Wextra -Wformat-security -Wvla -Wimplicit-fallthrough=2 -Wwrite-strings -Wdeclaration-after-statement -O3 -O2 -fwrapv -pipe -Wformat -Werror=format-security -gdwarf-4 -fno-debug-types-section -fvar-tracking-assignments -g2 -Wp,-D_FORTIFY_SOURCE=2 -fstack-protector-strong --param=ssp-buffer-size=4 -fomit-frame-pointer -march=i686 -fasynchronous-unwind-tables -mtune=pentium4 -gdwarf-4 -fno-debug-types-section -fvar-tracking-assignments -g2 -DNDEBUG -fno-omit-frame-pointer -fno-strict-aliasing -g -fabi-version=2 -fno-omit-frame-pointer -fno-strict-aliasing -ffp-contract=off -DDBUG_OFF -o CMakeFiles/mysqlservices.dir/security_context_service.c.o -c /tmp/B.xnuEsf/BUILD/mysql-5.7.22/libservices/security_context_service.c make[2]: Leaving directory '/tmp/B.xnuEsf/BUILD/mysql-5.7.22/build' make[2]: Entering directory '/tmp/B.xnuEsf/BUILD/mysql-5.7.22/build' [ 2%] Building C object libservices/CMakeFiles/mysqlservices.dir/mysql_keyring_service.c.o cd /tmp/B.xnuEsf/BUILD/mysql-5.7.22/build/libservices && /usr/bin/i686-pld-linux-gcc -DBOOST_GEOMETRY_SQRT_CHECK_FINITENESS -DHAVE_CONFIG_H -DHAVE_LIBEVENT2 -D_FILE_OFFSET_BITS=64 -D_GNU_SOURCE -I/tmp/B.xnuEsf/BUILD/mysql-5.7.22/build/include -I/tmp/B.xnuEsf/BUILD/mysql-5.7.22/extra/rapidjson/include -I/tmp/B.xnuEsf/BUILD/mysql-5.7.22/build/libbinlogevents/include -I/tmp/B.xnuEsf/BUILD/mysql-5.7.22/libbinlogevents/export -I/tmp/B.xnuEsf/BUILD/mysql-5.7.22/include -fPIC -Wall -Wextra -Wformat-security -Wvla -Wimplicit-fallthrough=2 -Wwrite-strings -Wdeclaration-after-statement -O3 -O2 -fwrapv -pipe -Wformat -Werror=format-security -gdwarf-4 -fno-debug-types-section -fvar-tracking-assignments -g2 -Wp,-D_FORTIFY_SOURCE=2 -fstack-protector-strong --param=ssp-buffer-size=4 -fomit-frame-pointer -march=i686 -fasynchronous-unwind-tables -mtune=pentium4 -gdwarf-4 -fno-debug-types-section -fvar-tracking-assignments -g2 -DNDEBUG -fno-omit-frame-pointer -fno-strict-aliasing -g -fabi-version=2 -fno-omit-frame-pointer -fno-strict-aliasing -ffp-contract=off -DDBUG_OFF -o CMakeFiles/mysqlservices.dir/mysql_keyring_service.c.o -c /tmp/B.xnuEsf/BUILD/mysql-5.7.22/libservices/mysql_keyring_service.c make[2]: Leaving directory '/tmp/B.xnuEsf/BUILD/mysql-5.7.22/build' make[2]: Entering directory '/tmp/B.xnuEsf/BUILD/mysql-5.7.22/build' [ 2%] Building C object vio/CMakeFiles/vio.dir/viossl.c.o cd /tmp/B.xnuEsf/BUILD/mysql-5.7.22/build/vio && /usr/bin/i686-pld-linux-gcc -DBOOST_GEOMETRY_SQRT_CHECK_FINITENESS -DHAVE_CONFIG_H -DHAVE_LIBEVENT2 -DHAVE_OPENSSL -D_FILE_OFFSET_BITS=64 -D_GNU_SOURCE -I/tmp/B.xnuEsf/BUILD/mysql-5.7.22/build/include -I/tmp/B.xnuEsf/BUILD/mysql-5.7.22/extra/rapidjson/include -I/tmp/B.xnuEsf/BUILD/mysql-5.7.22/build/libbinlogevents/include -I/tmp/B.xnuEsf/BUILD/mysql-5.7.22/libbinlogevents/export -I/tmp/B.xnuEsf/BUILD/mysql-5.7.22/include -fPIC -Wall -Wextra -Wformat-security -Wvla -Wimplicit-fallthrough=2 -Wwrite-strings -Wdeclaration-after-statement -O3 -O2 -fwrapv -pipe -Wformat -Werror=format-security -gdwarf-4 -fno-debug-types-section -fvar-tracking-assignments -g2 -Wp,-D_FORTIFY_SOURCE=2 -fstack-protector-strong --param=ssp-buffer-size=4 -fomit-frame-pointer -march=i686 -fasynchronous-unwind-tables -mtune=pentium4 -gdwarf-4 -fno-debug-types-section -fvar-tracking-assignments -g2 -DNDEBUG -fno-omit-frame-pointer -fno-strict-aliasing -g -fabi-version=2 -fno-omit-frame-pointer -fno-strict-aliasing -ffp-contract=off -DDBUG_OFF -o CMakeFiles/vio.dir/viossl.c.o -c /tmp/B.xnuEsf/BUILD/mysql-5.7.22/vio/viossl.c /tmp/B.xnuEsf/BUILD/mysql-5.7.22/vio/viossl.c: In function 'vio_ssl_delete': /tmp/B.xnuEsf/BUILD/mysql-5.7.22/vio/viossl.c:313:3: warning: 'ERR_remove_thread_state' is deprecated [-Wdeprecated-declarations] ERR_remove_thread_state(0); ^~~~~~~~~~~~~~~~~~~~~~~ In file included from /usr/include/openssl/e_os2.h:13, from /usr/include/openssl/ssl.h:15, from /tmp/B.xnuEsf/BUILD/mysql-5.7.22/include/violite.h:192, from /tmp/B.xnuEsf/BUILD/mysql-5.7.22/vio/vio_priv.h:26, from /tmp/B.xnuEsf/BUILD/mysql-5.7.22/vio/viossl.c:23: /usr/include/openssl/err.h:259:1: note: declared here DEPRECATEDIN_1_1_0(void ERR_remove_thread_state(void *)) ^~~~~~~~~~~~~~~~~~ make[2]: Leaving directory '/tmp/B.xnuEsf/BUILD/mysql-5.7.22/build' make[2]: Entering directory '/tmp/B.xnuEsf/BUILD/mysql-5.7.22/build' [ 2%] Linking C static library ../archive_output_directory/libmysqlservices.a cd /tmp/B.xnuEsf/BUILD/mysql-5.7.22/build/libservices && /usr/bin/cmake -P CMakeFiles/mysqlservices.dir/cmake_clean_target.cmake cd /tmp/B.xnuEsf/BUILD/mysql-5.7.22/build/libservices && /usr/bin/cmake -E cmake_link_script CMakeFiles/mysqlservices.dir/link.txt --verbose=1 /usr/bin/ar qc ../archive_output_directory/libmysqlservices.a CMakeFiles/mysqlservices.dir/service_command.c.o CMakeFiles/mysqlservices.dir/locking_service.c.o CMakeFiles/mysqlservices.dir/srv_session_service.c.o CMakeFiles/mysqlservices.dir/my_snprintf_service.c.o CMakeFiles/mysqlservices.dir/thd_alloc_service.c.o CMakeFiles/mysqlservices.dir/thd_wait_service.c.o CMakeFiles/mysqlservices.dir/my_plugin_log_service.c.o CMakeFiles/mysqlservices.dir/my_thread_scheduler_service.c.o CMakeFiles/mysqlservices.dir/mysql_string_service.c.o CMakeFiles/mysqlservices.dir/mysql_malloc_service.c.o CMakeFiles/mysqlservices.dir/mysql_password_policy_service.c.o CMakeFiles/mysqlservices.dir/parser_service.c.o CMakeFiles/mysqlservices.dir/srv_session_info_service.c.o CMakeFiles/mysqlservices.dir/rpl_transaction_ctx_service.c.o CMakeFiles/mysqlservices.dir/rpl_transaction_write_set_service.c.o CMakeFiles/mysqlservices.dir/security_context_service.c.o CMakeFiles/mysqlservices.dir/mysql_keyring_service.c.o /usr/bin/ranlib ../archive_output_directory/libmysqlservices.a cd /tmp/B.xnuEsf/BUILD/mysql-5.7.22/build/libservices && /usr/bin/cmake -DTARGET_NAME=mysqlservices -DTARGET_LOC=/tmp/B.xnuEsf/BUILD/mysql-5.7.22/build/archive_output_directory/libmysqlservices.a -DCFG_INTDIR=. -P /tmp/B.xnuEsf/BUILD/mysql-5.7.22/build/archive_output_directory/lib_location_mysqlservices.cmake make[2]: Leaving directory '/tmp/B.xnuEsf/BUILD/mysql-5.7.22/build' make[1]: Entering directory '/tmp/B.xnuEsf/BUILD/mysql-5.7.22/build' [ 2%] Built target mysqlservices make[1]: Leaving directory '/tmp/B.xnuEsf/BUILD/mysql-5.7.22/build' /usr/bin/make -f rapid/plugin/group_replication/CMakeFiles/gr_unit_test_resource.dir/build.make rapid/plugin/group_replication/CMakeFiles/gr_unit_test_resource.dir/depend make[2]: Entering directory '/tmp/B.xnuEsf/BUILD/mysql-5.7.22/build' cd /tmp/B.xnuEsf/BUILD/mysql-5.7.22/build && /usr/bin/cmake -E cmake_depends "Unix Makefiles" /tmp/B.xnuEsf/BUILD/mysql-5.7.22 /tmp/B.xnuEsf/BUILD/mysql-5.7.22/rapid/plugin/group_replication /tmp/B.xnuEsf/BUILD/mysql-5.7.22/build /tmp/B.xnuEsf/BUILD/mysql-5.7.22/build/rapid/plugin/group_replication /tmp/B.xnuEsf/BUILD/mysql-5.7.22/build/rapid/plugin/group_replication/CMakeFiles/gr_unit_test_resource.dir/DependInfo.cmake --color= Scanning dependencies of target gr_unit_test_resource make[2]: Leaving directory '/tmp/B.xnuEsf/BUILD/mysql-5.7.22/build' /usr/bin/make -f rapid/plugin/group_replication/CMakeFiles/gr_unit_test_resource.dir/build.make rapid/plugin/group_replication/CMakeFiles/gr_unit_test_resource.dir/build make[2]: Entering directory '/tmp/B.xnuEsf/BUILD/mysql-5.7.22/build' [ 2%] Building C object vio/CMakeFiles/vio.dir/viosslfactories.c.o cd /tmp/B.xnuEsf/BUILD/mysql-5.7.22/build/vio && /usr/bin/i686-pld-linux-gcc -DBOOST_GEOMETRY_SQRT_CHECK_FINITENESS -DHAVE_CONFIG_H -DHAVE_LIBEVENT2 -DHAVE_OPENSSL -D_FILE_OFFSET_BITS=64 -D_GNU_SOURCE -I/tmp/B.xnuEsf/BUILD/mysql-5.7.22/build/include -I/tmp/B.xnuEsf/BUILD/mysql-5.7.22/extra/rapidjson/include -I/tmp/B.xnuEsf/BUILD/mysql-5.7.22/build/libbinlogevents/include -I/tmp/B.xnuEsf/BUILD/mysql-5.7.22/libbinlogevents/export -I/tmp/B.xnuEsf/BUILD/mysql-5.7.22/include -fPIC -Wall -Wextra -Wformat-security -Wvla -Wimplicit-fallthrough=2 -Wwrite-strings -Wdeclaration-after-statement -O3 -O2 -fwrapv -pipe -Wformat -Werror=format-security -gdwarf-4 -fno-debug-types-section -fvar-tracking-assignments -g2 -Wp,-D_FORTIFY_SOURCE=2 -fstack-protector-strong --param=ssp-buffer-size=4 -fomit-frame-pointer -march=i686 -fasynchronous-unwind-tables -mtune=pentium4 -gdwarf-4 -fno-debug-types-section -fvar-tracking-assignments -g2 -DNDEBUG -fno-omit-frame-pointer -fno-strict-aliasing -g -fabi-version=2 -fno-omit-frame-pointer -fno-strict-aliasing -ffp-contract=off -DDBUG_OFF -o CMakeFiles/vio.dir/viosslfactories.c.o -c /tmp/B.xnuEsf/BUILD/mysql-5.7.22/vio/viosslfactories.c /tmp/B.xnuEsf/BUILD/mysql-5.7.22/vio/viosslfactories.c: In function 'get_dh2048': /tmp/B.xnuEsf/BUILD/mysql-5.7.22/vio/viosslfactories.c:124:7: error: dereferencing pointer to incomplete type 'DH' {aka 'struct dh_st'} dh->p=BN_bin2bn(dh2048_p,sizeof(dh2048_p),NULL); ^~ /tmp/B.xnuEsf/BUILD/mysql-5.7.22/vio/viosslfactories.c: In function 'set_lock_callback_functions': /tmp/B.xnuEsf/BUILD/mysql-5.7.22/vio/viosslfactories.c:374:49: warning: unused parameter 'init' [-Wunused-parameter] static void set_lock_callback_functions(my_bool init) ~~~~~~~~^~~~ /tmp/B.xnuEsf/BUILD/mysql-5.7.22/vio/viosslfactories.c: In function 'vio_ssl_end': /tmp/B.xnuEsf/BUILD/mysql-5.7.22/vio/viosslfactories.c:398:5: warning: 'ERR_remove_state' is deprecated [-Wdeprecated-declarations] ERR_remove_state(0); ^~~~~~~~~~~~~~~~ In file included from /usr/include/openssl/e_os2.h:13, from /usr/include/openssl/ssl.h:15, from /tmp/B.xnuEsf/BUILD/mysql-5.7.22/include/violite.h:192, from /tmp/B.xnuEsf/BUILD/mysql-5.7.22/vio/vio_priv.h:26, from /tmp/B.xnuEsf/BUILD/mysql-5.7.22/vio/viosslfactories.c:16: /usr/include/openssl/err.h:260:1: note: declared here DEPRECATEDIN_1_0_0(void ERR_remove_state(unsigned long pid)) ^~~~~~~~~~~~~~~~~~ At top level: /tmp/B.xnuEsf/BUILD/mysql-5.7.22/vio/viosslfactories.c:348:22: warning: 'openssl_id_function' defined but not used [-Wunused-function] static unsigned long openssl_id_function() ^~~~~~~~~~~~~~~~~~~ /tmp/B.xnuEsf/BUILD/mysql-5.7.22/vio/viosslfactories.c:338:13: warning: 'openssl_dynlock_destroy' defined but not used [-Wunused-function] static void openssl_dynlock_destroy(openssl_lock_t *lock, ^~~~~~~~~~~~~~~~~~~~~~~ /tmp/B.xnuEsf/BUILD/mysql-5.7.22/vio/viosslfactories.c:318:24: warning: 'openssl_dynlock_create' defined but not used [-Wunused-function] static openssl_lock_t *openssl_dynlock_create(const char *file ^~~~~~~~~~~~~~~~~~~~~~ /tmp/B.xnuEsf/BUILD/mysql-5.7.22/vio/viosslfactories.c:301:13: warning: 'openssl_lock_function' defined but not used [-Wunused-function] static void openssl_lock_function(int mode, int n, ^~~~~~~~~~~~~~~~~~~~~ make[2]: *** [vio/CMakeFiles/vio.dir/build.make:105: vio/CMakeFiles/vio.dir/viosslfactories.c.o] Error 1 make[2]: Leaving directory '/tmp/B.xnuEsf/BUILD/mysql-5.7.22/build' make[1]: *** [CMakeFiles/Makefile2:489: vio/CMakeFiles/vio.dir/all] Error 2 make[1]: *** Waiting for unfinished jobs.... make[2]: Entering directory '/tmp/B.xnuEsf/BUILD/mysql-5.7.22/build' [ 2%] Building C object regex/CMakeFiles/regex.dir/regexec.c.o cd /tmp/B.xnuEsf/BUILD/mysql-5.7.22/build/regex && /usr/bin/i686-pld-linux-gcc -DBOOST_GEOMETRY_SQRT_CHECK_FINITENESS -DHAVE_CONFIG_H -DHAVE_LIBEVENT2 -D_FILE_OFFSET_BITS=64 -D_GNU_SOURCE -I/tmp/B.xnuEsf/BUILD/mysql-5.7.22/build/include -I/tmp/B.xnuEsf/BUILD/mysql-5.7.22/extra/rapidjson/include -I/tmp/B.xnuEsf/BUILD/mysql-5.7.22/build/libbinlogevents/include -I/tmp/B.xnuEsf/BUILD/mysql-5.7.22/libbinlogevents/export -I/tmp/B.xnuEsf/BUILD/mysql-5.7.22/include -fPIC -Wall -Wextra -Wformat-security -Wvla -Wimplicit-fallthrough=2 -Wwrite-strings -Wdeclaration-after-statement -O3 -O2 -fwrapv -pipe -Wformat -Werror=format-security -gdwarf-4 -fno-debug-types-section -fvar-tracking-assignments -g2 -Wp,-D_FORTIFY_SOURCE=2 -fstack-protector-strong --param=ssp-buffer-size=4 -fomit-frame-pointer -march=i686 -fasynchronous-unwind-tables -mtune=pentium4 -gdwarf-4 -fno-debug-types-section -fvar-tracking-assignments -g2 -DNDEBUG -fno-omit-frame-pointer -fno-strict-aliasing -g -fabi-version=2 -fno-omit-frame-pointer -fno-strict-aliasing -ffp-contract=off -DDBUG_OFF -o CMakeFiles/regex.dir/regexec.c.o -c /tmp/B.xnuEsf/BUILD/mysql-5.7.22/regex/regexec.c make[2]: Leaving directory '/tmp/B.xnuEsf/BUILD/mysql-5.7.22/build' make[2]: Entering directory '/tmp/B.xnuEsf/BUILD/mysql-5.7.22/build' [ 2%] Building CXX object libbinlogstandalone/src/CMakeFiles/binlogstandalone_static.dir/__/__/libbinlogevents/src/binlog_event.cpp.o cd /tmp/B.xnuEsf/BUILD/mysql-5.7.22/build/libbinlogstandalone/src && /usr/bin/i686-pld-linux-g++ -DBOOST_GEOMETRY_SQRT_CHECK_FINITENESS -DHAVE_CONFIG_H -DHAVE_LIBEVENT2 -DSTANDALONE_BINLOG -D_FILE_OFFSET_BITS=64 -D_GNU_SOURCE -I/tmp/B.xnuEsf/BUILD/mysql-5.7.22/build/include -I/tmp/B.xnuEsf/BUILD/mysql-5.7.22/extra/rapidjson/include -I/tmp/B.xnuEsf/BUILD/mysql-5.7.22/build/libbinlogevents/include -I/tmp/B.xnuEsf/BUILD/mysql-5.7.22/libbinlogevents/export -I/tmp/B.xnuEsf/BUILD/mysql-5.7.22/include -I/tmp/B.xnuEsf/BUILD/mysql-5.7.22/libbinlogevents/include -I/tmp/B.xnuEsf/BUILD/mysql-5.7.22/build/libbinlogstandalone/../libbinlogevents/include -I/tmp/B.xnuEsf/BUILD/mysql-5.7.22/build/libbinlogstandalone/libbinlogevents/export -fPIC -Wall -Wextra -Wformat-security -Wvla -Wimplicit-fallthrough=2 -Woverloaded-virtual -Wno-unused-parameter -O3 -O2 -fwrapv -pipe -Wformat -Werror=format-security -gdwarf-4 -fno-debug-types-section -fvar-tracking-assignments -g2 -Wp,-D_FORTIFY_SOURCE=2 -fstack-protector-strong --param=ssp-buffer-size=4 -fomit-frame-pointer -march=i686 -fasynchronous-unwind-tables -mtune=pentium4 -gdwarf-4 -fno-debug-types-section -fvar-tracking-assignments -g2 -DNDEBUG -fno-omit-frame-pointer -fno-strict-aliasing -g -fabi-version=2 -fno-omit-frame-pointer -fno-strict-aliasing -std=gnu++03 -ffp-contract=off -DDBUG_OFF -o CMakeFiles/binlogstandalone_static.dir/__/__/libbinlogevents/src/binlog_event.cpp.o -c /tmp/B.xnuEsf/BUILD/mysql-5.7.22/libbinlogevents/src/binlog_event.cpp make[2]: Leaving directory '/tmp/B.xnuEsf/BUILD/mysql-5.7.22/build' make[2]: Entering directory '/tmp/B.xnuEsf/BUILD/mysql-5.7.22/build' [ 2%] Building CXX object rapid/plugin/group_replication/CMakeFiles/gr_unit_test_resource.dir/src/gcs_plugin_messages.cc.o cd /tmp/B.xnuEsf/BUILD/mysql-5.7.22/build/rapid/plugin/group_replication && /usr/bin/i686-pld-linux-g++ -DBOOST_GEOMETRY_SQRT_CHECK_FINITENESS -DDISABLE_ALL_PSI -DHAVE_CONFIG_H -DHAVE_LIBEVENT2 -DHAVE_OPENSSL -DHAVE_TIRPC -DXCOM_HAVE_OPENSSL -D_FILE_OFFSET_BITS=64 -D_GNU_SOURCE -I/tmp/B.xnuEsf/BUILD/mysql-5.7.22/build/include -I/tmp/B.xnuEsf/BUILD/mysql-5.7.22/extra/rapidjson/include -I/tmp/B.xnuEsf/BUILD/mysql-5.7.22/build/libbinlogevents/include -I/tmp/B.xnuEsf/BUILD/mysql-5.7.22/libbinlogevents/export -I/tmp/B.xnuEsf/BUILD/mysql-5.7.22/build/rapid/plugin/group_replication/xdr_gen -isystem /usr/include/tirpc -I/tmp/B.xnuEsf/BUILD/mysql-5.7.22/libbinlogevents/include -I/tmp/B.xnuEsf/BUILD/mysql-5.7.22/rapid/plugin/group_replication/include -I/tmp/B.xnuEsf/BUILD/mysql-5.7.22/rapid/plugin/group_replication/include/sql_service -I/tmp/B.xnuEsf/BUILD/mysql-5.7.22/rapid/plugin/group_replication/libmysqlgcs/include -I/tmp/B.xnuEsf/BUILD/mysql-5.7.22/rapid/plugin/group_replication/libmysqlgcs/include/mysql -I/tmp/B.xnuEsf/BUILD/mysql-5.7.22/rapid/plugin/group_replication/libmysqlgcs/include/mysql/gcs -I/tmp/B.xnuEsf/BUILD/mysql-5.7.22/rapid/plugin/group_replication/libmysqlgcs/src/bindings/xcom/xcom -I/tmp/B.xnuEsf/BUILD/mysql-5.7.22/build/rapid/plugin/group_replication/include -I/tmp/B.xnuEsf/BUILD/mysql-5.7.22/include -I/tmp/B.xnuEsf/BUILD/mysql-5.7.22/sql -I/tmp/B.xnuEsf/BUILD/mysql-5.7.22/sql/auth -I/tmp/B.xnuEsf/BUILD/mysql-5.7.22/regex -fPIC -Wall -Wextra -Wformat-security -Wvla -Wimplicit-fallthrough=2 -Woverloaded-virtual -Wno-unused-parameter -O3 -O2 -fwrapv -pipe -Wformat -Werror=format-security -gdwarf-4 -fno-debug-types-section -fvar-tracking-assignments -g2 -Wp,-D_FORTIFY_SOURCE=2 -fstack-protector-strong --param=ssp-buffer-size=4 -fomit-frame-pointer -march=i686 -fasynchronous-unwind-tables -mtune=pentium4 -gdwarf-4 -fno-debug-types-section -fvar-tracking-assignments -g2 -DNDEBUG -fno-omit-frame-pointer -fno-strict-aliasing -g -fabi-version=2 -fno-omit-frame-pointer -fno-strict-aliasing -std=gnu++03 -ffp-contract=off -DDBUG_OFF -o CMakeFiles/gr_unit_test_resource.dir/src/gcs_plugin_messages.cc.o -c /tmp/B.xnuEsf/BUILD/mysql-5.7.22/rapid/plugin/group_replication/src/gcs_plugin_messages.cc make[2]: Leaving directory '/tmp/B.xnuEsf/BUILD/mysql-5.7.22/build' make[2]: Entering directory '/tmp/B.xnuEsf/BUILD/mysql-5.7.22/build' [ 1%] Building C object strings/CMakeFiles/strings.dir/ctype-big5.c.o cd /tmp/B.xnuEsf/BUILD/mysql-5.7.22/build/strings && /usr/bin/i686-pld-linux-gcc -DBOOST_GEOMETRY_SQRT_CHECK_FINITENESS -DDISABLE_MYSQL_THREAD_H -DHAVE_CONFIG_H -DHAVE_LIBEVENT2 -D_FILE_OFFSET_BITS=64 -D_GNU_SOURCE -I/tmp/B.xnuEsf/BUILD/mysql-5.7.22/build/include -I/tmp/B.xnuEsf/BUILD/mysql-5.7.22/extra/rapidjson/include -I/tmp/B.xnuEsf/BUILD/mysql-5.7.22/build/libbinlogevents/include -I/tmp/B.xnuEsf/BUILD/mysql-5.7.22/libbinlogevents/export -I/tmp/B.xnuEsf/BUILD/mysql-5.7.22/include -fPIC -Wall -Wextra -Wformat-security -Wvla -Wimplicit-fallthrough=2 -Wwrite-strings -Wdeclaration-after-statement -O3 -O2 -fwrapv -pipe -Wformat -Werror=format-security -gdwarf-4 -fno-debug-types-section -fvar-tracking-assignments -g2 -Wp,-D_FORTIFY_SOURCE=2 -fstack-protector-strong --param=ssp-buffer-size=4 -fomit-frame-pointer -march=i686 -fasynchronous-unwind-tables -mtune=pentium4 -gdwarf-4 -fno-debug-types-section -fvar-tracking-assignments -g2 -DNDEBUG -fno-omit-frame-pointer -fno-strict-aliasing -g -fabi-version=2 -fno-omit-frame-pointer -fno-strict-aliasing -ffp-contract=off -DDBUG_OFF -o CMakeFiles/strings.dir/ctype-big5.c.o -c /tmp/B.xnuEsf/BUILD/mysql-5.7.22/strings/ctype-big5.c make[2]: Leaving directory '/tmp/B.xnuEsf/BUILD/mysql-5.7.22/build' make[2]: Entering directory '/tmp/B.xnuEsf/BUILD/mysql-5.7.22/build' [ 2%] Building CXX object libbinlogstandalone/src/CMakeFiles/binlogstandalone_shared.dir/__/__/libbinlogevents/src/binlog_event.cpp.o cd /tmp/B.xnuEsf/BUILD/mysql-5.7.22/build/libbinlogstandalone/src && /usr/bin/i686-pld-linux-g++ -DBOOST_GEOMETRY_SQRT_CHECK_FINITENESS -DHAVE_CONFIG_H -DHAVE_LIBEVENT2 -DSTANDALONE_BINLOG -D_FILE_OFFSET_BITS=64 -D_GNU_SOURCE -Dbinlogstandalone_shared_EXPORTS -I/tmp/B.xnuEsf/BUILD/mysql-5.7.22/build/include -I/tmp/B.xnuEsf/BUILD/mysql-5.7.22/extra/rapidjson/include -I/tmp/B.xnuEsf/BUILD/mysql-5.7.22/build/libbinlogevents/include -I/tmp/B.xnuEsf/BUILD/mysql-5.7.22/libbinlogevents/export -I/tmp/B.xnuEsf/BUILD/mysql-5.7.22/include -I/tmp/B.xnuEsf/BUILD/mysql-5.7.22/libbinlogevents/include -I/tmp/B.xnuEsf/BUILD/mysql-5.7.22/build/libbinlogstandalone/../libbinlogevents/include -I/tmp/B.xnuEsf/BUILD/mysql-5.7.22/build/libbinlogstandalone/libbinlogevents/export -fPIC -Wall -Wextra -Wformat-security -Wvla -Wimplicit-fallthrough=2 -Woverloaded-virtual -Wno-unused-parameter -O3 -O2 -fwrapv -pipe -Wformat -Werror=format-security -gdwarf-4 -fno-debug-types-section -fvar-tracking-assignments -g2 -Wp,-D_FORTIFY_SOURCE=2 -fstack-protector-strong --param=ssp-buffer-size=4 -fomit-frame-pointer -march=i686 -fasynchronous-unwind-tables -mtune=pentium4 -gdwarf-4 -fno-debug-types-section -fvar-tracking-assignments -g2 -DNDEBUG -fno-omit-frame-pointer -fno-strict-aliasing -g -fabi-version=2 -fno-omit-frame-pointer -fno-strict-aliasing -std=gnu++03 -ffp-contract=off -DDBUG_OFF -fPIC -o CMakeFiles/binlogstandalone_shared.dir/__/__/libbinlogevents/src/binlog_event.cpp.o -c /tmp/B.xnuEsf/BUILD/mysql-5.7.22/libbinlogevents/src/binlog_event.cpp make[2]: Leaving directory '/tmp/B.xnuEsf/BUILD/mysql-5.7.22/build' make[2]: Entering directory '/tmp/B.xnuEsf/BUILD/mysql-5.7.22/build' [ 2%] Building CXX object libbinlogstandalone/src/CMakeFiles/binlogstandalone_shared.dir/__/__/libbinlogevents/src/rows_event.cpp.o cd /tmp/B.xnuEsf/BUILD/mysql-5.7.22/build/libbinlogstandalone/src && /usr/bin/i686-pld-linux-g++ -DBOOST_GEOMETRY_SQRT_CHECK_FINITENESS -DHAVE_CONFIG_H -DHAVE_LIBEVENT2 -DSTANDALONE_BINLOG -D_FILE_OFFSET_BITS=64 -D_GNU_SOURCE -Dbinlogstandalone_shared_EXPORTS -I/tmp/B.xnuEsf/BUILD/mysql-5.7.22/build/include -I/tmp/B.xnuEsf/BUILD/mysql-5.7.22/extra/rapidjson/include -I/tmp/B.xnuEsf/BUILD/mysql-5.7.22/build/libbinlogevents/include -I/tmp/B.xnuEsf/BUILD/mysql-5.7.22/libbinlogevents/export -I/tmp/B.xnuEsf/BUILD/mysql-5.7.22/include -I/tmp/B.xnuEsf/BUILD/mysql-5.7.22/libbinlogevents/include -I/tmp/B.xnuEsf/BUILD/mysql-5.7.22/build/libbinlogstandalone/../libbinlogevents/include -I/tmp/B.xnuEsf/BUILD/mysql-5.7.22/build/libbinlogstandalone/libbinlogevents/export -fPIC -Wall -Wextra -Wformat-security -Wvla -Wimplicit-fallthrough=2 -Woverloaded-virtual -Wno-unused-parameter -O3 -O2 -fwrapv -pipe -Wformat -Werror=format-security -gdwarf-4 -fno-debug-types-section -fvar-tracking-assignments -g2 -Wp,-D_FORTIFY_SOURCE=2 -fstack-protector-strong --param=ssp-buffer-size=4 -fomit-frame-pointer -march=i686 -fasynchronous-unwind-tables -mtune=pentium4 -gdwarf-4 -fno-debug-types-section -fvar-tracking-assignments -g2 -DNDEBUG -fno-omit-frame-pointer -fno-strict-aliasing -g -fabi-version=2 -fno-omit-frame-pointer -fno-strict-aliasing -std=gnu++03 -ffp-contract=off -DDBUG_OFF -fPIC -o CMakeFiles/binlogstandalone_shared.dir/__/__/libbinlogevents/src/rows_event.cpp.o -c /tmp/B.xnuEsf/BUILD/mysql-5.7.22/libbinlogevents/src/rows_event.cpp /tmp/B.xnuEsf/BUILD/mysql-5.7.22/libbinlogevents/src/rows_event.cpp: In constructor 'binary_log::Table_map_event::Table_map_event(const char*, unsigned int, const binary_log::Format_description_event*)': /tmp/B.xnuEsf/BUILD/mysql-5.7.22/libbinlogevents/src/rows_event.cpp:94:38: warning: 'void* memcpy(void*, const void*, size_t)' writing to an object of type 'class Table_id' with no trivial copy-assignment; use copy-assignment or copy-initialization instead [-Wclass-memaccess] memcpy(&m_table_id, post_start, 4); ^ In file included from /tmp/B.xnuEsf/BUILD/mysql-5.7.22/libbinlogevents/include/rows_event.h:31, from /tmp/B.xnuEsf/BUILD/mysql-5.7.22/libbinlogevents/src/rows_event.cpp:16: /tmp/B.xnuEsf/BUILD/mysql-5.7.22/libbinlogevents/include/table_id.h:32:7: note: 'class Table_id' declared here class Table_id ^~~~~~~~ /tmp/B.xnuEsf/BUILD/mysql-5.7.22/libbinlogevents/src/rows_event.cpp:101:38: warning: 'void* memcpy(void*, const void*, size_t)' writing to an object of type 'class Table_id' with no trivial copy-assignment; use copy-assignment or copy-initialization instead [-Wclass-memaccess] memcpy(&m_table_id, post_start, 6); ^ In file included from /tmp/B.xnuEsf/BUILD/mysql-5.7.22/libbinlogevents/include/rows_event.h:31, from /tmp/B.xnuEsf/BUILD/mysql-5.7.22/libbinlogevents/src/rows_event.cpp:16: /tmp/B.xnuEsf/BUILD/mysql-5.7.22/libbinlogevents/include/table_id.h:32:7: note: 'class Table_id' declared here class Table_id ^~~~~~~~ /tmp/B.xnuEsf/BUILD/mysql-5.7.22/libbinlogevents/src/rows_event.cpp: In constructor 'binary_log::Rows_event::Rows_event(const char*, unsigned int, const binary_log::Format_description_event*)': /tmp/B.xnuEsf/BUILD/mysql-5.7.22/libbinlogevents/src/rows_event.cpp:196:38: warning: 'void* memcpy(void*, const void*, size_t)' writing to an object of type 'class Table_id' with no trivial copy-assignment; use copy-assignment or copy-initialization instead [-Wclass-memaccess] memcpy(&m_table_id, post_start, 4); ^ In file included from /tmp/B.xnuEsf/BUILD/mysql-5.7.22/libbinlogevents/include/rows_event.h:31, from /tmp/B.xnuEsf/BUILD/mysql-5.7.22/libbinlogevents/src/rows_event.cpp:16: /tmp/B.xnuEsf/BUILD/mysql-5.7.22/libbinlogevents/include/table_id.h:32:7: note: 'class Table_id' declared here class Table_id ^~~~~~~~ /tmp/B.xnuEsf/BUILD/mysql-5.7.22/libbinlogevents/src/rows_event.cpp:202:38: warning: 'void* memcpy(void*, const void*, size_t)' writing to an object of type 'class Table_id' with no trivial copy-assignment; use copy-assignment or copy-initialization instead [-Wclass-memaccess] memcpy(&m_table_id, post_start, 6); ^ In file included from /tmp/B.xnuEsf/BUILD/mysql-5.7.22/libbinlogevents/include/rows_event.h:31, from /tmp/B.xnuEsf/BUILD/mysql-5.7.22/libbinlogevents/src/rows_event.cpp:16: /tmp/B.xnuEsf/BUILD/mysql-5.7.22/libbinlogevents/include/table_id.h:32:7: note: 'class Table_id' declared here class Table_id ^~~~~~~~ make[2]: Leaving directory '/tmp/B.xnuEsf/BUILD/mysql-5.7.22/build' make[2]: Entering directory '/tmp/B.xnuEsf/BUILD/mysql-5.7.22/build' [ 2%] Building CXX object rapid/plugin/group_replication/CMakeFiles/gr_unit_test_resource.dir/src/member_version.cc.o cd /tmp/B.xnuEsf/BUILD/mysql-5.7.22/build/rapid/plugin/group_replication && /usr/bin/i686-pld-linux-g++ -DBOOST_GEOMETRY_SQRT_CHECK_FINITENESS -DDISABLE_ALL_PSI -DHAVE_CONFIG_H -DHAVE_LIBEVENT2 -DHAVE_OPENSSL -DHAVE_TIRPC -DXCOM_HAVE_OPENSSL -D_FILE_OFFSET_BITS=64 -D_GNU_SOURCE -I/tmp/B.xnuEsf/BUILD/mysql-5.7.22/build/include -I/tmp/B.xnuEsf/BUILD/mysql-5.7.22/extra/rapidjson/include -I/tmp/B.xnuEsf/BUILD/mysql-5.7.22/build/libbinlogevents/include -I/tmp/B.xnuEsf/BUILD/mysql-5.7.22/libbinlogevents/export -I/tmp/B.xnuEsf/BUILD/mysql-5.7.22/build/rapid/plugin/group_replication/xdr_gen -isystem /usr/include/tirpc -I/tmp/B.xnuEsf/BUILD/mysql-5.7.22/libbinlogevents/include -I/tmp/B.xnuEsf/BUILD/mysql-5.7.22/rapid/plugin/group_replication/include -I/tmp/B.xnuEsf/BUILD/mysql-5.7.22/rapid/plugin/group_replication/include/sql_service -I/tmp/B.xnuEsf/BUILD/mysql-5.7.22/rapid/plugin/group_replication/libmysqlgcs/include -I/tmp/B.xnuEsf/BUILD/mysql-5.7.22/rapid/plugin/group_replication/libmysqlgcs/include/mysql -I/tmp/B.xnuEsf/BUILD/mysql-5.7.22/rapid/plugin/group_replication/libmysqlgcs/include/mysql/gcs -I/tmp/B.xnuEsf/BUILD/mysql-5.7.22/rapid/plugin/group_replication/libmysqlgcs/src/bindings/xcom/xcom -I/tmp/B.xnuEsf/BUILD/mysql-5.7.22/build/rapid/plugin/group_replication/include -I/tmp/B.xnuEsf/BUILD/mysql-5.7.22/include -I/tmp/B.xnuEsf/BUILD/mysql-5.7.22/sql -I/tmp/B.xnuEsf/BUILD/mysql-5.7.22/sql/auth -I/tmp/B.xnuEsf/BUILD/mysql-5.7.22/regex -fPIC -Wall -Wextra -Wformat-security -Wvla -Wimplicit-fallthrough=2 -Woverloaded-virtual -Wno-unused-parameter -O3 -O2 -fwrapv -pipe -Wformat -Werror=format-security -gdwarf-4 -fno-debug-types-section -fvar-tracking-assignments -g2 -Wp,-D_FORTIFY_SOURCE=2 -fstack-protector-strong --param=ssp-buffer-size=4 -fomit-frame-pointer -march=i686 -fasynchronous-unwind-tables -mtune=pentium4 -gdwarf-4 -fno-debug-types-section -fvar-tracking-assignments -g2 -DNDEBUG -fno-omit-frame-pointer -fno-strict-aliasing -g -fabi-version=2 -fno-omit-frame-pointer -fno-strict-aliasing -std=gnu++03 -ffp-contract=off -DDBUG_OFF -o CMakeFiles/gr_unit_test_resource.dir/src/member_version.cc.o -c /tmp/B.xnuEsf/BUILD/mysql-5.7.22/rapid/plugin/group_replication/src/member_version.cc make[2]: Leaving directory '/tmp/B.xnuEsf/BUILD/mysql-5.7.22/build' make[2]: Entering directory '/tmp/B.xnuEsf/BUILD/mysql-5.7.22/build' [ 2%] Building CXX object rapid/plugin/group_replication/CMakeFiles/gr_unit_test_resource.dir/src/compatibility_module.cc.o cd /tmp/B.xnuEsf/BUILD/mysql-5.7.22/build/rapid/plugin/group_replication && /usr/bin/i686-pld-linux-g++ -DBOOST_GEOMETRY_SQRT_CHECK_FINITENESS -DDISABLE_ALL_PSI -DHAVE_CONFIG_H -DHAVE_LIBEVENT2 -DHAVE_OPENSSL -DHAVE_TIRPC -DXCOM_HAVE_OPENSSL -D_FILE_OFFSET_BITS=64 -D_GNU_SOURCE -I/tmp/B.xnuEsf/BUILD/mysql-5.7.22/build/include -I/tmp/B.xnuEsf/BUILD/mysql-5.7.22/extra/rapidjson/include -I/tmp/B.xnuEsf/BUILD/mysql-5.7.22/build/libbinlogevents/include -I/tmp/B.xnuEsf/BUILD/mysql-5.7.22/libbinlogevents/export -I/tmp/B.xnuEsf/BUILD/mysql-5.7.22/build/rapid/plugin/group_replication/xdr_gen -isystem /usr/include/tirpc -I/tmp/B.xnuEsf/BUILD/mysql-5.7.22/libbinlogevents/include -I/tmp/B.xnuEsf/BUILD/mysql-5.7.22/rapid/plugin/group_replication/include -I/tmp/B.xnuEsf/BUILD/mysql-5.7.22/rapid/plugin/group_replication/include/sql_service -I/tmp/B.xnuEsf/BUILD/mysql-5.7.22/rapid/plugin/group_replication/libmysqlgcs/include -I/tmp/B.xnuEsf/BUILD/mysql-5.7.22/rapid/plugin/group_replication/libmysqlgcs/include/mysql -I/tmp/B.xnuEsf/BUILD/mysql-5.7.22/rapid/plugin/group_replication/libmysqlgcs/include/mysql/gcs -I/tmp/B.xnuEsf/BUILD/mysql-5.7.22/rapid/plugin/group_replication/libmysqlgcs/src/bindings/xcom/xcom -I/tmp/B.xnuEsf/BUILD/mysql-5.7.22/build/rapid/plugin/group_replication/include -I/tmp/B.xnuEsf/BUILD/mysql-5.7.22/include -I/tmp/B.xnuEsf/BUILD/mysql-5.7.22/sql -I/tmp/B.xnuEsf/BUILD/mysql-5.7.22/sql/auth -I/tmp/B.xnuEsf/BUILD/mysql-5.7.22/regex -fPIC -Wall -Wextra -Wformat-security -Wvla -Wimplicit-fallthrough=2 -Woverloaded-virtual -Wno-unused-parameter -O3 -O2 -fwrapv -pipe -Wformat -Werror=format-security -gdwarf-4 -fno-debug-types-section -fvar-tracking-assignments -g2 -Wp,-D_FORTIFY_SOURCE=2 -fstack-protector-strong --param=ssp-buffer-size=4 -fomit-frame-pointer -march=i686 -fasynchronous-unwind-tables -mtune=pentium4 -gdwarf-4 -fno-debug-types-section -fvar-tracking-assignments -g2 -DNDEBUG -fno-omit-frame-pointer -fno-strict-aliasing -g -fabi-version=2 -fno-omit-frame-pointer -fno-strict-aliasing -std=gnu++03 -ffp-contract=off -DDBUG_OFF -o CMakeFiles/gr_unit_test_resource.dir/src/compatibility_module.cc.o -c /tmp/B.xnuEsf/BUILD/mysql-5.7.22/rapid/plugin/group_replication/src/compatibility_module.cc make[2]: Leaving directory '/tmp/B.xnuEsf/BUILD/mysql-5.7.22/build' make[2]: Entering directory '/tmp/B.xnuEsf/BUILD/mysql-5.7.22/build' [ 2%] Building CXX object libbinlogstandalone/src/CMakeFiles/binlogstandalone_static.dir/__/__/libbinlogevents/src/rows_event.cpp.o cd /tmp/B.xnuEsf/BUILD/mysql-5.7.22/build/libbinlogstandalone/src && /usr/bin/i686-pld-linux-g++ -DBOOST_GEOMETRY_SQRT_CHECK_FINITENESS -DHAVE_CONFIG_H -DHAVE_LIBEVENT2 -DSTANDALONE_BINLOG -D_FILE_OFFSET_BITS=64 -D_GNU_SOURCE -I/tmp/B.xnuEsf/BUILD/mysql-5.7.22/build/include -I/tmp/B.xnuEsf/BUILD/mysql-5.7.22/extra/rapidjson/include -I/tmp/B.xnuEsf/BUILD/mysql-5.7.22/build/libbinlogevents/include -I/tmp/B.xnuEsf/BUILD/mysql-5.7.22/libbinlogevents/export -I/tmp/B.xnuEsf/BUILD/mysql-5.7.22/include -I/tmp/B.xnuEsf/BUILD/mysql-5.7.22/libbinlogevents/include -I/tmp/B.xnuEsf/BUILD/mysql-5.7.22/build/libbinlogstandalone/../libbinlogevents/include -I/tmp/B.xnuEsf/BUILD/mysql-5.7.22/build/libbinlogstandalone/libbinlogevents/export -fPIC -Wall -Wextra -Wformat-security -Wvla -Wimplicit-fallthrough=2 -Woverloaded-virtual -Wno-unused-parameter -O3 -O2 -fwrapv -pipe -Wformat -Werror=format-security -gdwarf-4 -fno-debug-types-section -fvar-tracking-assignments -g2 -Wp,-D_FORTIFY_SOURCE=2 -fstack-protector-strong --param=ssp-buffer-size=4 -fomit-frame-pointer -march=i686 -fasynchronous-unwind-tables -mtune=pentium4 -gdwarf-4 -fno-debug-types-section -fvar-tracking-assignments -g2 -DNDEBUG -fno-omit-frame-pointer -fno-strict-aliasing -g -fabi-version=2 -fno-omit-frame-pointer -fno-strict-aliasing -std=gnu++03 -ffp-contract=off -DDBUG_OFF -o CMakeFiles/binlogstandalone_static.dir/__/__/libbinlogevents/src/rows_event.cpp.o -c /tmp/B.xnuEsf/BUILD/mysql-5.7.22/libbinlogevents/src/rows_event.cpp /tmp/B.xnuEsf/BUILD/mysql-5.7.22/libbinlogevents/src/rows_event.cpp: In constructor 'binary_log::Table_map_event::Table_map_event(const char*, unsigned int, const binary_log::Format_description_event*)': /tmp/B.xnuEsf/BUILD/mysql-5.7.22/libbinlogevents/src/rows_event.cpp:94:38: warning: 'void* memcpy(void*, const void*, size_t)' writing to an object of type 'class Table_id' with no trivial copy-assignment; use copy-assignment or copy-initialization instead [-Wclass-memaccess] memcpy(&m_table_id, post_start, 4); ^ In file included from /tmp/B.xnuEsf/BUILD/mysql-5.7.22/libbinlogevents/include/rows_event.h:31, from /tmp/B.xnuEsf/BUILD/mysql-5.7.22/libbinlogevents/src/rows_event.cpp:16: /tmp/B.xnuEsf/BUILD/mysql-5.7.22/libbinlogevents/include/table_id.h:32:7: note: 'class Table_id' declared here class Table_id ^~~~~~~~ /tmp/B.xnuEsf/BUILD/mysql-5.7.22/libbinlogevents/src/rows_event.cpp:101:38: warning: 'void* memcpy(void*, const void*, size_t)' writing to an object of type 'class Table_id' with no trivial copy-assignment; use copy-assignment or copy-initialization instead [-Wclass-memaccess] memcpy(&m_table_id, post_start, 6); ^ In file included from /tmp/B.xnuEsf/BUILD/mysql-5.7.22/libbinlogevents/include/rows_event.h:31, from /tmp/B.xnuEsf/BUILD/mysql-5.7.22/libbinlogevents/src/rows_event.cpp:16: /tmp/B.xnuEsf/BUILD/mysql-5.7.22/libbinlogevents/include/table_id.h:32:7: note: 'class Table_id' declared here class Table_id ^~~~~~~~ /tmp/B.xnuEsf/BUILD/mysql-5.7.22/libbinlogevents/src/rows_event.cpp: In constructor 'binary_log::Rows_event::Rows_event(const char*, unsigned int, const binary_log::Format_description_event*)': /tmp/B.xnuEsf/BUILD/mysql-5.7.22/libbinlogevents/src/rows_event.cpp:196:38: warning: 'void* memcpy(void*, const void*, size_t)' writing to an object of type 'class Table_id' with no trivial copy-assignment; use copy-assignment or copy-initialization instead [-Wclass-memaccess] memcpy(&m_table_id, post_start, 4); ^ In file included from /tmp/B.xnuEsf/BUILD/mysql-5.7.22/libbinlogevents/include/rows_event.h:31, from /tmp/B.xnuEsf/BUILD/mysql-5.7.22/libbinlogevents/src/rows_event.cpp:16: /tmp/B.xnuEsf/BUILD/mysql-5.7.22/libbinlogevents/include/table_id.h:32:7: note: 'class Table_id' declared here class Table_id ^~~~~~~~ /tmp/B.xnuEsf/BUILD/mysql-5.7.22/libbinlogevents/src/rows_event.cpp:202:38: warning: 'void* memcpy(void*, const void*, size_t)' writing to an object of type 'class Table_id' with no trivial copy-assignment; use copy-assignment or copy-initialization instead [-Wclass-memaccess] memcpy(&m_table_id, post_start, 6); ^ In file included from /tmp/B.xnuEsf/BUILD/mysql-5.7.22/libbinlogevents/include/rows_event.h:31, from /tmp/B.xnuEsf/BUILD/mysql-5.7.22/libbinlogevents/src/rows_event.cpp:16: /tmp/B.xnuEsf/BUILD/mysql-5.7.22/libbinlogevents/include/table_id.h:32:7: note: 'class Table_id' declared here class Table_id ^~~~~~~~ make[2]: Leaving directory '/tmp/B.xnuEsf/BUILD/mysql-5.7.22/build' make[2]: Entering directory '/tmp/B.xnuEsf/BUILD/mysql-5.7.22/build' [ 2%] Building CXX object libbinlogstandalone/src/CMakeFiles/binlogstandalone_static.dir/__/__/libbinlogevents/src/statement_events.cpp.o cd /tmp/B.xnuEsf/BUILD/mysql-5.7.22/build/libbinlogstandalone/src && /usr/bin/i686-pld-linux-g++ -DBOOST_GEOMETRY_SQRT_CHECK_FINITENESS -DHAVE_CONFIG_H -DHAVE_LIBEVENT2 -DSTANDALONE_BINLOG -D_FILE_OFFSET_BITS=64 -D_GNU_SOURCE -I/tmp/B.xnuEsf/BUILD/mysql-5.7.22/build/include -I/tmp/B.xnuEsf/BUILD/mysql-5.7.22/extra/rapidjson/include -I/tmp/B.xnuEsf/BUILD/mysql-5.7.22/build/libbinlogevents/include -I/tmp/B.xnuEsf/BUILD/mysql-5.7.22/libbinlogevents/export -I/tmp/B.xnuEsf/BUILD/mysql-5.7.22/include -I/tmp/B.xnuEsf/BUILD/mysql-5.7.22/libbinlogevents/include -I/tmp/B.xnuEsf/BUILD/mysql-5.7.22/build/libbinlogstandalone/../libbinlogevents/include -I/tmp/B.xnuEsf/BUILD/mysql-5.7.22/build/libbinlogstandalone/libbinlogevents/export -fPIC -Wall -Wextra -Wformat-security -Wvla -Wimplicit-fallthrough=2 -Woverloaded-virtual -Wno-unused-parameter -O3 -O2 -fwrapv -pipe -Wformat -Werror=format-security -gdwarf-4 -fno-debug-types-section -fvar-tracking-assignments -g2 -Wp,-D_FORTIFY_SOURCE=2 -fstack-protector-strong --param=ssp-buffer-size=4 -fomit-frame-pointer -march=i686 -fasynchronous-unwind-tables -mtune=pentium4 -gdwarf-4 -fno-debug-types-section -fvar-tracking-assignments -g2 -DNDEBUG -fno-omit-frame-pointer -fno-strict-aliasing -g -fabi-version=2 -fno-omit-frame-pointer -fno-strict-aliasing -std=gnu++03 -ffp-contract=off -DDBUG_OFF -o CMakeFiles/binlogstandalone_static.dir/__/__/libbinlogevents/src/statement_events.cpp.o -c /tmp/B.xnuEsf/BUILD/mysql-5.7.22/libbinlogevents/src/statement_events.cpp make[2]: Leaving directory '/tmp/B.xnuEsf/BUILD/mysql-5.7.22/build' make[2]: Entering directory '/tmp/B.xnuEsf/BUILD/mysql-5.7.22/build' [ 2%] Building CXX object libbinlogstandalone/src/CMakeFiles/binlogstandalone_static.dir/__/__/libbinlogevents/src/control_events.cpp.o cd /tmp/B.xnuEsf/BUILD/mysql-5.7.22/build/libbinlogstandalone/src && /usr/bin/i686-pld-linux-g++ -DBOOST_GEOMETRY_SQRT_CHECK_FINITENESS -DHAVE_CONFIG_H -DHAVE_LIBEVENT2 -DSTANDALONE_BINLOG -D_FILE_OFFSET_BITS=64 -D_GNU_SOURCE -I/tmp/B.xnuEsf/BUILD/mysql-5.7.22/build/include -I/tmp/B.xnuEsf/BUILD/mysql-5.7.22/extra/rapidjson/include -I/tmp/B.xnuEsf/BUILD/mysql-5.7.22/build/libbinlogevents/include -I/tmp/B.xnuEsf/BUILD/mysql-5.7.22/libbinlogevents/export -I/tmp/B.xnuEsf/BUILD/mysql-5.7.22/include -I/tmp/B.xnuEsf/BUILD/mysql-5.7.22/libbinlogevents/include -I/tmp/B.xnuEsf/BUILD/mysql-5.7.22/build/libbinlogstandalone/../libbinlogevents/include -I/tmp/B.xnuEsf/BUILD/mysql-5.7.22/build/libbinlogstandalone/libbinlogevents/export -fPIC -Wall -Wextra -Wformat-security -Wvla -Wimplicit-fallthrough=2 -Woverloaded-virtual -Wno-unused-parameter -O3 -O2 -fwrapv -pipe -Wformat -Werror=format-security -gdwarf-4 -fno-debug-types-section -fvar-tracking-assignments -g2 -Wp,-D_FORTIFY_SOURCE=2 -fstack-protector-strong --param=ssp-buffer-size=4 -fomit-frame-pointer -march=i686 -fasynchronous-unwind-tables -mtune=pentium4 -gdwarf-4 -fno-debug-types-section -fvar-tracking-assignments -g2 -DNDEBUG -fno-omit-frame-pointer -fno-strict-aliasing -g -fabi-version=2 -fno-omit-frame-pointer -fno-strict-aliasing -std=gnu++03 -ffp-contract=off -DDBUG_OFF -o CMakeFiles/binlogstandalone_static.dir/__/__/libbinlogevents/src/control_events.cpp.o -c /tmp/B.xnuEsf/BUILD/mysql-5.7.22/libbinlogevents/src/control_events.cpp make[2]: Leaving directory '/tmp/B.xnuEsf/BUILD/mysql-5.7.22/build' make[2]: Entering directory '/tmp/B.xnuEsf/BUILD/mysql-5.7.22/build' [ 2%] Building CXX object libbinlogstandalone/src/CMakeFiles/binlogstandalone_shared.dir/__/__/libbinlogevents/src/statement_events.cpp.o cd /tmp/B.xnuEsf/BUILD/mysql-5.7.22/build/libbinlogstandalone/src && /usr/bin/i686-pld-linux-g++ -DBOOST_GEOMETRY_SQRT_CHECK_FINITENESS -DHAVE_CONFIG_H -DHAVE_LIBEVENT2 -DSTANDALONE_BINLOG -D_FILE_OFFSET_BITS=64 -D_GNU_SOURCE -Dbinlogstandalone_shared_EXPORTS -I/tmp/B.xnuEsf/BUILD/mysql-5.7.22/build/include -I/tmp/B.xnuEsf/BUILD/mysql-5.7.22/extra/rapidjson/include -I/tmp/B.xnuEsf/BUILD/mysql-5.7.22/build/libbinlogevents/include -I/tmp/B.xnuEsf/BUILD/mysql-5.7.22/libbinlogevents/export -I/tmp/B.xnuEsf/BUILD/mysql-5.7.22/include -I/tmp/B.xnuEsf/BUILD/mysql-5.7.22/libbinlogevents/include -I/tmp/B.xnuEsf/BUILD/mysql-5.7.22/build/libbinlogstandalone/../libbinlogevents/include -I/tmp/B.xnuEsf/BUILD/mysql-5.7.22/build/libbinlogstandalone/libbinlogevents/export -fPIC -Wall -Wextra -Wformat-security -Wvla -Wimplicit-fallthrough=2 -Woverloaded-virtual -Wno-unused-parameter -O3 -O2 -fwrapv -pipe -Wformat -Werror=format-security -gdwarf-4 -fno-debug-types-section -fvar-tracking-assignments -g2 -Wp,-D_FORTIFY_SOURCE=2 -fstack-protector-strong --param=ssp-buffer-size=4 -fomit-frame-pointer -march=i686 -fasynchronous-unwind-tables -mtune=pentium4 -gdwarf-4 -fno-debug-types-section -fvar-tracking-assignments -g2 -DNDEBUG -fno-omit-frame-pointer -fno-strict-aliasing -g -fabi-version=2 -fno-omit-frame-pointer -fno-strict-aliasing -std=gnu++03 -ffp-contract=off -DDBUG_OFF -fPIC -o CMakeFiles/binlogstandalone_shared.dir/__/__/libbinlogevents/src/statement_events.cpp.o -c /tmp/B.xnuEsf/BUILD/mysql-5.7.22/libbinlogevents/src/statement_events.cpp make[2]: Leaving directory '/tmp/B.xnuEsf/BUILD/mysql-5.7.22/build' make[2]: Entering directory '/tmp/B.xnuEsf/BUILD/mysql-5.7.22/build' [ 2%] Building CXX object libbinlogstandalone/src/CMakeFiles/binlogstandalone_static.dir/__/__/libbinlogevents/src/uuid.cpp.o cd /tmp/B.xnuEsf/BUILD/mysql-5.7.22/build/libbinlogstandalone/src && /usr/bin/i686-pld-linux-g++ -DBOOST_GEOMETRY_SQRT_CHECK_FINITENESS -DHAVE_CONFIG_H -DHAVE_LIBEVENT2 -DSTANDALONE_BINLOG -D_FILE_OFFSET_BITS=64 -D_GNU_SOURCE -I/tmp/B.xnuEsf/BUILD/mysql-5.7.22/build/include -I/tmp/B.xnuEsf/BUILD/mysql-5.7.22/extra/rapidjson/include -I/tmp/B.xnuEsf/BUILD/mysql-5.7.22/build/libbinlogevents/include -I/tmp/B.xnuEsf/BUILD/mysql-5.7.22/libbinlogevents/export -I/tmp/B.xnuEsf/BUILD/mysql-5.7.22/include -I/tmp/B.xnuEsf/BUILD/mysql-5.7.22/libbinlogevents/include -I/tmp/B.xnuEsf/BUILD/mysql-5.7.22/build/libbinlogstandalone/../libbinlogevents/include -I/tmp/B.xnuEsf/BUILD/mysql-5.7.22/build/libbinlogstandalone/libbinlogevents/export -fPIC -Wall -Wextra -Wformat-security -Wvla -Wimplicit-fallthrough=2 -Woverloaded-virtual -Wno-unused-parameter -O3 -O2 -fwrapv -pipe -Wformat -Werror=format-security -gdwarf-4 -fno-debug-types-section -fvar-tracking-assignments -g2 -Wp,-D_FORTIFY_SOURCE=2 -fstack-protector-strong --param=ssp-buffer-size=4 -fomit-frame-pointer -march=i686 -fasynchronous-unwind-tables -mtune=pentium4 -gdwarf-4 -fno-debug-types-section -fvar-tracking-assignments -g2 -DNDEBUG -fno-omit-frame-pointer -fno-strict-aliasing -g -fabi-version=2 -fno-omit-frame-pointer -fno-strict-aliasing -std=gnu++03 -ffp-contract=off -DDBUG_OFF -o CMakeFiles/binlogstandalone_static.dir/__/__/libbinlogevents/src/uuid.cpp.o -c /tmp/B.xnuEsf/BUILD/mysql-5.7.22/libbinlogevents/src/uuid.cpp make[2]: Leaving directory '/tmp/B.xnuEsf/BUILD/mysql-5.7.22/build' make[2]: Entering directory '/tmp/B.xnuEsf/BUILD/mysql-5.7.22/build' [ 2%] Building CXX object libbinlogstandalone/src/CMakeFiles/binlogstandalone_shared.dir/__/__/libbinlogevents/src/uuid.cpp.o cd /tmp/B.xnuEsf/BUILD/mysql-5.7.22/build/libbinlogstandalone/src && /usr/bin/i686-pld-linux-g++ -DBOOST_GEOMETRY_SQRT_CHECK_FINITENESS -DHAVE_CONFIG_H -DHAVE_LIBEVENT2 -DSTANDALONE_BINLOG -D_FILE_OFFSET_BITS=64 -D_GNU_SOURCE -Dbinlogstandalone_shared_EXPORTS -I/tmp/B.xnuEsf/BUILD/mysql-5.7.22/build/include -I/tmp/B.xnuEsf/BUILD/mysql-5.7.22/extra/rapidjson/include -I/tmp/B.xnuEsf/BUILD/mysql-5.7.22/build/libbinlogevents/include -I/tmp/B.xnuEsf/BUILD/mysql-5.7.22/libbinlogevents/export -I/tmp/B.xnuEsf/BUILD/mysql-5.7.22/include -I/tmp/B.xnuEsf/BUILD/mysql-5.7.22/libbinlogevents/include -I/tmp/B.xnuEsf/BUILD/mysql-5.7.22/build/libbinlogstandalone/../libbinlogevents/include -I/tmp/B.xnuEsf/BUILD/mysql-5.7.22/build/libbinlogstandalone/libbinlogevents/export -fPIC -Wall -Wextra -Wformat-security -Wvla -Wimplicit-fallthrough=2 -Woverloaded-virtual -Wno-unused-parameter -O3 -O2 -fwrapv -pipe -Wformat -Werror=format-security -gdwarf-4 -fno-debug-types-section -fvar-tracking-assignments -g2 -Wp,-D_FORTIFY_SOURCE=2 -fstack-protector-strong --param=ssp-buffer-size=4 -fomit-frame-pointer -march=i686 -fasynchronous-unwind-tables -mtune=pentium4 -gdwarf-4 -fno-debug-types-section -fvar-tracking-assignments -g2 -DNDEBUG -fno-omit-frame-pointer -fno-strict-aliasing -g -fabi-version=2 -fno-omit-frame-pointer -fno-strict-aliasing -std=gnu++03 -ffp-contract=off -DDBUG_OFF -fPIC -o CMakeFiles/binlogstandalone_shared.dir/__/__/libbinlogevents/src/uuid.cpp.o -c /tmp/B.xnuEsf/BUILD/mysql-5.7.22/libbinlogevents/src/uuid.cpp make[2]: Leaving directory '/tmp/B.xnuEsf/BUILD/mysql-5.7.22/build' make[2]: Entering directory '/tmp/B.xnuEsf/BUILD/mysql-5.7.22/build' [ 2%] Building C object regex/CMakeFiles/regex.dir/regfree.c.o cd /tmp/B.xnuEsf/BUILD/mysql-5.7.22/build/regex && /usr/bin/i686-pld-linux-gcc -DBOOST_GEOMETRY_SQRT_CHECK_FINITENESS -DHAVE_CONFIG_H -DHAVE_LIBEVENT2 -D_FILE_OFFSET_BITS=64 -D_GNU_SOURCE -I/tmp/B.xnuEsf/BUILD/mysql-5.7.22/build/include -I/tmp/B.xnuEsf/BUILD/mysql-5.7.22/extra/rapidjson/include -I/tmp/B.xnuEsf/BUILD/mysql-5.7.22/build/libbinlogevents/include -I/tmp/B.xnuEsf/BUILD/mysql-5.7.22/libbinlogevents/export -I/tmp/B.xnuEsf/BUILD/mysql-5.7.22/include -fPIC -Wall -Wextra -Wformat-security -Wvla -Wimplicit-fallthrough=2 -Wwrite-strings -Wdeclaration-after-statement -O3 -O2 -fwrapv -pipe -Wformat -Werror=format-security -gdwarf-4 -fno-debug-types-section -fvar-tracking-assignments -g2 -Wp,-D_FORTIFY_SOURCE=2 -fstack-protector-strong --param=ssp-buffer-size=4 -fomit-frame-pointer -march=i686 -fasynchronous-unwind-tables -mtune=pentium4 -gdwarf-4 -fno-debug-types-section -fvar-tracking-assignments -g2 -DNDEBUG -fno-omit-frame-pointer -fno-strict-aliasing -g -fabi-version=2 -fno-omit-frame-pointer -fno-strict-aliasing -ffp-contract=off -DDBUG_OFF -o CMakeFiles/regex.dir/regfree.c.o -c /tmp/B.xnuEsf/BUILD/mysql-5.7.22/regex/regfree.c make[2]: Leaving directory '/tmp/B.xnuEsf/BUILD/mysql-5.7.22/build' make[2]: Entering directory '/tmp/B.xnuEsf/BUILD/mysql-5.7.22/build' [ 2%] Linking CXX static library ../lib/libbinlogstandalone.a cd /tmp/B.xnuEsf/BUILD/mysql-5.7.22/build/libbinlogstandalone/src && /usr/bin/cmake -P CMakeFiles/binlogstandalone_static.dir/cmake_clean_target.cmake cd /tmp/B.xnuEsf/BUILD/mysql-5.7.22/build/libbinlogstandalone/src && /usr/bin/cmake -E cmake_link_script CMakeFiles/binlogstandalone_static.dir/link.txt --verbose=1 /usr/bin/ar qc ../lib/libbinlogstandalone.a CMakeFiles/binlogstandalone_static.dir/__/__/libbinlogevents/src/load_data_events.cpp.o CMakeFiles/binlogstandalone_static.dir/__/__/libbinlogevents/src/rows_event.cpp.o CMakeFiles/binlogstandalone_static.dir/__/__/libbinlogevents/src/binlog_event.cpp.o CMakeFiles/binlogstandalone_static.dir/__/__/libbinlogevents/src/control_events.cpp.o CMakeFiles/binlogstandalone_static.dir/__/__/libbinlogevents/src/statement_events.cpp.o CMakeFiles/binlogstandalone_static.dir/__/__/libbinlogevents/src/uuid.cpp.o /usr/bin/ranlib ../lib/libbinlogstandalone.a make[2]: Leaving directory '/tmp/B.xnuEsf/BUILD/mysql-5.7.22/build' make[1]: Entering directory '/tmp/B.xnuEsf/BUILD/mysql-5.7.22/build' [ 2%] Built target binlogstandalone_static make[1]: Leaving directory '/tmp/B.xnuEsf/BUILD/mysql-5.7.22/build' make[2]: Entering directory '/tmp/B.xnuEsf/BUILD/mysql-5.7.22/build' [ 2%] Building CXX object rapid/plugin/group_replication/CMakeFiles/gr_unit_test_resource.dir/libmysqlgcs/src/interface/xplatform/my_xp_cond.cc.o cd /tmp/B.xnuEsf/BUILD/mysql-5.7.22/build/rapid/plugin/group_replication && /usr/bin/i686-pld-linux-g++ -DBOOST_GEOMETRY_SQRT_CHECK_FINITENESS -DDISABLE_ALL_PSI -DHAVE_CONFIG_H -DHAVE_LIBEVENT2 -DHAVE_OPENSSL -DHAVE_TIRPC -DXCOM_HAVE_OPENSSL -D_FILE_OFFSET_BITS=64 -D_GNU_SOURCE -I/tmp/B.xnuEsf/BUILD/mysql-5.7.22/build/include -I/tmp/B.xnuEsf/BUILD/mysql-5.7.22/extra/rapidjson/include -I/tmp/B.xnuEsf/BUILD/mysql-5.7.22/build/libbinlogevents/include -I/tmp/B.xnuEsf/BUILD/mysql-5.7.22/libbinlogevents/export -I/tmp/B.xnuEsf/BUILD/mysql-5.7.22/build/rapid/plugin/group_replication/xdr_gen -isystem /usr/include/tirpc -I/tmp/B.xnuEsf/BUILD/mysql-5.7.22/libbinlogevents/include -I/tmp/B.xnuEsf/BUILD/mysql-5.7.22/rapid/plugin/group_replication/include -I/tmp/B.xnuEsf/BUILD/mysql-5.7.22/rapid/plugin/group_replication/include/sql_service -I/tmp/B.xnuEsf/BUILD/mysql-5.7.22/rapid/plugin/group_replication/libmysqlgcs/include -I/tmp/B.xnuEsf/BUILD/mysql-5.7.22/rapid/plugin/group_replication/libmysqlgcs/include/mysql -I/tmp/B.xnuEsf/BUILD/mysql-5.7.22/rapid/plugin/group_replication/libmysqlgcs/include/mysql/gcs -I/tmp/B.xnuEsf/BUILD/mysql-5.7.22/rapid/plugin/group_replication/libmysqlgcs/src/bindings/xcom/xcom -I/tmp/B.xnuEsf/BUILD/mysql-5.7.22/build/rapid/plugin/group_replication/include -I/tmp/B.xnuEsf/BUILD/mysql-5.7.22/include -I/tmp/B.xnuEsf/BUILD/mysql-5.7.22/sql -I/tmp/B.xnuEsf/BUILD/mysql-5.7.22/sql/auth -I/tmp/B.xnuEsf/BUILD/mysql-5.7.22/regex -fPIC -Wall -Wextra -Wformat-security -Wvla -Wimplicit-fallthrough=2 -Woverloaded-virtual -Wno-unused-parameter -O3 -O2 -fwrapv -pipe -Wformat -Werror=format-security -gdwarf-4 -fno-debug-types-section -fvar-tracking-assignments -g2 -Wp,-D_FORTIFY_SOURCE=2 -fstack-protector-strong --param=ssp-buffer-size=4 -fomit-frame-pointer -march=i686 -fasynchronous-unwind-tables -mtune=pentium4 -gdwarf-4 -fno-debug-types-section -fvar-tracking-assignments -g2 -DNDEBUG -fno-omit-frame-pointer -fno-strict-aliasing -g -fabi-version=2 -fno-omit-frame-pointer -fno-strict-aliasing -std=gnu++03 -ffp-contract=off -DDBUG_OFF -o CMakeFiles/gr_unit_test_resource.dir/libmysqlgcs/src/interface/xplatform/my_xp_cond.cc.o -c /tmp/B.xnuEsf/BUILD/mysql-5.7.22/rapid/plugin/group_replication/libmysqlgcs/src/interface/xplatform/my_xp_cond.cc make[2]: Leaving directory '/tmp/B.xnuEsf/BUILD/mysql-5.7.22/build' make[2]: Entering directory '/tmp/B.xnuEsf/BUILD/mysql-5.7.22/build' [ 2%] Building CXX object rapid/plugin/group_replication/CMakeFiles/gr_unit_test_resource.dir/libmysqlgcs/src/interface/xplatform/my_xp_thread.cc.o cd /tmp/B.xnuEsf/BUILD/mysql-5.7.22/build/rapid/plugin/group_replication && /usr/bin/i686-pld-linux-g++ -DBOOST_GEOMETRY_SQRT_CHECK_FINITENESS -DDISABLE_ALL_PSI -DHAVE_CONFIG_H -DHAVE_LIBEVENT2 -DHAVE_OPENSSL -DHAVE_TIRPC -DXCOM_HAVE_OPENSSL -D_FILE_OFFSET_BITS=64 -D_GNU_SOURCE -I/tmp/B.xnuEsf/BUILD/mysql-5.7.22/build/include -I/tmp/B.xnuEsf/BUILD/mysql-5.7.22/extra/rapidjson/include -I/tmp/B.xnuEsf/BUILD/mysql-5.7.22/build/libbinlogevents/include -I/tmp/B.xnuEsf/BUILD/mysql-5.7.22/libbinlogevents/export -I/tmp/B.xnuEsf/BUILD/mysql-5.7.22/build/rapid/plugin/group_replication/xdr_gen -isystem /usr/include/tirpc -I/tmp/B.xnuEsf/BUILD/mysql-5.7.22/libbinlogevents/include -I/tmp/B.xnuEsf/BUILD/mysql-5.7.22/rapid/plugin/group_replication/include -I/tmp/B.xnuEsf/BUILD/mysql-5.7.22/rapid/plugin/group_replication/include/sql_service -I/tmp/B.xnuEsf/BUILD/mysql-5.7.22/rapid/plugin/group_replication/libmysqlgcs/include -I/tmp/B.xnuEsf/BUILD/mysql-5.7.22/rapid/plugin/group_replication/libmysqlgcs/include/mysql -I/tmp/B.xnuEsf/BUILD/mysql-5.7.22/rapid/plugin/group_replication/libmysqlgcs/include/mysql/gcs -I/tmp/B.xnuEsf/BUILD/mysql-5.7.22/rapid/plugin/group_replication/libmysqlgcs/src/bindings/xcom/xcom -I/tmp/B.xnuEsf/BUILD/mysql-5.7.22/build/rapid/plugin/group_replication/include -I/tmp/B.xnuEsf/BUILD/mysql-5.7.22/include -I/tmp/B.xnuEsf/BUILD/mysql-5.7.22/sql -I/tmp/B.xnuEsf/BUILD/mysql-5.7.22/sql/auth -I/tmp/B.xnuEsf/BUILD/mysql-5.7.22/regex -fPIC -Wall -Wextra -Wformat-security -Wvla -Wimplicit-fallthrough=2 -Woverloaded-virtual -Wno-unused-parameter -O3 -O2 -fwrapv -pipe -Wformat -Werror=format-security -gdwarf-4 -fno-debug-types-section -fvar-tracking-assignments -g2 -Wp,-D_FORTIFY_SOURCE=2 -fstack-protector-strong --param=ssp-buffer-size=4 -fomit-frame-pointer -march=i686 -fasynchronous-unwind-tables -mtune=pentium4 -gdwarf-4 -fno-debug-types-section -fvar-tracking-assignments -g2 -DNDEBUG -fno-omit-frame-pointer -fno-strict-aliasing -g -fabi-version=2 -fno-omit-frame-pointer -fno-strict-aliasing -std=gnu++03 -ffp-contract=off -DDBUG_OFF -o CMakeFiles/gr_unit_test_resource.dir/libmysqlgcs/src/interface/xplatform/my_xp_thread.cc.o -c /tmp/B.xnuEsf/BUILD/mysql-5.7.22/rapid/plugin/group_replication/libmysqlgcs/src/interface/xplatform/my_xp_thread.cc make[2]: Leaving directory '/tmp/B.xnuEsf/BUILD/mysql-5.7.22/build' make[2]: Entering directory '/tmp/B.xnuEsf/BUILD/mysql-5.7.22/build' [ 2%] Building C object regex/CMakeFiles/regex.dir/reginit.c.o cd /tmp/B.xnuEsf/BUILD/mysql-5.7.22/build/regex && /usr/bin/i686-pld-linux-gcc -DBOOST_GEOMETRY_SQRT_CHECK_FINITENESS -DHAVE_CONFIG_H -DHAVE_LIBEVENT2 -D_FILE_OFFSET_BITS=64 -D_GNU_SOURCE -I/tmp/B.xnuEsf/BUILD/mysql-5.7.22/build/include -I/tmp/B.xnuEsf/BUILD/mysql-5.7.22/extra/rapidjson/include -I/tmp/B.xnuEsf/BUILD/mysql-5.7.22/build/libbinlogevents/include -I/tmp/B.xnuEsf/BUILD/mysql-5.7.22/libbinlogevents/export -I/tmp/B.xnuEsf/BUILD/mysql-5.7.22/include -fPIC -Wall -Wextra -Wformat-security -Wvla -Wimplicit-fallthrough=2 -Wwrite-strings -Wdeclaration-after-statement -O3 -O2 -fwrapv -pipe -Wformat -Werror=format-security -gdwarf-4 -fno-debug-types-section -fvar-tracking-assignments -g2 -Wp,-D_FORTIFY_SOURCE=2 -fstack-protector-strong --param=ssp-buffer-size=4 -fomit-frame-pointer -march=i686 -fasynchronous-unwind-tables -mtune=pentium4 -gdwarf-4 -fno-debug-types-section -fvar-tracking-assignments -g2 -DNDEBUG -fno-omit-frame-pointer -fno-strict-aliasing -g -fabi-version=2 -fno-omit-frame-pointer -fno-strict-aliasing -ffp-contract=off -DDBUG_OFF -o CMakeFiles/regex.dir/reginit.c.o -c /tmp/B.xnuEsf/BUILD/mysql-5.7.22/regex/reginit.c make[2]: Leaving directory '/tmp/B.xnuEsf/BUILD/mysql-5.7.22/build' make[2]: Entering directory '/tmp/B.xnuEsf/BUILD/mysql-5.7.22/build' [ 2%] Building CXX object rapid/plugin/group_replication/CMakeFiles/gr_unit_test_resource.dir/libmysqlgcs/src/interface/xplatform/my_xp_mutex.cc.o cd /tmp/B.xnuEsf/BUILD/mysql-5.7.22/build/rapid/plugin/group_replication && /usr/bin/i686-pld-linux-g++ -DBOOST_GEOMETRY_SQRT_CHECK_FINITENESS -DDISABLE_ALL_PSI -DHAVE_CONFIG_H -DHAVE_LIBEVENT2 -DHAVE_OPENSSL -DHAVE_TIRPC -DXCOM_HAVE_OPENSSL -D_FILE_OFFSET_BITS=64 -D_GNU_SOURCE -I/tmp/B.xnuEsf/BUILD/mysql-5.7.22/build/include -I/tmp/B.xnuEsf/BUILD/mysql-5.7.22/extra/rapidjson/include -I/tmp/B.xnuEsf/BUILD/mysql-5.7.22/build/libbinlogevents/include -I/tmp/B.xnuEsf/BUILD/mysql-5.7.22/libbinlogevents/export -I/tmp/B.xnuEsf/BUILD/mysql-5.7.22/build/rapid/plugin/group_replication/xdr_gen -isystem /usr/include/tirpc -I/tmp/B.xnuEsf/BUILD/mysql-5.7.22/libbinlogevents/include -I/tmp/B.xnuEsf/BUILD/mysql-5.7.22/rapid/plugin/group_replication/include -I/tmp/B.xnuEsf/BUILD/mysql-5.7.22/rapid/plugin/group_replication/include/sql_service -I/tmp/B.xnuEsf/BUILD/mysql-5.7.22/rapid/plugin/group_replication/libmysqlgcs/include -I/tmp/B.xnuEsf/BUILD/mysql-5.7.22/rapid/plugin/group_replication/libmysqlgcs/include/mysql -I/tmp/B.xnuEsf/BUILD/mysql-5.7.22/rapid/plugin/group_replication/libmysqlgcs/include/mysql/gcs -I/tmp/B.xnuEsf/BUILD/mysql-5.7.22/rapid/plugin/group_replication/libmysqlgcs/src/bindings/xcom/xcom -I/tmp/B.xnuEsf/BUILD/mysql-5.7.22/build/rapid/plugin/group_replication/include -I/tmp/B.xnuEsf/BUILD/mysql-5.7.22/include -I/tmp/B.xnuEsf/BUILD/mysql-5.7.22/sql -I/tmp/B.xnuEsf/BUILD/mysql-5.7.22/sql/auth -I/tmp/B.xnuEsf/BUILD/mysql-5.7.22/regex -fPIC -Wall -Wextra -Wformat-security -Wvla -Wimplicit-fallthrough=2 -Woverloaded-virtual -Wno-unused-parameter -O3 -O2 -fwrapv -pipe -Wformat -Werror=format-security -gdwarf-4 -fno-debug-types-section -fvar-tracking-assignments -g2 -Wp,-D_FORTIFY_SOURCE=2 -fstack-protector-strong --param=ssp-buffer-size=4 -fomit-frame-pointer -march=i686 -fasynchronous-unwind-tables -mtune=pentium4 -gdwarf-4 -fno-debug-types-section -fvar-tracking-assignments -g2 -DNDEBUG -fno-omit-frame-pointer -fno-strict-aliasing -g -fabi-version=2 -fno-omit-frame-pointer -fno-strict-aliasing -std=gnu++03 -ffp-contract=off -DDBUG_OFF -o CMakeFiles/gr_unit_test_resource.dir/libmysqlgcs/src/interface/xplatform/my_xp_mutex.cc.o -c /tmp/B.xnuEsf/BUILD/mysql-5.7.22/rapid/plugin/group_replication/libmysqlgcs/src/interface/xplatform/my_xp_mutex.cc make[2]: Leaving directory '/tmp/B.xnuEsf/BUILD/mysql-5.7.22/build' make[2]: Entering directory '/tmp/B.xnuEsf/BUILD/mysql-5.7.22/build' [ 2%] Linking C static library ../archive_output_directory/libregex.a cd /tmp/B.xnuEsf/BUILD/mysql-5.7.22/build/regex && /usr/bin/cmake -P CMakeFiles/regex.dir/cmake_clean_target.cmake cd /tmp/B.xnuEsf/BUILD/mysql-5.7.22/build/regex && /usr/bin/cmake -E cmake_link_script CMakeFiles/regex.dir/link.txt --verbose=1 /usr/bin/ar qc ../archive_output_directory/libregex.a CMakeFiles/regex.dir/regcomp.c.o CMakeFiles/regex.dir/regerror.c.o CMakeFiles/regex.dir/regexec.c.o CMakeFiles/regex.dir/regfree.c.o CMakeFiles/regex.dir/reginit.c.o /usr/bin/ranlib ../archive_output_directory/libregex.a cd /tmp/B.xnuEsf/BUILD/mysql-5.7.22/build/regex && /usr/bin/cmake -DTARGET_NAME=regex -DTARGET_LOC=/tmp/B.xnuEsf/BUILD/mysql-5.7.22/build/archive_output_directory/libregex.a -DCFG_INTDIR=. -P /tmp/B.xnuEsf/BUILD/mysql-5.7.22/build/archive_output_directory/lib_location_regex.cmake make[2]: Leaving directory '/tmp/B.xnuEsf/BUILD/mysql-5.7.22/build' make[1]: Entering directory '/tmp/B.xnuEsf/BUILD/mysql-5.7.22/build' [ 2%] Built target regex make[1]: Leaving directory '/tmp/B.xnuEsf/BUILD/mysql-5.7.22/build' make[2]: Entering directory '/tmp/B.xnuEsf/BUILD/mysql-5.7.22/build' [ 2%] Building C object strings/CMakeFiles/strings.dir/ctype-bin.c.o cd /tmp/B.xnuEsf/BUILD/mysql-5.7.22/build/strings && /usr/bin/i686-pld-linux-gcc -DBOOST_GEOMETRY_SQRT_CHECK_FINITENESS -DDISABLE_MYSQL_THREAD_H -DHAVE_CONFIG_H -DHAVE_LIBEVENT2 -D_FILE_OFFSET_BITS=64 -D_GNU_SOURCE -I/tmp/B.xnuEsf/BUILD/mysql-5.7.22/build/include -I/tmp/B.xnuEsf/BUILD/mysql-5.7.22/extra/rapidjson/include -I/tmp/B.xnuEsf/BUILD/mysql-5.7.22/build/libbinlogevents/include -I/tmp/B.xnuEsf/BUILD/mysql-5.7.22/libbinlogevents/export -I/tmp/B.xnuEsf/BUILD/mysql-5.7.22/include -fPIC -Wall -Wextra -Wformat-security -Wvla -Wimplicit-fallthrough=2 -Wwrite-strings -Wdeclaration-after-statement -O3 -O2 -fwrapv -pipe -Wformat -Werror=format-security -gdwarf-4 -fno-debug-types-section -fvar-tracking-assignments -g2 -Wp,-D_FORTIFY_SOURCE=2 -fstack-protector-strong --param=ssp-buffer-size=4 -fomit-frame-pointer -march=i686 -fasynchronous-unwind-tables -mtune=pentium4 -gdwarf-4 -fno-debug-types-section -fvar-tracking-assignments -g2 -DNDEBUG -fno-omit-frame-pointer -fno-strict-aliasing -g -fabi-version=2 -fno-omit-frame-pointer -fno-strict-aliasing -ffp-contract=off -DDBUG_OFF -o CMakeFiles/strings.dir/ctype-bin.c.o -c /tmp/B.xnuEsf/BUILD/mysql-5.7.22/strings/ctype-bin.c make[2]: Leaving directory '/tmp/B.xnuEsf/BUILD/mysql-5.7.22/build' make[2]: Entering directory '/tmp/B.xnuEsf/BUILD/mysql-5.7.22/build' [ 2%] Building CXX object rapid/plugin/group_replication/CMakeFiles/gr_unit_test_resource.dir/src/member_info.cc.o cd /tmp/B.xnuEsf/BUILD/mysql-5.7.22/build/rapid/plugin/group_replication && /usr/bin/i686-pld-linux-g++ -DBOOST_GEOMETRY_SQRT_CHECK_FINITENESS -DDISABLE_ALL_PSI -DHAVE_CONFIG_H -DHAVE_LIBEVENT2 -DHAVE_OPENSSL -DHAVE_TIRPC -DXCOM_HAVE_OPENSSL -D_FILE_OFFSET_BITS=64 -D_GNU_SOURCE -I/tmp/B.xnuEsf/BUILD/mysql-5.7.22/build/include -I/tmp/B.xnuEsf/BUILD/mysql-5.7.22/extra/rapidjson/include -I/tmp/B.xnuEsf/BUILD/mysql-5.7.22/build/libbinlogevents/include -I/tmp/B.xnuEsf/BUILD/mysql-5.7.22/libbinlogevents/export -I/tmp/B.xnuEsf/BUILD/mysql-5.7.22/build/rapid/plugin/group_replication/xdr_gen -isystem /usr/include/tirpc -I/tmp/B.xnuEsf/BUILD/mysql-5.7.22/libbinlogevents/include -I/tmp/B.xnuEsf/BUILD/mysql-5.7.22/rapid/plugin/group_replication/include -I/tmp/B.xnuEsf/BUILD/mysql-5.7.22/rapid/plugin/group_replication/include/sql_service -I/tmp/B.xnuEsf/BUILD/mysql-5.7.22/rapid/plugin/group_replication/libmysqlgcs/include -I/tmp/B.xnuEsf/BUILD/mysql-5.7.22/rapid/plugin/group_replication/libmysqlgcs/include/mysql -I/tmp/B.xnuEsf/BUILD/mysql-5.7.22/rapid/plugin/group_replication/libmysqlgcs/include/mysql/gcs -I/tmp/B.xnuEsf/BUILD/mysql-5.7.22/rapid/plugin/group_replication/libmysqlgcs/src/bindings/xcom/xcom -I/tmp/B.xnuEsf/BUILD/mysql-5.7.22/build/rapid/plugin/group_replication/include -I/tmp/B.xnuEsf/BUILD/mysql-5.7.22/include -I/tmp/B.xnuEsf/BUILD/mysql-5.7.22/sql -I/tmp/B.xnuEsf/BUILD/mysql-5.7.22/sql/auth -I/tmp/B.xnuEsf/BUILD/mysql-5.7.22/regex -fPIC -Wall -Wextra -Wformat-security -Wvla -Wimplicit-fallthrough=2 -Woverloaded-virtual -Wno-unused-parameter -O3 -O2 -fwrapv -pipe -Wformat -Werror=format-security -gdwarf-4 -fno-debug-types-section -fvar-tracking-assignments -g2 -Wp,-D_FORTIFY_SOURCE=2 -fstack-protector-strong --param=ssp-buffer-size=4 -fomit-frame-pointer -march=i686 -fasynchronous-unwind-tables -mtune=pentium4 -gdwarf-4 -fno-debug-types-section -fvar-tracking-assignments -g2 -DNDEBUG -fno-omit-frame-pointer -fno-strict-aliasing -g -fabi-version=2 -fno-omit-frame-pointer -fno-strict-aliasing -std=gnu++03 -ffp-contract=off -DDBUG_OFF -o CMakeFiles/gr_unit_test_resource.dir/src/member_info.cc.o -c /tmp/B.xnuEsf/BUILD/mysql-5.7.22/rapid/plugin/group_replication/src/member_info.cc make[2]: Leaving directory '/tmp/B.xnuEsf/BUILD/mysql-5.7.22/build' make[2]: Entering directory '/tmp/B.xnuEsf/BUILD/mysql-5.7.22/build' [ 2%] Building CXX object rapid/plugin/group_replication/CMakeFiles/gr_unit_test_resource.dir/libmysqlgcs/src/interface/gcs_logging.cc.o cd /tmp/B.xnuEsf/BUILD/mysql-5.7.22/build/rapid/plugin/group_replication && /usr/bin/i686-pld-linux-g++ -DBOOST_GEOMETRY_SQRT_CHECK_FINITENESS -DDISABLE_ALL_PSI -DHAVE_CONFIG_H -DHAVE_LIBEVENT2 -DHAVE_OPENSSL -DHAVE_TIRPC -DXCOM_HAVE_OPENSSL -D_FILE_OFFSET_BITS=64 -D_GNU_SOURCE -I/tmp/B.xnuEsf/BUILD/mysql-5.7.22/build/include -I/tmp/B.xnuEsf/BUILD/mysql-5.7.22/extra/rapidjson/include -I/tmp/B.xnuEsf/BUILD/mysql-5.7.22/build/libbinlogevents/include -I/tmp/B.xnuEsf/BUILD/mysql-5.7.22/libbinlogevents/export -I/tmp/B.xnuEsf/BUILD/mysql-5.7.22/build/rapid/plugin/group_replication/xdr_gen -isystem /usr/include/tirpc -I/tmp/B.xnuEsf/BUILD/mysql-5.7.22/libbinlogevents/include -I/tmp/B.xnuEsf/BUILD/mysql-5.7.22/rapid/plugin/group_replication/include -I/tmp/B.xnuEsf/BUILD/mysql-5.7.22/rapid/plugin/group_replication/include/sql_service -I/tmp/B.xnuEsf/BUILD/mysql-5.7.22/rapid/plugin/group_replication/libmysqlgcs/include -I/tmp/B.xnuEsf/BUILD/mysql-5.7.22/rapid/plugin/group_replication/libmysqlgcs/include/mysql -I/tmp/B.xnuEsf/BUILD/mysql-5.7.22/rapid/plugin/group_replication/libmysqlgcs/include/mysql/gcs -I/tmp/B.xnuEsf/BUILD/mysql-5.7.22/rapid/plugin/group_replication/libmysqlgcs/src/bindings/xcom/xcom -I/tmp/B.xnuEsf/BUILD/mysql-5.7.22/build/rapid/plugin/group_replication/include -I/tmp/B.xnuEsf/BUILD/mysql-5.7.22/include -I/tmp/B.xnuEsf/BUILD/mysql-5.7.22/sql -I/tmp/B.xnuEsf/BUILD/mysql-5.7.22/sql/auth -I/tmp/B.xnuEsf/BUILD/mysql-5.7.22/regex -fPIC -Wall -Wextra -Wformat-security -Wvla -Wimplicit-fallthrough=2 -Woverloaded-virtual -Wno-unused-parameter -O3 -O2 -fwrapv -pipe -Wformat -Werror=format-security -gdwarf-4 -fno-debug-types-section -fvar-tracking-assignments -g2 -Wp,-D_FORTIFY_SOURCE=2 -fstack-protector-strong --param=ssp-buffer-size=4 -fomit-frame-pointer -march=i686 -fasynchronous-unwind-tables -mtune=pentium4 -gdwarf-4 -fno-debug-types-section -fvar-tracking-assignments -g2 -DNDEBUG -fno-omit-frame-pointer -fno-strict-aliasing -g -fabi-version=2 -fno-omit-frame-pointer -fno-strict-aliasing -std=gnu++03 -ffp-contract=off -DDBUG_OFF -o CMakeFiles/gr_unit_test_resource.dir/libmysqlgcs/src/interface/gcs_logging.cc.o -c /tmp/B.xnuEsf/BUILD/mysql-5.7.22/rapid/plugin/group_replication/libmysqlgcs/src/interface/gcs_logging.cc make[2]: Leaving directory '/tmp/B.xnuEsf/BUILD/mysql-5.7.22/build' make[2]: Entering directory '/tmp/B.xnuEsf/BUILD/mysql-5.7.22/build' [ 2%] Building CXX object libbinlogstandalone/src/CMakeFiles/binlogstandalone_shared.dir/__/__/libbinlogevents/src/control_events.cpp.o cd /tmp/B.xnuEsf/BUILD/mysql-5.7.22/build/libbinlogstandalone/src && /usr/bin/i686-pld-linux-g++ -DBOOST_GEOMETRY_SQRT_CHECK_FINITENESS -DHAVE_CONFIG_H -DHAVE_LIBEVENT2 -DSTANDALONE_BINLOG -D_FILE_OFFSET_BITS=64 -D_GNU_SOURCE -Dbinlogstandalone_shared_EXPORTS -I/tmp/B.xnuEsf/BUILD/mysql-5.7.22/build/include -I/tmp/B.xnuEsf/BUILD/mysql-5.7.22/extra/rapidjson/include -I/tmp/B.xnuEsf/BUILD/mysql-5.7.22/build/libbinlogevents/include -I/tmp/B.xnuEsf/BUILD/mysql-5.7.22/libbinlogevents/export -I/tmp/B.xnuEsf/BUILD/mysql-5.7.22/include -I/tmp/B.xnuEsf/BUILD/mysql-5.7.22/libbinlogevents/include -I/tmp/B.xnuEsf/BUILD/mysql-5.7.22/build/libbinlogstandalone/../libbinlogevents/include -I/tmp/B.xnuEsf/BUILD/mysql-5.7.22/build/libbinlogstandalone/libbinlogevents/export -fPIC -Wall -Wextra -Wformat-security -Wvla -Wimplicit-fallthrough=2 -Woverloaded-virtual -Wno-unused-parameter -O3 -O2 -fwrapv -pipe -Wformat -Werror=format-security -gdwarf-4 -fno-debug-types-section -fvar-tracking-assignments -g2 -Wp,-D_FORTIFY_SOURCE=2 -fstack-protector-strong --param=ssp-buffer-size=4 -fomit-frame-pointer -march=i686 -fasynchronous-unwind-tables -mtune=pentium4 -gdwarf-4 -fno-debug-types-section -fvar-tracking-assignments -g2 -DNDEBUG -fno-omit-frame-pointer -fno-strict-aliasing -g -fabi-version=2 -fno-omit-frame-pointer -fno-strict-aliasing -std=gnu++03 -ffp-contract=off -DDBUG_OFF -fPIC -o CMakeFiles/binlogstandalone_shared.dir/__/__/libbinlogevents/src/control_events.cpp.o -c /tmp/B.xnuEsf/BUILD/mysql-5.7.22/libbinlogevents/src/control_events.cpp make[2]: Leaving directory '/tmp/B.xnuEsf/BUILD/mysql-5.7.22/build' make[2]: Entering directory '/tmp/B.xnuEsf/BUILD/mysql-5.7.22/build' [ 2%] Building C object strings/CMakeFiles/strings.dir/ctype-czech.c.o cd /tmp/B.xnuEsf/BUILD/mysql-5.7.22/build/strings && /usr/bin/i686-pld-linux-gcc -DBOOST_GEOMETRY_SQRT_CHECK_FINITENESS -DDISABLE_MYSQL_THREAD_H -DHAVE_CONFIG_H -DHAVE_LIBEVENT2 -D_FILE_OFFSET_BITS=64 -D_GNU_SOURCE -I/tmp/B.xnuEsf/BUILD/mysql-5.7.22/build/include -I/tmp/B.xnuEsf/BUILD/mysql-5.7.22/extra/rapidjson/include -I/tmp/B.xnuEsf/BUILD/mysql-5.7.22/build/libbinlogevents/include -I/tmp/B.xnuEsf/BUILD/mysql-5.7.22/libbinlogevents/export -I/tmp/B.xnuEsf/BUILD/mysql-5.7.22/include -fPIC -Wall -Wextra -Wformat-security -Wvla -Wimplicit-fallthrough=2 -Wwrite-strings -Wdeclaration-after-statement -O3 -O2 -fwrapv -pipe -Wformat -Werror=format-security -gdwarf-4 -fno-debug-types-section -fvar-tracking-assignments -g2 -Wp,-D_FORTIFY_SOURCE=2 -fstack-protector-strong --param=ssp-buffer-size=4 -fomit-frame-pointer -march=i686 -fasynchronous-unwind-tables -mtune=pentium4 -gdwarf-4 -fno-debug-types-section -fvar-tracking-assignments -g2 -DNDEBUG -fno-omit-frame-pointer -fno-strict-aliasing -g -fabi-version=2 -fno-omit-frame-pointer -fno-strict-aliasing -ffp-contract=off -DDBUG_OFF -o CMakeFiles/strings.dir/ctype-czech.c.o -c /tmp/B.xnuEsf/BUILD/mysql-5.7.22/strings/ctype-czech.c make[2]: Leaving directory '/tmp/B.xnuEsf/BUILD/mysql-5.7.22/build' make[2]: Entering directory '/tmp/B.xnuEsf/BUILD/mysql-5.7.22/build' [ 2%] Building C object strings/CMakeFiles/strings.dir/ctype-cp932.c.o cd /tmp/B.xnuEsf/BUILD/mysql-5.7.22/build/strings && /usr/bin/i686-pld-linux-gcc -DBOOST_GEOMETRY_SQRT_CHECK_FINITENESS -DDISABLE_MYSQL_THREAD_H -DHAVE_CONFIG_H -DHAVE_LIBEVENT2 -D_FILE_OFFSET_BITS=64 -D_GNU_SOURCE -I/tmp/B.xnuEsf/BUILD/mysql-5.7.22/build/include -I/tmp/B.xnuEsf/BUILD/mysql-5.7.22/extra/rapidjson/include -I/tmp/B.xnuEsf/BUILD/mysql-5.7.22/build/libbinlogevents/include -I/tmp/B.xnuEsf/BUILD/mysql-5.7.22/libbinlogevents/export -I/tmp/B.xnuEsf/BUILD/mysql-5.7.22/include -fPIC -Wall -Wextra -Wformat-security -Wvla -Wimplicit-fallthrough=2 -Wwrite-strings -Wdeclaration-after-statement -O3 -O2 -fwrapv -pipe -Wformat -Werror=format-security -gdwarf-4 -fno-debug-types-section -fvar-tracking-assignments -g2 -Wp,-D_FORTIFY_SOURCE=2 -fstack-protector-strong --param=ssp-buffer-size=4 -fomit-frame-pointer -march=i686 -fasynchronous-unwind-tables -mtune=pentium4 -gdwarf-4 -fno-debug-types-section -fvar-tracking-assignments -g2 -DNDEBUG -fno-omit-frame-pointer -fno-strict-aliasing -g -fabi-version=2 -fno-omit-frame-pointer -fno-strict-aliasing -ffp-contract=off -DDBUG_OFF -o CMakeFiles/strings.dir/ctype-cp932.c.o -c /tmp/B.xnuEsf/BUILD/mysql-5.7.22/strings/ctype-cp932.c make[2]: Leaving directory '/tmp/B.xnuEsf/BUILD/mysql-5.7.22/build' make[2]: Entering directory '/tmp/B.xnuEsf/BUILD/mysql-5.7.22/build' [ 2%] Linking CXX shared library ../lib/libbinlogstandalone.so cd /tmp/B.xnuEsf/BUILD/mysql-5.7.22/build/libbinlogstandalone/src && /usr/bin/cmake -E cmake_link_script CMakeFiles/binlogstandalone_shared.dir/link.txt --verbose=1 /usr/bin/i686-pld-linux-g++ -fPIC -fPIC -Wall -Wextra -Wformat-security -Wvla -Wimplicit-fallthrough=2 -Woverloaded-virtual -Wno-unused-parameter -O3 -O2 -fwrapv -pipe -Wformat -Werror=format-security -gdwarf-4 -fno-debug-types-section -fvar-tracking-assignments -g2 -Wp,-D_FORTIFY_SOURCE=2 -fstack-protector-strong --param=ssp-buffer-size=4 -fomit-frame-pointer -march=i686 -fasynchronous-unwind-tables -mtune=pentium4 -gdwarf-4 -fno-debug-types-section -fvar-tracking-assignments -g2 -DNDEBUG -fno-omit-frame-pointer -fno-strict-aliasing -g -fabi-version=2 -fno-omit-frame-pointer -fno-strict-aliasing -std=gnu++03 -ffp-contract=off -DDBUG_OFF -fPIC -shared -Wl,-soname,libbinlogstandalone.so -o ../lib/libbinlogstandalone.so CMakeFiles/binlogstandalone_shared.dir/__/__/libbinlogevents/src/load_data_events.cpp.o CMakeFiles/binlogstandalone_shared.dir/__/__/libbinlogevents/src/rows_event.cpp.o CMakeFiles/binlogstandalone_shared.dir/__/__/libbinlogevents/src/binlog_event.cpp.o CMakeFiles/binlogstandalone_shared.dir/__/__/libbinlogevents/src/control_events.cpp.o CMakeFiles/binlogstandalone_shared.dir/__/__/libbinlogevents/src/statement_events.cpp.o CMakeFiles/binlogstandalone_shared.dir/__/__/libbinlogevents/src/uuid.cpp.o -lpthread -lz make[2]: Leaving directory '/tmp/B.xnuEsf/BUILD/mysql-5.7.22/build' make[1]: Entering directory '/tmp/B.xnuEsf/BUILD/mysql-5.7.22/build' [ 2%] Built target binlogstandalone_shared make[1]: Leaving directory '/tmp/B.xnuEsf/BUILD/mysql-5.7.22/build' make[2]: Entering directory '/tmp/B.xnuEsf/BUILD/mysql-5.7.22/build' [ 2%] Building C object strings/CMakeFiles/strings.dir/ctype-euc_kr.c.o cd /tmp/B.xnuEsf/BUILD/mysql-5.7.22/build/strings && /usr/bin/i686-pld-linux-gcc -DBOOST_GEOMETRY_SQRT_CHECK_FINITENESS -DDISABLE_MYSQL_THREAD_H -DHAVE_CONFIG_H -DHAVE_LIBEVENT2 -D_FILE_OFFSET_BITS=64 -D_GNU_SOURCE -I/tmp/B.xnuEsf/BUILD/mysql-5.7.22/build/include -I/tmp/B.xnuEsf/BUILD/mysql-5.7.22/extra/rapidjson/include -I/tmp/B.xnuEsf/BUILD/mysql-5.7.22/build/libbinlogevents/include -I/tmp/B.xnuEsf/BUILD/mysql-5.7.22/libbinlogevents/export -I/tmp/B.xnuEsf/BUILD/mysql-5.7.22/include -fPIC -Wall -Wextra -Wformat-security -Wvla -Wimplicit-fallthrough=2 -Wwrite-strings -Wdeclaration-after-statement -O3 -O2 -fwrapv -pipe -Wformat -Werror=format-security -gdwarf-4 -fno-debug-types-section -fvar-tracking-assignments -g2 -Wp,-D_FORTIFY_SOURCE=2 -fstack-protector-strong --param=ssp-buffer-size=4 -fomit-frame-pointer -march=i686 -fasynchronous-unwind-tables -mtune=pentium4 -gdwarf-4 -fno-debug-types-section -fvar-tracking-assignments -g2 -DNDEBUG -fno-omit-frame-pointer -fno-strict-aliasing -g -fabi-version=2 -fno-omit-frame-pointer -fno-strict-aliasing -ffp-contract=off -DDBUG_OFF -o CMakeFiles/strings.dir/ctype-euc_kr.c.o -c /tmp/B.xnuEsf/BUILD/mysql-5.7.22/strings/ctype-euc_kr.c make[2]: Leaving directory '/tmp/B.xnuEsf/BUILD/mysql-5.7.22/build' make[2]: Entering directory '/tmp/B.xnuEsf/BUILD/mysql-5.7.22/build' [ 2%] Building C object strings/CMakeFiles/strings.dir/ctype-extra.c.o cd /tmp/B.xnuEsf/BUILD/mysql-5.7.22/build/strings && /usr/bin/i686-pld-linux-gcc -DBOOST_GEOMETRY_SQRT_CHECK_FINITENESS -DDISABLE_MYSQL_THREAD_H -DHAVE_CONFIG_H -DHAVE_LIBEVENT2 -D_FILE_OFFSET_BITS=64 -D_GNU_SOURCE -I/tmp/B.xnuEsf/BUILD/mysql-5.7.22/build/include -I/tmp/B.xnuEsf/BUILD/mysql-5.7.22/extra/rapidjson/include -I/tmp/B.xnuEsf/BUILD/mysql-5.7.22/build/libbinlogevents/include -I/tmp/B.xnuEsf/BUILD/mysql-5.7.22/libbinlogevents/export -I/tmp/B.xnuEsf/BUILD/mysql-5.7.22/include -fPIC -Wall -Wextra -Wformat-security -Wvla -Wimplicit-fallthrough=2 -Wwrite-strings -Wdeclaration-after-statement -O3 -O2 -fwrapv -pipe -Wformat -Werror=format-security -gdwarf-4 -fno-debug-types-section -fvar-tracking-assignments -g2 -Wp,-D_FORTIFY_SOURCE=2 -fstack-protector-strong --param=ssp-buffer-size=4 -fomit-frame-pointer -march=i686 -fasynchronous-unwind-tables -mtune=pentium4 -gdwarf-4 -fno-debug-types-section -fvar-tracking-assignments -g2 -DNDEBUG -fno-omit-frame-pointer -fno-strict-aliasing -g -fabi-version=2 -fno-omit-frame-pointer -fno-strict-aliasing -ffp-contract=off -DDBUG_OFF -o CMakeFiles/strings.dir/ctype-extra.c.o -c /tmp/B.xnuEsf/BUILD/mysql-5.7.22/strings/ctype-extra.c make[2]: Leaving directory '/tmp/B.xnuEsf/BUILD/mysql-5.7.22/build' make[2]: Entering directory '/tmp/B.xnuEsf/BUILD/mysql-5.7.22/build' [ 2%] Building CXX object rapid/plugin/group_replication/CMakeFiles/gr_unit_test_resource.dir/libmysqlgcs/src/interface/xplatform/my_xp_util.cc.o cd /tmp/B.xnuEsf/BUILD/mysql-5.7.22/build/rapid/plugin/group_replication && /usr/bin/i686-pld-linux-g++ -DBOOST_GEOMETRY_SQRT_CHECK_FINITENESS -DDISABLE_ALL_PSI -DHAVE_CONFIG_H -DHAVE_LIBEVENT2 -DHAVE_OPENSSL -DHAVE_TIRPC -DXCOM_HAVE_OPENSSL -D_FILE_OFFSET_BITS=64 -D_GNU_SOURCE -I/tmp/B.xnuEsf/BUILD/mysql-5.7.22/build/include -I/tmp/B.xnuEsf/BUILD/mysql-5.7.22/extra/rapidjson/include -I/tmp/B.xnuEsf/BUILD/mysql-5.7.22/build/libbinlogevents/include -I/tmp/B.xnuEsf/BUILD/mysql-5.7.22/libbinlogevents/export -I/tmp/B.xnuEsf/BUILD/mysql-5.7.22/build/rapid/plugin/group_replication/xdr_gen -isystem /usr/include/tirpc -I/tmp/B.xnuEsf/BUILD/mysql-5.7.22/libbinlogevents/include -I/tmp/B.xnuEsf/BUILD/mysql-5.7.22/rapid/plugin/group_replication/include -I/tmp/B.xnuEsf/BUILD/mysql-5.7.22/rapid/plugin/group_replication/include/sql_service -I/tmp/B.xnuEsf/BUILD/mysql-5.7.22/rapid/plugin/group_replication/libmysqlgcs/include -I/tmp/B.xnuEsf/BUILD/mysql-5.7.22/rapid/plugin/group_replication/libmysqlgcs/include/mysql -I/tmp/B.xnuEsf/BUILD/mysql-5.7.22/rapid/plugin/group_replication/libmysqlgcs/include/mysql/gcs -I/tmp/B.xnuEsf/BUILD/mysql-5.7.22/rapid/plugin/group_replication/libmysqlgcs/src/bindings/xcom/xcom -I/tmp/B.xnuEsf/BUILD/mysql-5.7.22/build/rapid/plugin/group_replication/include -I/tmp/B.xnuEsf/BUILD/mysql-5.7.22/include -I/tmp/B.xnuEsf/BUILD/mysql-5.7.22/sql -I/tmp/B.xnuEsf/BUILD/mysql-5.7.22/sql/auth -I/tmp/B.xnuEsf/BUILD/mysql-5.7.22/regex -fPIC -Wall -Wextra -Wformat-security -Wvla -Wimplicit-fallthrough=2 -Woverloaded-virtual -Wno-unused-parameter -O3 -O2 -fwrapv -pipe -Wformat -Werror=format-security -gdwarf-4 -fno-debug-types-section -fvar-tracking-assignments -g2 -Wp,-D_FORTIFY_SOURCE=2 -fstack-protector-strong --param=ssp-buffer-size=4 -fomit-frame-pointer -march=i686 -fasynchronous-unwind-tables -mtune=pentium4 -gdwarf-4 -fno-debug-types-section -fvar-tracking-assignments -g2 -DNDEBUG -fno-omit-frame-pointer -fno-strict-aliasing -g -fabi-version=2 -fno-omit-frame-pointer -fno-strict-aliasing -std=gnu++03 -ffp-contract=off -DDBUG_OFF -o CMakeFiles/gr_unit_test_resource.dir/libmysqlgcs/src/interface/xplatform/my_xp_util.cc.o -c /tmp/B.xnuEsf/BUILD/mysql-5.7.22/rapid/plugin/group_replication/libmysqlgcs/src/interface/xplatform/my_xp_util.cc make[2]: Leaving directory '/tmp/B.xnuEsf/BUILD/mysql-5.7.22/build' make[2]: Entering directory '/tmp/B.xnuEsf/BUILD/mysql-5.7.22/build' [ 2%] Building CXX object rapid/plugin/group_replication/CMakeFiles/gr_unit_test_resource.dir/libmysqlgcs/src/interface/gcs_view.cc.o cd /tmp/B.xnuEsf/BUILD/mysql-5.7.22/build/rapid/plugin/group_replication && /usr/bin/i686-pld-linux-g++ -DBOOST_GEOMETRY_SQRT_CHECK_FINITENESS -DDISABLE_ALL_PSI -DHAVE_CONFIG_H -DHAVE_LIBEVENT2 -DHAVE_OPENSSL -DHAVE_TIRPC -DXCOM_HAVE_OPENSSL -D_FILE_OFFSET_BITS=64 -D_GNU_SOURCE -I/tmp/B.xnuEsf/BUILD/mysql-5.7.22/build/include -I/tmp/B.xnuEsf/BUILD/mysql-5.7.22/extra/rapidjson/include -I/tmp/B.xnuEsf/BUILD/mysql-5.7.22/build/libbinlogevents/include -I/tmp/B.xnuEsf/BUILD/mysql-5.7.22/libbinlogevents/export -I/tmp/B.xnuEsf/BUILD/mysql-5.7.22/build/rapid/plugin/group_replication/xdr_gen -isystem /usr/include/tirpc -I/tmp/B.xnuEsf/BUILD/mysql-5.7.22/libbinlogevents/include -I/tmp/B.xnuEsf/BUILD/mysql-5.7.22/rapid/plugin/group_replication/include -I/tmp/B.xnuEsf/BUILD/mysql-5.7.22/rapid/plugin/group_replication/include/sql_service -I/tmp/B.xnuEsf/BUILD/mysql-5.7.22/rapid/plugin/group_replication/libmysqlgcs/include -I/tmp/B.xnuEsf/BUILD/mysql-5.7.22/rapid/plugin/group_replication/libmysqlgcs/include/mysql -I/tmp/B.xnuEsf/BUILD/mysql-5.7.22/rapid/plugin/group_replication/libmysqlgcs/include/mysql/gcs -I/tmp/B.xnuEsf/BUILD/mysql-5.7.22/rapid/plugin/group_replication/libmysqlgcs/src/bindings/xcom/xcom -I/tmp/B.xnuEsf/BUILD/mysql-5.7.22/build/rapid/plugin/group_replication/include -I/tmp/B.xnuEsf/BUILD/mysql-5.7.22/include -I/tmp/B.xnuEsf/BUILD/mysql-5.7.22/sql -I/tmp/B.xnuEsf/BUILD/mysql-5.7.22/sql/auth -I/tmp/B.xnuEsf/BUILD/mysql-5.7.22/regex -fPIC -Wall -Wextra -Wformat-security -Wvla -Wimplicit-fallthrough=2 -Woverloaded-virtual -Wno-unused-parameter -O3 -O2 -fwrapv -pipe -Wformat -Werror=format-security -gdwarf-4 -fno-debug-types-section -fvar-tracking-assignments -g2 -Wp,-D_FORTIFY_SOURCE=2 -fstack-protector-strong --param=ssp-buffer-size=4 -fomit-frame-pointer -march=i686 -fasynchronous-unwind-tables -mtune=pentium4 -gdwarf-4 -fno-debug-types-section -fvar-tracking-assignments -g2 -DNDEBUG -fno-omit-frame-pointer -fno-strict-aliasing -g -fabi-version=2 -fno-omit-frame-pointer -fno-strict-aliasing -std=gnu++03 -ffp-contract=off -DDBUG_OFF -o CMakeFiles/gr_unit_test_resource.dir/libmysqlgcs/src/interface/gcs_view.cc.o -c /tmp/B.xnuEsf/BUILD/mysql-5.7.22/rapid/plugin/group_replication/libmysqlgcs/src/interface/gcs_view.cc make[2]: Leaving directory '/tmp/B.xnuEsf/BUILD/mysql-5.7.22/build' make[2]: Entering directory '/tmp/B.xnuEsf/BUILD/mysql-5.7.22/build' [ 2%] Building CXX object rapid/plugin/group_replication/CMakeFiles/gr_unit_test_resource.dir/libmysqlgcs/src/interface/gcs_types.cc.o cd /tmp/B.xnuEsf/BUILD/mysql-5.7.22/build/rapid/plugin/group_replication && /usr/bin/i686-pld-linux-g++ -DBOOST_GEOMETRY_SQRT_CHECK_FINITENESS -DDISABLE_ALL_PSI -DHAVE_CONFIG_H -DHAVE_LIBEVENT2 -DHAVE_OPENSSL -DHAVE_TIRPC -DXCOM_HAVE_OPENSSL -D_FILE_OFFSET_BITS=64 -D_GNU_SOURCE -I/tmp/B.xnuEsf/BUILD/mysql-5.7.22/build/include -I/tmp/B.xnuEsf/BUILD/mysql-5.7.22/extra/rapidjson/include -I/tmp/B.xnuEsf/BUILD/mysql-5.7.22/build/libbinlogevents/include -I/tmp/B.xnuEsf/BUILD/mysql-5.7.22/libbinlogevents/export -I/tmp/B.xnuEsf/BUILD/mysql-5.7.22/build/rapid/plugin/group_replication/xdr_gen -isystem /usr/include/tirpc -I/tmp/B.xnuEsf/BUILD/mysql-5.7.22/libbinlogevents/include -I/tmp/B.xnuEsf/BUILD/mysql-5.7.22/rapid/plugin/group_replication/include -I/tmp/B.xnuEsf/BUILD/mysql-5.7.22/rapid/plugin/group_replication/include/sql_service -I/tmp/B.xnuEsf/BUILD/mysql-5.7.22/rapid/plugin/group_replication/libmysqlgcs/include -I/tmp/B.xnuEsf/BUILD/mysql-5.7.22/rapid/plugin/group_replication/libmysqlgcs/include/mysql -I/tmp/B.xnuEsf/BUILD/mysql-5.7.22/rapid/plugin/group_replication/libmysqlgcs/include/mysql/gcs -I/tmp/B.xnuEsf/BUILD/mysql-5.7.22/rapid/plugin/group_replication/libmysqlgcs/src/bindings/xcom/xcom -I/tmp/B.xnuEsf/BUILD/mysql-5.7.22/build/rapid/plugin/group_replication/include -I/tmp/B.xnuEsf/BUILD/mysql-5.7.22/include -I/tmp/B.xnuEsf/BUILD/mysql-5.7.22/sql -I/tmp/B.xnuEsf/BUILD/mysql-5.7.22/sql/auth -I/tmp/B.xnuEsf/BUILD/mysql-5.7.22/regex -fPIC -Wall -Wextra -Wformat-security -Wvla -Wimplicit-fallthrough=2 -Woverloaded-virtual -Wno-unused-parameter -O3 -O2 -fwrapv -pipe -Wformat -Werror=format-security -gdwarf-4 -fno-debug-types-section -fvar-tracking-assignments -g2 -Wp,-D_FORTIFY_SOURCE=2 -fstack-protector-strong --param=ssp-buffer-size=4 -fomit-frame-pointer -march=i686 -fasynchronous-unwind-tables -mtune=pentium4 -gdwarf-4 -fno-debug-types-section -fvar-tracking-assignments -g2 -DNDEBUG -fno-omit-frame-pointer -fno-strict-aliasing -g -fabi-version=2 -fno-omit-frame-pointer -fno-strict-aliasing -std=gnu++03 -ffp-contract=off -DDBUG_OFF -o CMakeFiles/gr_unit_test_resource.dir/libmysqlgcs/src/interface/gcs_types.cc.o -c /tmp/B.xnuEsf/BUILD/mysql-5.7.22/rapid/plugin/group_replication/libmysqlgcs/src/interface/gcs_types.cc make[2]: Leaving directory '/tmp/B.xnuEsf/BUILD/mysql-5.7.22/build' make[2]: Entering directory '/tmp/B.xnuEsf/BUILD/mysql-5.7.22/build' [ 2%] Building C object strings/CMakeFiles/strings.dir/ctype-gb2312.c.o cd /tmp/B.xnuEsf/BUILD/mysql-5.7.22/build/strings && /usr/bin/i686-pld-linux-gcc -DBOOST_GEOMETRY_SQRT_CHECK_FINITENESS -DDISABLE_MYSQL_THREAD_H -DHAVE_CONFIG_H -DHAVE_LIBEVENT2 -D_FILE_OFFSET_BITS=64 -D_GNU_SOURCE -I/tmp/B.xnuEsf/BUILD/mysql-5.7.22/build/include -I/tmp/B.xnuEsf/BUILD/mysql-5.7.22/extra/rapidjson/include -I/tmp/B.xnuEsf/BUILD/mysql-5.7.22/build/libbinlogevents/include -I/tmp/B.xnuEsf/BUILD/mysql-5.7.22/libbinlogevents/export -I/tmp/B.xnuEsf/BUILD/mysql-5.7.22/include -fPIC -Wall -Wextra -Wformat-security -Wvla -Wimplicit-fallthrough=2 -Wwrite-strings -Wdeclaration-after-statement -O3 -O2 -fwrapv -pipe -Wformat -Werror=format-security -gdwarf-4 -fno-debug-types-section -fvar-tracking-assignments -g2 -Wp,-D_FORTIFY_SOURCE=2 -fstack-protector-strong --param=ssp-buffer-size=4 -fomit-frame-pointer -march=i686 -fasynchronous-unwind-tables -mtune=pentium4 -gdwarf-4 -fno-debug-types-section -fvar-tracking-assignments -g2 -DNDEBUG -fno-omit-frame-pointer -fno-strict-aliasing -g -fabi-version=2 -fno-omit-frame-pointer -fno-strict-aliasing -ffp-contract=off -DDBUG_OFF -o CMakeFiles/strings.dir/ctype-gb2312.c.o -c /tmp/B.xnuEsf/BUILD/mysql-5.7.22/strings/ctype-gb2312.c make[2]: Leaving directory '/tmp/B.xnuEsf/BUILD/mysql-5.7.22/build' make[2]: Entering directory '/tmp/B.xnuEsf/BUILD/mysql-5.7.22/build' [ 2%] Building CXX object rapid/plugin/group_replication/CMakeFiles/gr_unit_test_resource.dir/libmysqlgcs/src/interface/gcs_group_identifier.cc.o cd /tmp/B.xnuEsf/BUILD/mysql-5.7.22/build/rapid/plugin/group_replication && /usr/bin/i686-pld-linux-g++ -DBOOST_GEOMETRY_SQRT_CHECK_FINITENESS -DDISABLE_ALL_PSI -DHAVE_CONFIG_H -DHAVE_LIBEVENT2 -DHAVE_OPENSSL -DHAVE_TIRPC -DXCOM_HAVE_OPENSSL -D_FILE_OFFSET_BITS=64 -D_GNU_SOURCE -I/tmp/B.xnuEsf/BUILD/mysql-5.7.22/build/include -I/tmp/B.xnuEsf/BUILD/mysql-5.7.22/extra/rapidjson/include -I/tmp/B.xnuEsf/BUILD/mysql-5.7.22/build/libbinlogevents/include -I/tmp/B.xnuEsf/BUILD/mysql-5.7.22/libbinlogevents/export -I/tmp/B.xnuEsf/BUILD/mysql-5.7.22/build/rapid/plugin/group_replication/xdr_gen -isystem /usr/include/tirpc -I/tmp/B.xnuEsf/BUILD/mysql-5.7.22/libbinlogevents/include -I/tmp/B.xnuEsf/BUILD/mysql-5.7.22/rapid/plugin/group_replication/include -I/tmp/B.xnuEsf/BUILD/mysql-5.7.22/rapid/plugin/group_replication/include/sql_service -I/tmp/B.xnuEsf/BUILD/mysql-5.7.22/rapid/plugin/group_replication/libmysqlgcs/include -I/tmp/B.xnuEsf/BUILD/mysql-5.7.22/rapid/plugin/group_replication/libmysqlgcs/include/mysql -I/tmp/B.xnuEsf/BUILD/mysql-5.7.22/rapid/plugin/group_replication/libmysqlgcs/include/mysql/gcs -I/tmp/B.xnuEsf/BUILD/mysql-5.7.22/rapid/plugin/group_replication/libmysqlgcs/src/bindings/xcom/xcom -I/tmp/B.xnuEsf/BUILD/mysql-5.7.22/build/rapid/plugin/group_replication/include -I/tmp/B.xnuEsf/BUILD/mysql-5.7.22/include -I/tmp/B.xnuEsf/BUILD/mysql-5.7.22/sql -I/tmp/B.xnuEsf/BUILD/mysql-5.7.22/sql/auth -I/tmp/B.xnuEsf/BUILD/mysql-5.7.22/regex -fPIC -Wall -Wextra -Wformat-security -Wvla -Wimplicit-fallthrough=2 -Woverloaded-virtual -Wno-unused-parameter -O3 -O2 -fwrapv -pipe -Wformat -Werror=format-security -gdwarf-4 -fno-debug-types-section -fvar-tracking-assignments -g2 -Wp,-D_FORTIFY_SOURCE=2 -fstack-protector-strong --param=ssp-buffer-size=4 -fomit-frame-pointer -march=i686 -fasynchronous-unwind-tables -mtune=pentium4 -gdwarf-4 -fno-debug-types-section -fvar-tracking-assignments -g2 -DNDEBUG -fno-omit-frame-pointer -fno-strict-aliasing -g -fabi-version=2 -fno-omit-frame-pointer -fno-strict-aliasing -std=gnu++03 -ffp-contract=off -DDBUG_OFF -o CMakeFiles/gr_unit_test_resource.dir/libmysqlgcs/src/interface/gcs_group_identifier.cc.o -c /tmp/B.xnuEsf/BUILD/mysql-5.7.22/rapid/plugin/group_replication/libmysqlgcs/src/interface/gcs_group_identifier.cc make[2]: Leaving directory '/tmp/B.xnuEsf/BUILD/mysql-5.7.22/build' make[2]: Entering directory '/tmp/B.xnuEsf/BUILD/mysql-5.7.22/build' [ 2%] Building CXX object rapid/plugin/group_replication/CMakeFiles/gr_unit_test_resource.dir/libmysqlgcs/src/interface/gcs_member_identifier.cc.o cd /tmp/B.xnuEsf/BUILD/mysql-5.7.22/build/rapid/plugin/group_replication && /usr/bin/i686-pld-linux-g++ -DBOOST_GEOMETRY_SQRT_CHECK_FINITENESS -DDISABLE_ALL_PSI -DHAVE_CONFIG_H -DHAVE_LIBEVENT2 -DHAVE_OPENSSL -DHAVE_TIRPC -DXCOM_HAVE_OPENSSL -D_FILE_OFFSET_BITS=64 -D_GNU_SOURCE -I/tmp/B.xnuEsf/BUILD/mysql-5.7.22/build/include -I/tmp/B.xnuEsf/BUILD/mysql-5.7.22/extra/rapidjson/include -I/tmp/B.xnuEsf/BUILD/mysql-5.7.22/build/libbinlogevents/include -I/tmp/B.xnuEsf/BUILD/mysql-5.7.22/libbinlogevents/export -I/tmp/B.xnuEsf/BUILD/mysql-5.7.22/build/rapid/plugin/group_replication/xdr_gen -isystem /usr/include/tirpc -I/tmp/B.xnuEsf/BUILD/mysql-5.7.22/libbinlogevents/include -I/tmp/B.xnuEsf/BUILD/mysql-5.7.22/rapid/plugin/group_replication/include -I/tmp/B.xnuEsf/BUILD/mysql-5.7.22/rapid/plugin/group_replication/include/sql_service -I/tmp/B.xnuEsf/BUILD/mysql-5.7.22/rapid/plugin/group_replication/libmysqlgcs/include -I/tmp/B.xnuEsf/BUILD/mysql-5.7.22/rapid/plugin/group_replication/libmysqlgcs/include/mysql -I/tmp/B.xnuEsf/BUILD/mysql-5.7.22/rapid/plugin/group_replication/libmysqlgcs/include/mysql/gcs -I/tmp/B.xnuEsf/BUILD/mysql-5.7.22/rapid/plugin/group_replication/libmysqlgcs/src/bindings/xcom/xcom -I/tmp/B.xnuEsf/BUILD/mysql-5.7.22/build/rapid/plugin/group_replication/include -I/tmp/B.xnuEsf/BUILD/mysql-5.7.22/include -I/tmp/B.xnuEsf/BUILD/mysql-5.7.22/sql -I/tmp/B.xnuEsf/BUILD/mysql-5.7.22/sql/auth -I/tmp/B.xnuEsf/BUILD/mysql-5.7.22/regex -fPIC -Wall -Wextra -Wformat-security -Wvla -Wimplicit-fallthrough=2 -Woverloaded-virtual -Wno-unused-parameter -O3 -O2 -fwrapv -pipe -Wformat -Werror=format-security -gdwarf-4 -fno-debug-types-section -fvar-tracking-assignments -g2 -Wp,-D_FORTIFY_SOURCE=2 -fstack-protector-strong --param=ssp-buffer-size=4 -fomit-frame-pointer -march=i686 -fasynchronous-unwind-tables -mtune=pentium4 -gdwarf-4 -fno-debug-types-section -fvar-tracking-assignments -g2 -DNDEBUG -fno-omit-frame-pointer -fno-strict-aliasing -g -fabi-version=2 -fno-omit-frame-pointer -fno-strict-aliasing -std=gnu++03 -ffp-contract=off -DDBUG_OFF -o CMakeFiles/gr_unit_test_resource.dir/libmysqlgcs/src/interface/gcs_member_identifier.cc.o -c /tmp/B.xnuEsf/BUILD/mysql-5.7.22/rapid/plugin/group_replication/libmysqlgcs/src/interface/gcs_member_identifier.cc make[2]: Leaving directory '/tmp/B.xnuEsf/BUILD/mysql-5.7.22/build' make[2]: Entering directory '/tmp/B.xnuEsf/BUILD/mysql-5.7.22/build' [ 2%] Building C object strings/CMakeFiles/strings.dir/ctype-latin1.c.o cd /tmp/B.xnuEsf/BUILD/mysql-5.7.22/build/strings && /usr/bin/i686-pld-linux-gcc -DBOOST_GEOMETRY_SQRT_CHECK_FINITENESS -DDISABLE_MYSQL_THREAD_H -DHAVE_CONFIG_H -DHAVE_LIBEVENT2 -D_FILE_OFFSET_BITS=64 -D_GNU_SOURCE -I/tmp/B.xnuEsf/BUILD/mysql-5.7.22/build/include -I/tmp/B.xnuEsf/BUILD/mysql-5.7.22/extra/rapidjson/include -I/tmp/B.xnuEsf/BUILD/mysql-5.7.22/build/libbinlogevents/include -I/tmp/B.xnuEsf/BUILD/mysql-5.7.22/libbinlogevents/export -I/tmp/B.xnuEsf/BUILD/mysql-5.7.22/include -fPIC -Wall -Wextra -Wformat-security -Wvla -Wimplicit-fallthrough=2 -Wwrite-strings -Wdeclaration-after-statement -O3 -O2 -fwrapv -pipe -Wformat -Werror=format-security -gdwarf-4 -fno-debug-types-section -fvar-tracking-assignments -g2 -Wp,-D_FORTIFY_SOURCE=2 -fstack-protector-strong --param=ssp-buffer-size=4 -fomit-frame-pointer -march=i686 -fasynchronous-unwind-tables -mtune=pentium4 -gdwarf-4 -fno-debug-types-section -fvar-tracking-assignments -g2 -DNDEBUG -fno-omit-frame-pointer -fno-strict-aliasing -g -fabi-version=2 -fno-omit-frame-pointer -fno-strict-aliasing -ffp-contract=off -DDBUG_OFF -o CMakeFiles/strings.dir/ctype-latin1.c.o -c /tmp/B.xnuEsf/BUILD/mysql-5.7.22/strings/ctype-latin1.c make[2]: Leaving directory '/tmp/B.xnuEsf/BUILD/mysql-5.7.22/build' make[2]: Entering directory '/tmp/B.xnuEsf/BUILD/mysql-5.7.22/build' [ 2%] Building C object strings/CMakeFiles/strings.dir/ctype-gbk.c.o cd /tmp/B.xnuEsf/BUILD/mysql-5.7.22/build/strings && /usr/bin/i686-pld-linux-gcc -DBOOST_GEOMETRY_SQRT_CHECK_FINITENESS -DDISABLE_MYSQL_THREAD_H -DHAVE_CONFIG_H -DHAVE_LIBEVENT2 -D_FILE_OFFSET_BITS=64 -D_GNU_SOURCE -I/tmp/B.xnuEsf/BUILD/mysql-5.7.22/build/include -I/tmp/B.xnuEsf/BUILD/mysql-5.7.22/extra/rapidjson/include -I/tmp/B.xnuEsf/BUILD/mysql-5.7.22/build/libbinlogevents/include -I/tmp/B.xnuEsf/BUILD/mysql-5.7.22/libbinlogevents/export -I/tmp/B.xnuEsf/BUILD/mysql-5.7.22/include -fPIC -Wall -Wextra -Wformat-security -Wvla -Wimplicit-fallthrough=2 -Wwrite-strings -Wdeclaration-after-statement -O3 -O2 -fwrapv -pipe -Wformat -Werror=format-security -gdwarf-4 -fno-debug-types-section -fvar-tracking-assignments -g2 -Wp,-D_FORTIFY_SOURCE=2 -fstack-protector-strong --param=ssp-buffer-size=4 -fomit-frame-pointer -march=i686 -fasynchronous-unwind-tables -mtune=pentium4 -gdwarf-4 -fno-debug-types-section -fvar-tracking-assignments -g2 -DNDEBUG -fno-omit-frame-pointer -fno-strict-aliasing -g -fabi-version=2 -fno-omit-frame-pointer -fno-strict-aliasing -ffp-contract=off -DDBUG_OFF -o CMakeFiles/strings.dir/ctype-gbk.c.o -c /tmp/B.xnuEsf/BUILD/mysql-5.7.22/strings/ctype-gbk.c make[2]: Leaving directory '/tmp/B.xnuEsf/BUILD/mysql-5.7.22/build' make[2]: Entering directory '/tmp/B.xnuEsf/BUILD/mysql-5.7.22/build' [ 3%] Building C object strings/CMakeFiles/strings.dir/ctype-tis620.c.o cd /tmp/B.xnuEsf/BUILD/mysql-5.7.22/build/strings && /usr/bin/i686-pld-linux-gcc -DBOOST_GEOMETRY_SQRT_CHECK_FINITENESS -DDISABLE_MYSQL_THREAD_H -DHAVE_CONFIG_H -DHAVE_LIBEVENT2 -D_FILE_OFFSET_BITS=64 -D_GNU_SOURCE -I/tmp/B.xnuEsf/BUILD/mysql-5.7.22/build/include -I/tmp/B.xnuEsf/BUILD/mysql-5.7.22/extra/rapidjson/include -I/tmp/B.xnuEsf/BUILD/mysql-5.7.22/build/libbinlogevents/include -I/tmp/B.xnuEsf/BUILD/mysql-5.7.22/libbinlogevents/export -I/tmp/B.xnuEsf/BUILD/mysql-5.7.22/include -fPIC -Wall -Wextra -Wformat-security -Wvla -Wimplicit-fallthrough=2 -Wwrite-strings -Wdeclaration-after-statement -O3 -O2 -fwrapv -pipe -Wformat -Werror=format-security -gdwarf-4 -fno-debug-types-section -fvar-tracking-assignments -g2 -Wp,-D_FORTIFY_SOURCE=2 -fstack-protector-strong --param=ssp-buffer-size=4 -fomit-frame-pointer -march=i686 -fasynchronous-unwind-tables -mtune=pentium4 -gdwarf-4 -fno-debug-types-section -fvar-tracking-assignments -g2 -DNDEBUG -fno-omit-frame-pointer -fno-strict-aliasing -g -fabi-version=2 -fno-omit-frame-pointer -fno-strict-aliasing -ffp-contract=off -DDBUG_OFF -o CMakeFiles/strings.dir/ctype-tis620.c.o -c /tmp/B.xnuEsf/BUILD/mysql-5.7.22/strings/ctype-tis620.c make[2]: Leaving directory '/tmp/B.xnuEsf/BUILD/mysql-5.7.22/build' make[2]: Entering directory '/tmp/B.xnuEsf/BUILD/mysql-5.7.22/build' [ 2%] Building CXX object rapid/plugin/group_replication/CMakeFiles/gr_unit_test_resource.dir/libmysqlgcs/src/interface/gcs_message.cc.o cd /tmp/B.xnuEsf/BUILD/mysql-5.7.22/build/rapid/plugin/group_replication && /usr/bin/i686-pld-linux-g++ -DBOOST_GEOMETRY_SQRT_CHECK_FINITENESS -DDISABLE_ALL_PSI -DHAVE_CONFIG_H -DHAVE_LIBEVENT2 -DHAVE_OPENSSL -DHAVE_TIRPC -DXCOM_HAVE_OPENSSL -D_FILE_OFFSET_BITS=64 -D_GNU_SOURCE -I/tmp/B.xnuEsf/BUILD/mysql-5.7.22/build/include -I/tmp/B.xnuEsf/BUILD/mysql-5.7.22/extra/rapidjson/include -I/tmp/B.xnuEsf/BUILD/mysql-5.7.22/build/libbinlogevents/include -I/tmp/B.xnuEsf/BUILD/mysql-5.7.22/libbinlogevents/export -I/tmp/B.xnuEsf/BUILD/mysql-5.7.22/build/rapid/plugin/group_replication/xdr_gen -isystem /usr/include/tirpc -I/tmp/B.xnuEsf/BUILD/mysql-5.7.22/libbinlogevents/include -I/tmp/B.xnuEsf/BUILD/mysql-5.7.22/rapid/plugin/group_replication/include -I/tmp/B.xnuEsf/BUILD/mysql-5.7.22/rapid/plugin/group_replication/include/sql_service -I/tmp/B.xnuEsf/BUILD/mysql-5.7.22/rapid/plugin/group_replication/libmysqlgcs/include -I/tmp/B.xnuEsf/BUILD/mysql-5.7.22/rapid/plugin/group_replication/libmysqlgcs/include/mysql -I/tmp/B.xnuEsf/BUILD/mysql-5.7.22/rapid/plugin/group_replication/libmysqlgcs/include/mysql/gcs -I/tmp/B.xnuEsf/BUILD/mysql-5.7.22/rapid/plugin/group_replication/libmysqlgcs/src/bindings/xcom/xcom -I/tmp/B.xnuEsf/BUILD/mysql-5.7.22/build/rapid/plugin/group_replication/include -I/tmp/B.xnuEsf/BUILD/mysql-5.7.22/include -I/tmp/B.xnuEsf/BUILD/mysql-5.7.22/sql -I/tmp/B.xnuEsf/BUILD/mysql-5.7.22/sql/auth -I/tmp/B.xnuEsf/BUILD/mysql-5.7.22/regex -fPIC -Wall -Wextra -Wformat-security -Wvla -Wimplicit-fallthrough=2 -Woverloaded-virtual -Wno-unused-parameter -O3 -O2 -fwrapv -pipe -Wformat -Werror=format-security -gdwarf-4 -fno-debug-types-section -fvar-tracking-assignments -g2 -Wp,-D_FORTIFY_SOURCE=2 -fstack-protector-strong --param=ssp-buffer-size=4 -fomit-frame-pointer -march=i686 -fasynchronous-unwind-tables -mtune=pentium4 -gdwarf-4 -fno-debug-types-section -fvar-tracking-assignments -g2 -DNDEBUG -fno-omit-frame-pointer -fno-strict-aliasing -g -fabi-version=2 -fno-omit-frame-pointer -fno-strict-aliasing -std=gnu++03 -ffp-contract=off -DDBUG_OFF -o CMakeFiles/gr_unit_test_resource.dir/libmysqlgcs/src/interface/gcs_message.cc.o -c /tmp/B.xnuEsf/BUILD/mysql-5.7.22/rapid/plugin/group_replication/libmysqlgcs/src/interface/gcs_message.cc make[2]: Leaving directory '/tmp/B.xnuEsf/BUILD/mysql-5.7.22/build' make[2]: Entering directory '/tmp/B.xnuEsf/BUILD/mysql-5.7.22/build' [ 2%] Building C object strings/CMakeFiles/strings.dir/ctype-mb.c.o cd /tmp/B.xnuEsf/BUILD/mysql-5.7.22/build/strings && /usr/bin/i686-pld-linux-gcc -DBOOST_GEOMETRY_SQRT_CHECK_FINITENESS -DDISABLE_MYSQL_THREAD_H -DHAVE_CONFIG_H -DHAVE_LIBEVENT2 -D_FILE_OFFSET_BITS=64 -D_GNU_SOURCE -I/tmp/B.xnuEsf/BUILD/mysql-5.7.22/build/include -I/tmp/B.xnuEsf/BUILD/mysql-5.7.22/extra/rapidjson/include -I/tmp/B.xnuEsf/BUILD/mysql-5.7.22/build/libbinlogevents/include -I/tmp/B.xnuEsf/BUILD/mysql-5.7.22/libbinlogevents/export -I/tmp/B.xnuEsf/BUILD/mysql-5.7.22/include -fPIC -Wall -Wextra -Wformat-security -Wvla -Wimplicit-fallthrough=2 -Wwrite-strings -Wdeclaration-after-statement -O3 -O2 -fwrapv -pipe -Wformat -Werror=format-security -gdwarf-4 -fno-debug-types-section -fvar-tracking-assignments -g2 -Wp,-D_FORTIFY_SOURCE=2 -fstack-protector-strong --param=ssp-buffer-size=4 -fomit-frame-pointer -march=i686 -fasynchronous-unwind-tables -mtune=pentium4 -gdwarf-4 -fno-debug-types-section -fvar-tracking-assignments -g2 -DNDEBUG -fno-omit-frame-pointer -fno-strict-aliasing -g -fabi-version=2 -fno-omit-frame-pointer -fno-strict-aliasing -ffp-contract=off -DDBUG_OFF -o CMakeFiles/strings.dir/ctype-mb.c.o -c /tmp/B.xnuEsf/BUILD/mysql-5.7.22/strings/ctype-mb.c make[2]: Leaving directory '/tmp/B.xnuEsf/BUILD/mysql-5.7.22/build' make[2]: Entering directory '/tmp/B.xnuEsf/BUILD/mysql-5.7.22/build' [ 2%] Building C object strings/CMakeFiles/strings.dir/ctype-eucjpms.c.o cd /tmp/B.xnuEsf/BUILD/mysql-5.7.22/build/strings && /usr/bin/i686-pld-linux-gcc -DBOOST_GEOMETRY_SQRT_CHECK_FINITENESS -DDISABLE_MYSQL_THREAD_H -DHAVE_CONFIG_H -DHAVE_LIBEVENT2 -D_FILE_OFFSET_BITS=64 -D_GNU_SOURCE -I/tmp/B.xnuEsf/BUILD/mysql-5.7.22/build/include -I/tmp/B.xnuEsf/BUILD/mysql-5.7.22/extra/rapidjson/include -I/tmp/B.xnuEsf/BUILD/mysql-5.7.22/build/libbinlogevents/include -I/tmp/B.xnuEsf/BUILD/mysql-5.7.22/libbinlogevents/export -I/tmp/B.xnuEsf/BUILD/mysql-5.7.22/include -fPIC -Wall -Wextra -Wformat-security -Wvla -Wimplicit-fallthrough=2 -Wwrite-strings -Wdeclaration-after-statement -O3 -O2 -fwrapv -pipe -Wformat -Werror=format-security -gdwarf-4 -fno-debug-types-section -fvar-tracking-assignments -g2 -Wp,-D_FORTIFY_SOURCE=2 -fstack-protector-strong --param=ssp-buffer-size=4 -fomit-frame-pointer -march=i686 -fasynchronous-unwind-tables -mtune=pentium4 -gdwarf-4 -fno-debug-types-section -fvar-tracking-assignments -g2 -DNDEBUG -fno-omit-frame-pointer -fno-strict-aliasing -g -fabi-version=2 -fno-omit-frame-pointer -fno-strict-aliasing -ffp-contract=off -DDBUG_OFF -o CMakeFiles/strings.dir/ctype-eucjpms.c.o -c /tmp/B.xnuEsf/BUILD/mysql-5.7.22/strings/ctype-eucjpms.c make[2]: Leaving directory '/tmp/B.xnuEsf/BUILD/mysql-5.7.22/build' make[2]: Entering directory '/tmp/B.xnuEsf/BUILD/mysql-5.7.22/build' [ 3%] Linking CXX static library ../../../archive_output_directory/libgr_unit_test_resource.a cd /tmp/B.xnuEsf/BUILD/mysql-5.7.22/build/rapid/plugin/group_replication && /usr/bin/cmake -P CMakeFiles/gr_unit_test_resource.dir/cmake_clean_target.cmake cd /tmp/B.xnuEsf/BUILD/mysql-5.7.22/build/rapid/plugin/group_replication && /usr/bin/cmake -E cmake_link_script CMakeFiles/gr_unit_test_resource.dir/link.txt --verbose=1 /usr/bin/ar qc ../../../archive_output_directory/libgr_unit_test_resource.a CMakeFiles/gr_unit_test_resource.dir/src/gcs_plugin_messages.cc.o CMakeFiles/gr_unit_test_resource.dir/src/member_info.cc.o CMakeFiles/gr_unit_test_resource.dir/src/member_version.cc.o CMakeFiles/gr_unit_test_resource.dir/src/compatibility_module.cc.o CMakeFiles/gr_unit_test_resource.dir/libmysqlgcs/src/interface/gcs_logging.cc.o CMakeFiles/gr_unit_test_resource.dir/libmysqlgcs/src/interface/xplatform/my_xp_cond.cc.o CMakeFiles/gr_unit_test_resource.dir/libmysqlgcs/src/interface/xplatform/my_xp_thread.cc.o CMakeFiles/gr_unit_test_resource.dir/libmysqlgcs/src/interface/xplatform/my_xp_mutex.cc.o CMakeFiles/gr_unit_test_resource.dir/libmysqlgcs/src/interface/xplatform/my_xp_util.cc.o CMakeFiles/gr_unit_test_resource.dir/libmysqlgcs/src/interface/gcs_view.cc.o CMakeFiles/gr_unit_test_resource.dir/libmysqlgcs/src/interface/gcs_types.cc.o CMakeFiles/gr_unit_test_resource.dir/libmysqlgcs/src/interface/gcs_message.cc.o CMakeFiles/gr_unit_test_resource.dir/libmysqlgcs/src/interface/gcs_member_identifier.cc.o CMakeFiles/gr_unit_test_resource.dir/libmysqlgcs/src/interface/gcs_group_identifier.cc.o /usr/bin/ranlib ../../../archive_output_directory/libgr_unit_test_resource.a cd /tmp/B.xnuEsf/BUILD/mysql-5.7.22/build/rapid/plugin/group_replication && /usr/bin/cmake -DTARGET_NAME=gr_unit_test_resource -DTARGET_LOC=/tmp/B.xnuEsf/BUILD/mysql-5.7.22/build/archive_output_directory/libgr_unit_test_resource.a -DCFG_INTDIR=. -P /tmp/B.xnuEsf/BUILD/mysql-5.7.22/build/archive_output_directory/lib_location_gr_unit_test_resource.cmake make[2]: Leaving directory '/tmp/B.xnuEsf/BUILD/mysql-5.7.22/build' make[1]: Entering directory '/tmp/B.xnuEsf/BUILD/mysql-5.7.22/build' [ 3%] Built target gr_unit_test_resource make[1]: Leaving directory '/tmp/B.xnuEsf/BUILD/mysql-5.7.22/build' make[2]: Entering directory '/tmp/B.xnuEsf/BUILD/mysql-5.7.22/build' [ 3%] Building C object strings/CMakeFiles/strings.dir/ctype-sjis.c.o cd /tmp/B.xnuEsf/BUILD/mysql-5.7.22/build/strings && /usr/bin/i686-pld-linux-gcc -DBOOST_GEOMETRY_SQRT_CHECK_FINITENESS -DDISABLE_MYSQL_THREAD_H -DHAVE_CONFIG_H -DHAVE_LIBEVENT2 -D_FILE_OFFSET_BITS=64 -D_GNU_SOURCE -I/tmp/B.xnuEsf/BUILD/mysql-5.7.22/build/include -I/tmp/B.xnuEsf/BUILD/mysql-5.7.22/extra/rapidjson/include -I/tmp/B.xnuEsf/BUILD/mysql-5.7.22/build/libbinlogevents/include -I/tmp/B.xnuEsf/BUILD/mysql-5.7.22/libbinlogevents/export -I/tmp/B.xnuEsf/BUILD/mysql-5.7.22/include -fPIC -Wall -Wextra -Wformat-security -Wvla -Wimplicit-fallthrough=2 -Wwrite-strings -Wdeclaration-after-statement -O3 -O2 -fwrapv -pipe -Wformat -Werror=format-security -gdwarf-4 -fno-debug-types-section -fvar-tracking-assignments -g2 -Wp,-D_FORTIFY_SOURCE=2 -fstack-protector-strong --param=ssp-buffer-size=4 -fomit-frame-pointer -march=i686 -fasynchronous-unwind-tables -mtune=pentium4 -gdwarf-4 -fno-debug-types-section -fvar-tracking-assignments -g2 -DNDEBUG -fno-omit-frame-pointer -fno-strict-aliasing -g -fabi-version=2 -fno-omit-frame-pointer -fno-strict-aliasing -ffp-contract=off -DDBUG_OFF -o CMakeFiles/strings.dir/ctype-sjis.c.o -c /tmp/B.xnuEsf/BUILD/mysql-5.7.22/strings/ctype-sjis.c make[2]: Leaving directory '/tmp/B.xnuEsf/BUILD/mysql-5.7.22/build' make[2]: Entering directory '/tmp/B.xnuEsf/BUILD/mysql-5.7.22/build' [ 3%] Building C object strings/CMakeFiles/strings.dir/ctype-win1250ch.c.o cd /tmp/B.xnuEsf/BUILD/mysql-5.7.22/build/strings && /usr/bin/i686-pld-linux-gcc -DBOOST_GEOMETRY_SQRT_CHECK_FINITENESS -DDISABLE_MYSQL_THREAD_H -DHAVE_CONFIG_H -DHAVE_LIBEVENT2 -D_FILE_OFFSET_BITS=64 -D_GNU_SOURCE -I/tmp/B.xnuEsf/BUILD/mysql-5.7.22/build/include -I/tmp/B.xnuEsf/BUILD/mysql-5.7.22/extra/rapidjson/include -I/tmp/B.xnuEsf/BUILD/mysql-5.7.22/build/libbinlogevents/include -I/tmp/B.xnuEsf/BUILD/mysql-5.7.22/libbinlogevents/export -I/tmp/B.xnuEsf/BUILD/mysql-5.7.22/include -fPIC -Wall -Wextra -Wformat-security -Wvla -Wimplicit-fallthrough=2 -Wwrite-strings -Wdeclaration-after-statement -O3 -O2 -fwrapv -pipe -Wformat -Werror=format-security -gdwarf-4 -fno-debug-types-section -fvar-tracking-assignments -g2 -Wp,-D_FORTIFY_SOURCE=2 -fstack-protector-strong --param=ssp-buffer-size=4 -fomit-frame-pointer -march=i686 -fasynchronous-unwind-tables -mtune=pentium4 -gdwarf-4 -fno-debug-types-section -fvar-tracking-assignments -g2 -DNDEBUG -fno-omit-frame-pointer -fno-strict-aliasing -g -fabi-version=2 -fno-omit-frame-pointer -fno-strict-aliasing -ffp-contract=off -DDBUG_OFF -o CMakeFiles/strings.dir/ctype-win1250ch.c.o -c /tmp/B.xnuEsf/BUILD/mysql-5.7.22/strings/ctype-win1250ch.c make[2]: Leaving directory '/tmp/B.xnuEsf/BUILD/mysql-5.7.22/build' make[2]: Entering directory '/tmp/B.xnuEsf/BUILD/mysql-5.7.22/build' [ 2%] Building C object strings/CMakeFiles/strings.dir/ctype-simple.c.o cd /tmp/B.xnuEsf/BUILD/mysql-5.7.22/build/strings && /usr/bin/i686-pld-linux-gcc -DBOOST_GEOMETRY_SQRT_CHECK_FINITENESS -DDISABLE_MYSQL_THREAD_H -DHAVE_CONFIG_H -DHAVE_LIBEVENT2 -D_FILE_OFFSET_BITS=64 -D_GNU_SOURCE -I/tmp/B.xnuEsf/BUILD/mysql-5.7.22/build/include -I/tmp/B.xnuEsf/BUILD/mysql-5.7.22/extra/rapidjson/include -I/tmp/B.xnuEsf/BUILD/mysql-5.7.22/build/libbinlogevents/include -I/tmp/B.xnuEsf/BUILD/mysql-5.7.22/libbinlogevents/export -I/tmp/B.xnuEsf/BUILD/mysql-5.7.22/include -fPIC -Wall -Wextra -Wformat-security -Wvla -Wimplicit-fallthrough=2 -Wwrite-strings -Wdeclaration-after-statement -O3 -O2 -fwrapv -pipe -Wformat -Werror=format-security -gdwarf-4 -fno-debug-types-section -fvar-tracking-assignments -g2 -Wp,-D_FORTIFY_SOURCE=2 -fstack-protector-strong --param=ssp-buffer-size=4 -fomit-frame-pointer -march=i686 -fasynchronous-unwind-tables -mtune=pentium4 -gdwarf-4 -fno-debug-types-section -fvar-tracking-assignments -g2 -DNDEBUG -fno-omit-frame-pointer -fno-strict-aliasing -g -fabi-version=2 -fno-omit-frame-pointer -fno-strict-aliasing -ffp-contract=off -DDBUG_OFF -o CMakeFiles/strings.dir/ctype-simple.c.o -c /tmp/B.xnuEsf/BUILD/mysql-5.7.22/strings/ctype-simple.c make[2]: Leaving directory '/tmp/B.xnuEsf/BUILD/mysql-5.7.22/build' make[2]: Entering directory '/tmp/B.xnuEsf/BUILD/mysql-5.7.22/build' [ 2%] Building C object strings/CMakeFiles/strings.dir/ctype-gb18030.c.o cd /tmp/B.xnuEsf/BUILD/mysql-5.7.22/build/strings && /usr/bin/i686-pld-linux-gcc -DBOOST_GEOMETRY_SQRT_CHECK_FINITENESS -DDISABLE_MYSQL_THREAD_H -DHAVE_CONFIG_H -DHAVE_LIBEVENT2 -D_FILE_OFFSET_BITS=64 -D_GNU_SOURCE -I/tmp/B.xnuEsf/BUILD/mysql-5.7.22/build/include -I/tmp/B.xnuEsf/BUILD/mysql-5.7.22/extra/rapidjson/include -I/tmp/B.xnuEsf/BUILD/mysql-5.7.22/build/libbinlogevents/include -I/tmp/B.xnuEsf/BUILD/mysql-5.7.22/libbinlogevents/export -I/tmp/B.xnuEsf/BUILD/mysql-5.7.22/include -fPIC -Wall -Wextra -Wformat-security -Wvla -Wimplicit-fallthrough=2 -Wwrite-strings -Wdeclaration-after-statement -O3 -O2 -fwrapv -pipe -Wformat -Werror=format-security -gdwarf-4 -fno-debug-types-section -fvar-tracking-assignments -g2 -Wp,-D_FORTIFY_SOURCE=2 -fstack-protector-strong --param=ssp-buffer-size=4 -fomit-frame-pointer -march=i686 -fasynchronous-unwind-tables -mtune=pentium4 -gdwarf-4 -fno-debug-types-section -fvar-tracking-assignments -g2 -DNDEBUG -fno-omit-frame-pointer -fno-strict-aliasing -g -fabi-version=2 -fno-omit-frame-pointer -fno-strict-aliasing -ffp-contract=off -DDBUG_OFF -o CMakeFiles/strings.dir/ctype-gb18030.c.o -c /tmp/B.xnuEsf/BUILD/mysql-5.7.22/strings/ctype-gb18030.c make[2]: Leaving directory '/tmp/B.xnuEsf/BUILD/mysql-5.7.22/build' make[2]: Entering directory '/tmp/B.xnuEsf/BUILD/mysql-5.7.22/build' [ 3%] Building C object strings/CMakeFiles/strings.dir/ctype.c.o cd /tmp/B.xnuEsf/BUILD/mysql-5.7.22/build/strings && /usr/bin/i686-pld-linux-gcc -DBOOST_GEOMETRY_SQRT_CHECK_FINITENESS -DDISABLE_MYSQL_THREAD_H -DHAVE_CONFIG_H -DHAVE_LIBEVENT2 -D_FILE_OFFSET_BITS=64 -D_GNU_SOURCE -I/tmp/B.xnuEsf/BUILD/mysql-5.7.22/build/include -I/tmp/B.xnuEsf/BUILD/mysql-5.7.22/extra/rapidjson/include -I/tmp/B.xnuEsf/BUILD/mysql-5.7.22/build/libbinlogevents/include -I/tmp/B.xnuEsf/BUILD/mysql-5.7.22/libbinlogevents/export -I/tmp/B.xnuEsf/BUILD/mysql-5.7.22/include -fPIC -Wall -Wextra -Wformat-security -Wvla -Wimplicit-fallthrough=2 -Wwrite-strings -Wdeclaration-after-statement -O3 -O2 -fwrapv -pipe -Wformat -Werror=format-security -gdwarf-4 -fno-debug-types-section -fvar-tracking-assignments -g2 -Wp,-D_FORTIFY_SOURCE=2 -fstack-protector-strong --param=ssp-buffer-size=4 -fomit-frame-pointer -march=i686 -fasynchronous-unwind-tables -mtune=pentium4 -gdwarf-4 -fno-debug-types-section -fvar-tracking-assignments -g2 -DNDEBUG -fno-omit-frame-pointer -fno-strict-aliasing -g -fabi-version=2 -fno-omit-frame-pointer -fno-strict-aliasing -ffp-contract=off -DDBUG_OFF -o CMakeFiles/strings.dir/ctype.c.o -c /tmp/B.xnuEsf/BUILD/mysql-5.7.22/strings/ctype.c make[2]: Leaving directory '/tmp/B.xnuEsf/BUILD/mysql-5.7.22/build' make[2]: Entering directory '/tmp/B.xnuEsf/BUILD/mysql-5.7.22/build' [ 3%] Building C object strings/CMakeFiles/strings.dir/is_prefix.c.o cd /tmp/B.xnuEsf/BUILD/mysql-5.7.22/build/strings && /usr/bin/i686-pld-linux-gcc -DBOOST_GEOMETRY_SQRT_CHECK_FINITENESS -DDISABLE_MYSQL_THREAD_H -DHAVE_CONFIG_H -DHAVE_LIBEVENT2 -D_FILE_OFFSET_BITS=64 -D_GNU_SOURCE -I/tmp/B.xnuEsf/BUILD/mysql-5.7.22/build/include -I/tmp/B.xnuEsf/BUILD/mysql-5.7.22/extra/rapidjson/include -I/tmp/B.xnuEsf/BUILD/mysql-5.7.22/build/libbinlogevents/include -I/tmp/B.xnuEsf/BUILD/mysql-5.7.22/libbinlogevents/export -I/tmp/B.xnuEsf/BUILD/mysql-5.7.22/include -fPIC -Wall -Wextra -Wformat-security -Wvla -Wimplicit-fallthrough=2 -Wwrite-strings -Wdeclaration-after-statement -O3 -O2 -fwrapv -pipe -Wformat -Werror=format-security -gdwarf-4 -fno-debug-types-section -fvar-tracking-assignments -g2 -Wp,-D_FORTIFY_SOURCE=2 -fstack-protector-strong --param=ssp-buffer-size=4 -fomit-frame-pointer -march=i686 -fasynchronous-unwind-tables -mtune=pentium4 -gdwarf-4 -fno-debug-types-section -fvar-tracking-assignments -g2 -DNDEBUG -fno-omit-frame-pointer -fno-strict-aliasing -g -fabi-version=2 -fno-omit-frame-pointer -fno-strict-aliasing -ffp-contract=off -DDBUG_OFF -o CMakeFiles/strings.dir/is_prefix.c.o -c /tmp/B.xnuEsf/BUILD/mysql-5.7.22/strings/is_prefix.c make[2]: Leaving directory '/tmp/B.xnuEsf/BUILD/mysql-5.7.22/build' make[2]: Entering directory '/tmp/B.xnuEsf/BUILD/mysql-5.7.22/build' [ 3%] Building C object strings/CMakeFiles/strings.dir/llstr.c.o cd /tmp/B.xnuEsf/BUILD/mysql-5.7.22/build/strings && /usr/bin/i686-pld-linux-gcc -DBOOST_GEOMETRY_SQRT_CHECK_FINITENESS -DDISABLE_MYSQL_THREAD_H -DHAVE_CONFIG_H -DHAVE_LIBEVENT2 -D_FILE_OFFSET_BITS=64 -D_GNU_SOURCE -I/tmp/B.xnuEsf/BUILD/mysql-5.7.22/build/include -I/tmp/B.xnuEsf/BUILD/mysql-5.7.22/extra/rapidjson/include -I/tmp/B.xnuEsf/BUILD/mysql-5.7.22/build/libbinlogevents/include -I/tmp/B.xnuEsf/BUILD/mysql-5.7.22/libbinlogevents/export -I/tmp/B.xnuEsf/BUILD/mysql-5.7.22/include -fPIC -Wall -Wextra -Wformat-security -Wvla -Wimplicit-fallthrough=2 -Wwrite-strings -Wdeclaration-after-statement -O3 -O2 -fwrapv -pipe -Wformat -Werror=format-security -gdwarf-4 -fno-debug-types-section -fvar-tracking-assignments -g2 -Wp,-D_FORTIFY_SOURCE=2 -fstack-protector-strong --param=ssp-buffer-size=4 -fomit-frame-pointer -march=i686 -fasynchronous-unwind-tables -mtune=pentium4 -gdwarf-4 -fno-debug-types-section -fvar-tracking-assignments -g2 -DNDEBUG -fno-omit-frame-pointer -fno-strict-aliasing -g -fabi-version=2 -fno-omit-frame-pointer -fno-strict-aliasing -ffp-contract=off -DDBUG_OFF -o CMakeFiles/strings.dir/llstr.c.o -c /tmp/B.xnuEsf/BUILD/mysql-5.7.22/strings/llstr.c make[2]: Leaving directory '/tmp/B.xnuEsf/BUILD/mysql-5.7.22/build' make[2]: Entering directory '/tmp/B.xnuEsf/BUILD/mysql-5.7.22/build' [ 3%] Building C object strings/CMakeFiles/strings.dir/int2str.c.o cd /tmp/B.xnuEsf/BUILD/mysql-5.7.22/build/strings && /usr/bin/i686-pld-linux-gcc -DBOOST_GEOMETRY_SQRT_CHECK_FINITENESS -DDISABLE_MYSQL_THREAD_H -DHAVE_CONFIG_H -DHAVE_LIBEVENT2 -D_FILE_OFFSET_BITS=64 -D_GNU_SOURCE -I/tmp/B.xnuEsf/BUILD/mysql-5.7.22/build/include -I/tmp/B.xnuEsf/BUILD/mysql-5.7.22/extra/rapidjson/include -I/tmp/B.xnuEsf/BUILD/mysql-5.7.22/build/libbinlogevents/include -I/tmp/B.xnuEsf/BUILD/mysql-5.7.22/libbinlogevents/export -I/tmp/B.xnuEsf/BUILD/mysql-5.7.22/include -fPIC -Wall -Wextra -Wformat-security -Wvla -Wimplicit-fallthrough=2 -Wwrite-strings -Wdeclaration-after-statement -O3 -O2 -fwrapv -pipe -Wformat -Werror=format-security -gdwarf-4 -fno-debug-types-section -fvar-tracking-assignments -g2 -Wp,-D_FORTIFY_SOURCE=2 -fstack-protector-strong --param=ssp-buffer-size=4 -fomit-frame-pointer -march=i686 -fasynchronous-unwind-tables -mtune=pentium4 -gdwarf-4 -fno-debug-types-section -fvar-tracking-assignments -g2 -DNDEBUG -fno-omit-frame-pointer -fno-strict-aliasing -g -fabi-version=2 -fno-omit-frame-pointer -fno-strict-aliasing -ffp-contract=off -DDBUG_OFF -o CMakeFiles/strings.dir/int2str.c.o -c /tmp/B.xnuEsf/BUILD/mysql-5.7.22/strings/int2str.c make[2]: Leaving directory '/tmp/B.xnuEsf/BUILD/mysql-5.7.22/build' make[2]: Entering directory '/tmp/B.xnuEsf/BUILD/mysql-5.7.22/build' [ 3%] Building C object strings/CMakeFiles/strings.dir/longlong2str.c.o cd /tmp/B.xnuEsf/BUILD/mysql-5.7.22/build/strings && /usr/bin/i686-pld-linux-gcc -DBOOST_GEOMETRY_SQRT_CHECK_FINITENESS -DDISABLE_MYSQL_THREAD_H -DHAVE_CONFIG_H -DHAVE_LIBEVENT2 -D_FILE_OFFSET_BITS=64 -D_GNU_SOURCE -I/tmp/B.xnuEsf/BUILD/mysql-5.7.22/build/include -I/tmp/B.xnuEsf/BUILD/mysql-5.7.22/extra/rapidjson/include -I/tmp/B.xnuEsf/BUILD/mysql-5.7.22/build/libbinlogevents/include -I/tmp/B.xnuEsf/BUILD/mysql-5.7.22/libbinlogevents/export -I/tmp/B.xnuEsf/BUILD/mysql-5.7.22/include -fPIC -Wall -Wextra -Wformat-security -Wvla -Wimplicit-fallthrough=2 -Wwrite-strings -Wdeclaration-after-statement -O3 -O2 -fwrapv -pipe -Wformat -Werror=format-security -gdwarf-4 -fno-debug-types-section -fvar-tracking-assignments -g2 -Wp,-D_FORTIFY_SOURCE=2 -fstack-protector-strong --param=ssp-buffer-size=4 -fomit-frame-pointer -march=i686 -fasynchronous-unwind-tables -mtune=pentium4 -gdwarf-4 -fno-debug-types-section -fvar-tracking-assignments -g2 -DNDEBUG -fno-omit-frame-pointer -fno-strict-aliasing -g -fabi-version=2 -fno-omit-frame-pointer -fno-strict-aliasing -ffp-contract=off -DDBUG_OFF -o CMakeFiles/strings.dir/longlong2str.c.o -c /tmp/B.xnuEsf/BUILD/mysql-5.7.22/strings/longlong2str.c make[2]: Leaving directory '/tmp/B.xnuEsf/BUILD/mysql-5.7.22/build' make[2]: Entering directory '/tmp/B.xnuEsf/BUILD/mysql-5.7.22/build' [ 3%] Building C object strings/CMakeFiles/strings.dir/ctype-uca.c.o cd /tmp/B.xnuEsf/BUILD/mysql-5.7.22/build/strings && /usr/bin/i686-pld-linux-gcc -DBOOST_GEOMETRY_SQRT_CHECK_FINITENESS -DDISABLE_MYSQL_THREAD_H -DHAVE_CONFIG_H -DHAVE_LIBEVENT2 -D_FILE_OFFSET_BITS=64 -D_GNU_SOURCE -I/tmp/B.xnuEsf/BUILD/mysql-5.7.22/build/include -I/tmp/B.xnuEsf/BUILD/mysql-5.7.22/extra/rapidjson/include -I/tmp/B.xnuEsf/BUILD/mysql-5.7.22/build/libbinlogevents/include -I/tmp/B.xnuEsf/BUILD/mysql-5.7.22/libbinlogevents/export -I/tmp/B.xnuEsf/BUILD/mysql-5.7.22/include -fPIC -Wall -Wextra -Wformat-security -Wvla -Wimplicit-fallthrough=2 -Wwrite-strings -Wdeclaration-after-statement -O3 -O2 -fwrapv -pipe -Wformat -Werror=format-security -gdwarf-4 -fno-debug-types-section -fvar-tracking-assignments -g2 -Wp,-D_FORTIFY_SOURCE=2 -fstack-protector-strong --param=ssp-buffer-size=4 -fomit-frame-pointer -march=i686 -fasynchronous-unwind-tables -mtune=pentium4 -gdwarf-4 -fno-debug-types-section -fvar-tracking-assignments -g2 -DNDEBUG -fno-omit-frame-pointer -fno-strict-aliasing -g -fabi-version=2 -fno-omit-frame-pointer -fno-strict-aliasing -ffp-contract=off -DDBUG_OFF -o CMakeFiles/strings.dir/ctype-uca.c.o -c /tmp/B.xnuEsf/BUILD/mysql-5.7.22/strings/ctype-uca.c make[2]: Leaving directory '/tmp/B.xnuEsf/BUILD/mysql-5.7.22/build' make[2]: Entering directory '/tmp/B.xnuEsf/BUILD/mysql-5.7.22/build' [ 3%] Building C object strings/CMakeFiles/strings.dir/my_strtoll10.c.o cd /tmp/B.xnuEsf/BUILD/mysql-5.7.22/build/strings && /usr/bin/i686-pld-linux-gcc -DBOOST_GEOMETRY_SQRT_CHECK_FINITENESS -DDISABLE_MYSQL_THREAD_H -DHAVE_CONFIG_H -DHAVE_LIBEVENT2 -D_FILE_OFFSET_BITS=64 -D_GNU_SOURCE -I/tmp/B.xnuEsf/BUILD/mysql-5.7.22/build/include -I/tmp/B.xnuEsf/BUILD/mysql-5.7.22/extra/rapidjson/include -I/tmp/B.xnuEsf/BUILD/mysql-5.7.22/build/libbinlogevents/include -I/tmp/B.xnuEsf/BUILD/mysql-5.7.22/libbinlogevents/export -I/tmp/B.xnuEsf/BUILD/mysql-5.7.22/include -fPIC -Wall -Wextra -Wformat-security -Wvla -Wimplicit-fallthrough=2 -Wwrite-strings -Wdeclaration-after-statement -O3 -O2 -fwrapv -pipe -Wformat -Werror=format-security -gdwarf-4 -fno-debug-types-section -fvar-tracking-assignments -g2 -Wp,-D_FORTIFY_SOURCE=2 -fstack-protector-strong --param=ssp-buffer-size=4 -fomit-frame-pointer -march=i686 -fasynchronous-unwind-tables -mtune=pentium4 -gdwarf-4 -fno-debug-types-section -fvar-tracking-assignments -g2 -DNDEBUG -fno-omit-frame-pointer -fno-strict-aliasing -g -fabi-version=2 -fno-omit-frame-pointer -fno-strict-aliasing -ffp-contract=off -DDBUG_OFF -o CMakeFiles/strings.dir/my_strtoll10.c.o -c /tmp/B.xnuEsf/BUILD/mysql-5.7.22/strings/my_strtoll10.c make[2]: Leaving directory '/tmp/B.xnuEsf/BUILD/mysql-5.7.22/build' make[2]: Entering directory '/tmp/B.xnuEsf/BUILD/mysql-5.7.22/build' [ 3%] Building C object strings/CMakeFiles/strings.dir/str2int.c.o cd /tmp/B.xnuEsf/BUILD/mysql-5.7.22/build/strings && /usr/bin/i686-pld-linux-gcc -DBOOST_GEOMETRY_SQRT_CHECK_FINITENESS -DDISABLE_MYSQL_THREAD_H -DHAVE_CONFIG_H -DHAVE_LIBEVENT2 -D_FILE_OFFSET_BITS=64 -D_GNU_SOURCE -I/tmp/B.xnuEsf/BUILD/mysql-5.7.22/build/include -I/tmp/B.xnuEsf/BUILD/mysql-5.7.22/extra/rapidjson/include -I/tmp/B.xnuEsf/BUILD/mysql-5.7.22/build/libbinlogevents/include -I/tmp/B.xnuEsf/BUILD/mysql-5.7.22/libbinlogevents/export -I/tmp/B.xnuEsf/BUILD/mysql-5.7.22/include -fPIC -Wall -Wextra -Wformat-security -Wvla -Wimplicit-fallthrough=2 -Wwrite-strings -Wdeclaration-after-statement -O3 -O2 -fwrapv -pipe -Wformat -Werror=format-security -gdwarf-4 -fno-debug-types-section -fvar-tracking-assignments -g2 -Wp,-D_FORTIFY_SOURCE=2 -fstack-protector-strong --param=ssp-buffer-size=4 -fomit-frame-pointer -march=i686 -fasynchronous-unwind-tables -mtune=pentium4 -gdwarf-4 -fno-debug-types-section -fvar-tracking-assignments -g2 -DNDEBUG -fno-omit-frame-pointer -fno-strict-aliasing -g -fabi-version=2 -fno-omit-frame-pointer -fno-strict-aliasing -ffp-contract=off -DDBUG_OFF -o CMakeFiles/strings.dir/str2int.c.o -c /tmp/B.xnuEsf/BUILD/mysql-5.7.22/strings/str2int.c make[2]: Leaving directory '/tmp/B.xnuEsf/BUILD/mysql-5.7.22/build' make[2]: Entering directory '/tmp/B.xnuEsf/BUILD/mysql-5.7.22/build' [ 3%] Building C object strings/CMakeFiles/strings.dir/strcend.c.o cd /tmp/B.xnuEsf/BUILD/mysql-5.7.22/build/strings && /usr/bin/i686-pld-linux-gcc -DBOOST_GEOMETRY_SQRT_CHECK_FINITENESS -DDISABLE_MYSQL_THREAD_H -DHAVE_CONFIG_H -DHAVE_LIBEVENT2 -D_FILE_OFFSET_BITS=64 -D_GNU_SOURCE -I/tmp/B.xnuEsf/BUILD/mysql-5.7.22/build/include -I/tmp/B.xnuEsf/BUILD/mysql-5.7.22/extra/rapidjson/include -I/tmp/B.xnuEsf/BUILD/mysql-5.7.22/build/libbinlogevents/include -I/tmp/B.xnuEsf/BUILD/mysql-5.7.22/libbinlogevents/export -I/tmp/B.xnuEsf/BUILD/mysql-5.7.22/include -fPIC -Wall -Wextra -Wformat-security -Wvla -Wimplicit-fallthrough=2 -Wwrite-strings -Wdeclaration-after-statement -O3 -O2 -fwrapv -pipe -Wformat -Werror=format-security -gdwarf-4 -fno-debug-types-section -fvar-tracking-assignments -g2 -Wp,-D_FORTIFY_SOURCE=2 -fstack-protector-strong --param=ssp-buffer-size=4 -fomit-frame-pointer -march=i686 -fasynchronous-unwind-tables -mtune=pentium4 -gdwarf-4 -fno-debug-types-section -fvar-tracking-assignments -g2 -DNDEBUG -fno-omit-frame-pointer -fno-strict-aliasing -g -fabi-version=2 -fno-omit-frame-pointer -fno-strict-aliasing -ffp-contract=off -DDBUG_OFF -o CMakeFiles/strings.dir/strcend.c.o -c /tmp/B.xnuEsf/BUILD/mysql-5.7.22/strings/strcend.c make[2]: Leaving directory '/tmp/B.xnuEsf/BUILD/mysql-5.7.22/build' make[2]: Entering directory '/tmp/B.xnuEsf/BUILD/mysql-5.7.22/build' [ 3%] Building C object strings/CMakeFiles/strings.dir/ctype-ujis.c.o cd /tmp/B.xnuEsf/BUILD/mysql-5.7.22/build/strings && /usr/bin/i686-pld-linux-gcc -DBOOST_GEOMETRY_SQRT_CHECK_FINITENESS -DDISABLE_MYSQL_THREAD_H -DHAVE_CONFIG_H -DHAVE_LIBEVENT2 -D_FILE_OFFSET_BITS=64 -D_GNU_SOURCE -I/tmp/B.xnuEsf/BUILD/mysql-5.7.22/build/include -I/tmp/B.xnuEsf/BUILD/mysql-5.7.22/extra/rapidjson/include -I/tmp/B.xnuEsf/BUILD/mysql-5.7.22/build/libbinlogevents/include -I/tmp/B.xnuEsf/BUILD/mysql-5.7.22/libbinlogevents/export -I/tmp/B.xnuEsf/BUILD/mysql-5.7.22/include -fPIC -Wall -Wextra -Wformat-security -Wvla -Wimplicit-fallthrough=2 -Wwrite-strings -Wdeclaration-after-statement -O3 -O2 -fwrapv -pipe -Wformat -Werror=format-security -gdwarf-4 -fno-debug-types-section -fvar-tracking-assignments -g2 -Wp,-D_FORTIFY_SOURCE=2 -fstack-protector-strong --param=ssp-buffer-size=4 -fomit-frame-pointer -march=i686 -fasynchronous-unwind-tables -mtune=pentium4 -gdwarf-4 -fno-debug-types-section -fvar-tracking-assignments -g2 -DNDEBUG -fno-omit-frame-pointer -fno-strict-aliasing -g -fabi-version=2 -fno-omit-frame-pointer -fno-strict-aliasing -ffp-contract=off -DDBUG_OFF -o CMakeFiles/strings.dir/ctype-ujis.c.o -c /tmp/B.xnuEsf/BUILD/mysql-5.7.22/strings/ctype-ujis.c make[2]: Leaving directory '/tmp/B.xnuEsf/BUILD/mysql-5.7.22/build' make[2]: Entering directory '/tmp/B.xnuEsf/BUILD/mysql-5.7.22/build' [ 3%] Building C object strings/CMakeFiles/strings.dir/ctype-utf8.c.o cd /tmp/B.xnuEsf/BUILD/mysql-5.7.22/build/strings && /usr/bin/i686-pld-linux-gcc -DBOOST_GEOMETRY_SQRT_CHECK_FINITENESS -DDISABLE_MYSQL_THREAD_H -DHAVE_CONFIG_H -DHAVE_LIBEVENT2 -D_FILE_OFFSET_BITS=64 -D_GNU_SOURCE -I/tmp/B.xnuEsf/BUILD/mysql-5.7.22/build/include -I/tmp/B.xnuEsf/BUILD/mysql-5.7.22/extra/rapidjson/include -I/tmp/B.xnuEsf/BUILD/mysql-5.7.22/build/libbinlogevents/include -I/tmp/B.xnuEsf/BUILD/mysql-5.7.22/libbinlogevents/export -I/tmp/B.xnuEsf/BUILD/mysql-5.7.22/include -fPIC -Wall -Wextra -Wformat-security -Wvla -Wimplicit-fallthrough=2 -Wwrite-strings -Wdeclaration-after-statement -O3 -O2 -fwrapv -pipe -Wformat -Werror=format-security -gdwarf-4 -fno-debug-types-section -fvar-tracking-assignments -g2 -Wp,-D_FORTIFY_SOURCE=2 -fstack-protector-strong --param=ssp-buffer-size=4 -fomit-frame-pointer -march=i686 -fasynchronous-unwind-tables -mtune=pentium4 -gdwarf-4 -fno-debug-types-section -fvar-tracking-assignments -g2 -DNDEBUG -fno-omit-frame-pointer -fno-strict-aliasing -g -fabi-version=2 -fno-omit-frame-pointer -fno-strict-aliasing -ffp-contract=off -DDBUG_OFF -o CMakeFiles/strings.dir/ctype-utf8.c.o -c /tmp/B.xnuEsf/BUILD/mysql-5.7.22/strings/ctype-utf8.c make[2]: Leaving directory '/tmp/B.xnuEsf/BUILD/mysql-5.7.22/build' make[2]: Entering directory '/tmp/B.xnuEsf/BUILD/mysql-5.7.22/build' [ 3%] Building C object strings/CMakeFiles/strings.dir/str_alloc.c.o cd /tmp/B.xnuEsf/BUILD/mysql-5.7.22/build/strings && /usr/bin/i686-pld-linux-gcc -DBOOST_GEOMETRY_SQRT_CHECK_FINITENESS -DDISABLE_MYSQL_THREAD_H -DHAVE_CONFIG_H -DHAVE_LIBEVENT2 -D_FILE_OFFSET_BITS=64 -D_GNU_SOURCE -I/tmp/B.xnuEsf/BUILD/mysql-5.7.22/build/include -I/tmp/B.xnuEsf/BUILD/mysql-5.7.22/extra/rapidjson/include -I/tmp/B.xnuEsf/BUILD/mysql-5.7.22/build/libbinlogevents/include -I/tmp/B.xnuEsf/BUILD/mysql-5.7.22/libbinlogevents/export -I/tmp/B.xnuEsf/BUILD/mysql-5.7.22/include -fPIC -Wall -Wextra -Wformat-security -Wvla -Wimplicit-fallthrough=2 -Wwrite-strings -Wdeclaration-after-statement -O3 -O2 -fwrapv -pipe -Wformat -Werror=format-security -gdwarf-4 -fno-debug-types-section -fvar-tracking-assignments -g2 -Wp,-D_FORTIFY_SOURCE=2 -fstack-protector-strong --param=ssp-buffer-size=4 -fomit-frame-pointer -march=i686 -fasynchronous-unwind-tables -mtune=pentium4 -gdwarf-4 -fno-debug-types-section -fvar-tracking-assignments -g2 -DNDEBUG -fno-omit-frame-pointer -fno-strict-aliasing -g -fabi-version=2 -fno-omit-frame-pointer -fno-strict-aliasing -ffp-contract=off -DDBUG_OFF -o CMakeFiles/strings.dir/str_alloc.c.o -c /tmp/B.xnuEsf/BUILD/mysql-5.7.22/strings/str_alloc.c make[2]: Leaving directory '/tmp/B.xnuEsf/BUILD/mysql-5.7.22/build' make[2]: Entering directory '/tmp/B.xnuEsf/BUILD/mysql-5.7.22/build' [ 4%] Building C object strings/CMakeFiles/strings.dir/strend.c.o cd /tmp/B.xnuEsf/BUILD/mysql-5.7.22/build/strings && /usr/bin/i686-pld-linux-gcc -DBOOST_GEOMETRY_SQRT_CHECK_FINITENESS -DDISABLE_MYSQL_THREAD_H -DHAVE_CONFIG_H -DHAVE_LIBEVENT2 -D_FILE_OFFSET_BITS=64 -D_GNU_SOURCE -I/tmp/B.xnuEsf/BUILD/mysql-5.7.22/build/include -I/tmp/B.xnuEsf/BUILD/mysql-5.7.22/extra/rapidjson/include -I/tmp/B.xnuEsf/BUILD/mysql-5.7.22/build/libbinlogevents/include -I/tmp/B.xnuEsf/BUILD/mysql-5.7.22/libbinlogevents/export -I/tmp/B.xnuEsf/BUILD/mysql-5.7.22/include -fPIC -Wall -Wextra -Wformat-security -Wvla -Wimplicit-fallthrough=2 -Wwrite-strings -Wdeclaration-after-statement -O3 -O2 -fwrapv -pipe -Wformat -Werror=format-security -gdwarf-4 -fno-debug-types-section -fvar-tracking-assignments -g2 -Wp,-D_FORTIFY_SOURCE=2 -fstack-protector-strong --param=ssp-buffer-size=4 -fomit-frame-pointer -march=i686 -fasynchronous-unwind-tables -mtune=pentium4 -gdwarf-4 -fno-debug-types-section -fvar-tracking-assignments -g2 -DNDEBUG -fno-omit-frame-pointer -fno-strict-aliasing -g -fabi-version=2 -fno-omit-frame-pointer -fno-strict-aliasing -ffp-contract=off -DDBUG_OFF -o CMakeFiles/strings.dir/strend.c.o -c /tmp/B.xnuEsf/BUILD/mysql-5.7.22/strings/strend.c make[2]: Leaving directory '/tmp/B.xnuEsf/BUILD/mysql-5.7.22/build' make[2]: Entering directory '/tmp/B.xnuEsf/BUILD/mysql-5.7.22/build' [ 4%] Building C object strings/CMakeFiles/strings.dir/strfill.c.o cd /tmp/B.xnuEsf/BUILD/mysql-5.7.22/build/strings && /usr/bin/i686-pld-linux-gcc -DBOOST_GEOMETRY_SQRT_CHECK_FINITENESS -DDISABLE_MYSQL_THREAD_H -DHAVE_CONFIG_H -DHAVE_LIBEVENT2 -D_FILE_OFFSET_BITS=64 -D_GNU_SOURCE -I/tmp/B.xnuEsf/BUILD/mysql-5.7.22/build/include -I/tmp/B.xnuEsf/BUILD/mysql-5.7.22/extra/rapidjson/include -I/tmp/B.xnuEsf/BUILD/mysql-5.7.22/build/libbinlogevents/include -I/tmp/B.xnuEsf/BUILD/mysql-5.7.22/libbinlogevents/export -I/tmp/B.xnuEsf/BUILD/mysql-5.7.22/include -fPIC -Wall -Wextra -Wformat-security -Wvla -Wimplicit-fallthrough=2 -Wwrite-strings -Wdeclaration-after-statement -O3 -O2 -fwrapv -pipe -Wformat -Werror=format-security -gdwarf-4 -fno-debug-types-section -fvar-tracking-assignments -g2 -Wp,-D_FORTIFY_SOURCE=2 -fstack-protector-strong --param=ssp-buffer-size=4 -fomit-frame-pointer -march=i686 -fasynchronous-unwind-tables -mtune=pentium4 -gdwarf-4 -fno-debug-types-section -fvar-tracking-assignments -g2 -DNDEBUG -fno-omit-frame-pointer -fno-strict-aliasing -g -fabi-version=2 -fno-omit-frame-pointer -fno-strict-aliasing -ffp-contract=off -DDBUG_OFF -o CMakeFiles/strings.dir/strfill.c.o -c /tmp/B.xnuEsf/BUILD/mysql-5.7.22/strings/strfill.c make[2]: Leaving directory '/tmp/B.xnuEsf/BUILD/mysql-5.7.22/build' make[2]: Entering directory '/tmp/B.xnuEsf/BUILD/mysql-5.7.22/build' [ 4%] Building C object strings/CMakeFiles/strings.dir/strmake.c.o cd /tmp/B.xnuEsf/BUILD/mysql-5.7.22/build/strings && /usr/bin/i686-pld-linux-gcc -DBOOST_GEOMETRY_SQRT_CHECK_FINITENESS -DDISABLE_MYSQL_THREAD_H -DHAVE_CONFIG_H -DHAVE_LIBEVENT2 -D_FILE_OFFSET_BITS=64 -D_GNU_SOURCE -I/tmp/B.xnuEsf/BUILD/mysql-5.7.22/build/include -I/tmp/B.xnuEsf/BUILD/mysql-5.7.22/extra/rapidjson/include -I/tmp/B.xnuEsf/BUILD/mysql-5.7.22/build/libbinlogevents/include -I/tmp/B.xnuEsf/BUILD/mysql-5.7.22/libbinlogevents/export -I/tmp/B.xnuEsf/BUILD/mysql-5.7.22/include -fPIC -Wall -Wextra -Wformat-security -Wvla -Wimplicit-fallthrough=2 -Wwrite-strings -Wdeclaration-after-statement -O3 -O2 -fwrapv -pipe -Wformat -Werror=format-security -gdwarf-4 -fno-debug-types-section -fvar-tracking-assignments -g2 -Wp,-D_FORTIFY_SOURCE=2 -fstack-protector-strong --param=ssp-buffer-size=4 -fomit-frame-pointer -march=i686 -fasynchronous-unwind-tables -mtune=pentium4 -gdwarf-4 -fno-debug-types-section -fvar-tracking-assignments -g2 -DNDEBUG -fno-omit-frame-pointer -fno-strict-aliasing -g -fabi-version=2 -fno-omit-frame-pointer -fno-strict-aliasing -ffp-contract=off -DDBUG_OFF -o CMakeFiles/strings.dir/strmake.c.o -c /tmp/B.xnuEsf/BUILD/mysql-5.7.22/strings/strmake.c make[2]: Leaving directory '/tmp/B.xnuEsf/BUILD/mysql-5.7.22/build' make[2]: Entering directory '/tmp/B.xnuEsf/BUILD/mysql-5.7.22/build' [ 4%] Building C object strings/CMakeFiles/strings.dir/my_stpmov.c.o cd /tmp/B.xnuEsf/BUILD/mysql-5.7.22/build/strings && /usr/bin/i686-pld-linux-gcc -DBOOST_GEOMETRY_SQRT_CHECK_FINITENESS -DDISABLE_MYSQL_THREAD_H -DHAVE_CONFIG_H -DHAVE_LIBEVENT2 -D_FILE_OFFSET_BITS=64 -D_GNU_SOURCE -I/tmp/B.xnuEsf/BUILD/mysql-5.7.22/build/include -I/tmp/B.xnuEsf/BUILD/mysql-5.7.22/extra/rapidjson/include -I/tmp/B.xnuEsf/BUILD/mysql-5.7.22/build/libbinlogevents/include -I/tmp/B.xnuEsf/BUILD/mysql-5.7.22/libbinlogevents/export -I/tmp/B.xnuEsf/BUILD/mysql-5.7.22/include -fPIC -Wall -Wextra -Wformat-security -Wvla -Wimplicit-fallthrough=2 -Wwrite-strings -Wdeclaration-after-statement -O3 -O2 -fwrapv -pipe -Wformat -Werror=format-security -gdwarf-4 -fno-debug-types-section -fvar-tracking-assignments -g2 -Wp,-D_FORTIFY_SOURCE=2 -fstack-protector-strong --param=ssp-buffer-size=4 -fomit-frame-pointer -march=i686 -fasynchronous-unwind-tables -mtune=pentium4 -gdwarf-4 -fno-debug-types-section -fvar-tracking-assignments -g2 -DNDEBUG -fno-omit-frame-pointer -fno-strict-aliasing -g -fabi-version=2 -fno-omit-frame-pointer -fno-strict-aliasing -ffp-contract=off -DDBUG_OFF -o CMakeFiles/strings.dir/my_stpmov.c.o -c /tmp/B.xnuEsf/BUILD/mysql-5.7.22/strings/my_stpmov.c make[2]: Leaving directory '/tmp/B.xnuEsf/BUILD/mysql-5.7.22/build' make[2]: Entering directory '/tmp/B.xnuEsf/BUILD/mysql-5.7.22/build' [ 3%] Building C object strings/CMakeFiles/strings.dir/my_vsnprintf.c.o cd /tmp/B.xnuEsf/BUILD/mysql-5.7.22/build/strings && /usr/bin/i686-pld-linux-gcc -DBOOST_GEOMETRY_SQRT_CHECK_FINITENESS -DDISABLE_MYSQL_THREAD_H -DHAVE_CONFIG_H -DHAVE_LIBEVENT2 -D_FILE_OFFSET_BITS=64 -D_GNU_SOURCE -I/tmp/B.xnuEsf/BUILD/mysql-5.7.22/build/include -I/tmp/B.xnuEsf/BUILD/mysql-5.7.22/extra/rapidjson/include -I/tmp/B.xnuEsf/BUILD/mysql-5.7.22/build/libbinlogevents/include -I/tmp/B.xnuEsf/BUILD/mysql-5.7.22/libbinlogevents/export -I/tmp/B.xnuEsf/BUILD/mysql-5.7.22/include -fPIC -Wall -Wextra -Wformat-security -Wvla -Wimplicit-fallthrough=2 -Wwrite-strings -Wdeclaration-after-statement -O3 -O2 -fwrapv -pipe -Wformat -Werror=format-security -gdwarf-4 -fno-debug-types-section -fvar-tracking-assignments -g2 -Wp,-D_FORTIFY_SOURCE=2 -fstack-protector-strong --param=ssp-buffer-size=4 -fomit-frame-pointer -march=i686 -fasynchronous-unwind-tables -mtune=pentium4 -gdwarf-4 -fno-debug-types-section -fvar-tracking-assignments -g2 -DNDEBUG -fno-omit-frame-pointer -fno-strict-aliasing -g -fabi-version=2 -fno-omit-frame-pointer -fno-strict-aliasing -ffp-contract=off -DDBUG_OFF -o CMakeFiles/strings.dir/my_vsnprintf.c.o -c /tmp/B.xnuEsf/BUILD/mysql-5.7.22/strings/my_vsnprintf.c make[2]: Leaving directory '/tmp/B.xnuEsf/BUILD/mysql-5.7.22/build' make[2]: Entering directory '/tmp/B.xnuEsf/BUILD/mysql-5.7.22/build' [ 4%] Building C object strings/CMakeFiles/strings.dir/my_stpnmov.c.o cd /tmp/B.xnuEsf/BUILD/mysql-5.7.22/build/strings && /usr/bin/i686-pld-linux-gcc -DBOOST_GEOMETRY_SQRT_CHECK_FINITENESS -DDISABLE_MYSQL_THREAD_H -DHAVE_CONFIG_H -DHAVE_LIBEVENT2 -D_FILE_OFFSET_BITS=64 -D_GNU_SOURCE -I/tmp/B.xnuEsf/BUILD/mysql-5.7.22/build/include -I/tmp/B.xnuEsf/BUILD/mysql-5.7.22/extra/rapidjson/include -I/tmp/B.xnuEsf/BUILD/mysql-5.7.22/build/libbinlogevents/include -I/tmp/B.xnuEsf/BUILD/mysql-5.7.22/libbinlogevents/export -I/tmp/B.xnuEsf/BUILD/mysql-5.7.22/include -fPIC -Wall -Wextra -Wformat-security -Wvla -Wimplicit-fallthrough=2 -Wwrite-strings -Wdeclaration-after-statement -O3 -O2 -fwrapv -pipe -Wformat -Werror=format-security -gdwarf-4 -fno-debug-types-section -fvar-tracking-assignments -g2 -Wp,-D_FORTIFY_SOURCE=2 -fstack-protector-strong --param=ssp-buffer-size=4 -fomit-frame-pointer -march=i686 -fasynchronous-unwind-tables -mtune=pentium4 -gdwarf-4 -fno-debug-types-section -fvar-tracking-assignments -g2 -DNDEBUG -fno-omit-frame-pointer -fno-strict-aliasing -g -fabi-version=2 -fno-omit-frame-pointer -fno-strict-aliasing -ffp-contract=off -DDBUG_OFF -o CMakeFiles/strings.dir/my_stpnmov.c.o -c /tmp/B.xnuEsf/BUILD/mysql-5.7.22/strings/my_stpnmov.c make[2]: Leaving directory '/tmp/B.xnuEsf/BUILD/mysql-5.7.22/build' make[2]: Entering directory '/tmp/B.xnuEsf/BUILD/mysql-5.7.22/build' [ 4%] Building C object strings/CMakeFiles/strings.dir/strxmov.c.o cd /tmp/B.xnuEsf/BUILD/mysql-5.7.22/build/strings && /usr/bin/i686-pld-linux-gcc -DBOOST_GEOMETRY_SQRT_CHECK_FINITENESS -DDISABLE_MYSQL_THREAD_H -DHAVE_CONFIG_H -DHAVE_LIBEVENT2 -D_FILE_OFFSET_BITS=64 -D_GNU_SOURCE -I/tmp/B.xnuEsf/BUILD/mysql-5.7.22/build/include -I/tmp/B.xnuEsf/BUILD/mysql-5.7.22/extra/rapidjson/include -I/tmp/B.xnuEsf/BUILD/mysql-5.7.22/build/libbinlogevents/include -I/tmp/B.xnuEsf/BUILD/mysql-5.7.22/libbinlogevents/export -I/tmp/B.xnuEsf/BUILD/mysql-5.7.22/include -fPIC -Wall -Wextra -Wformat-security -Wvla -Wimplicit-fallthrough=2 -Wwrite-strings -Wdeclaration-after-statement -O3 -O2 -fwrapv -pipe -Wformat -Werror=format-security -gdwarf-4 -fno-debug-types-section -fvar-tracking-assignments -g2 -Wp,-D_FORTIFY_SOURCE=2 -fstack-protector-strong --param=ssp-buffer-size=4 -fomit-frame-pointer -march=i686 -fasynchronous-unwind-tables -mtune=pentium4 -gdwarf-4 -fno-debug-types-section -fvar-tracking-assignments -g2 -DNDEBUG -fno-omit-frame-pointer -fno-strict-aliasing -g -fabi-version=2 -fno-omit-frame-pointer -fno-strict-aliasing -ffp-contract=off -DDBUG_OFF -o CMakeFiles/strings.dir/strxmov.c.o -c /tmp/B.xnuEsf/BUILD/mysql-5.7.22/strings/strxmov.c make[2]: Leaving directory '/tmp/B.xnuEsf/BUILD/mysql-5.7.22/build' make[2]: Entering directory '/tmp/B.xnuEsf/BUILD/mysql-5.7.22/build' [ 4%] Building C object strings/CMakeFiles/strings.dir/strxnmov.c.o cd /tmp/B.xnuEsf/BUILD/mysql-5.7.22/build/strings && /usr/bin/i686-pld-linux-gcc -DBOOST_GEOMETRY_SQRT_CHECK_FINITENESS -DDISABLE_MYSQL_THREAD_H -DHAVE_CONFIG_H -DHAVE_LIBEVENT2 -D_FILE_OFFSET_BITS=64 -D_GNU_SOURCE -I/tmp/B.xnuEsf/BUILD/mysql-5.7.22/build/include -I/tmp/B.xnuEsf/BUILD/mysql-5.7.22/extra/rapidjson/include -I/tmp/B.xnuEsf/BUILD/mysql-5.7.22/build/libbinlogevents/include -I/tmp/B.xnuEsf/BUILD/mysql-5.7.22/libbinlogevents/export -I/tmp/B.xnuEsf/BUILD/mysql-5.7.22/include -fPIC -Wall -Wextra -Wformat-security -Wvla -Wimplicit-fallthrough=2 -Wwrite-strings -Wdeclaration-after-statement -O3 -O2 -fwrapv -pipe -Wformat -Werror=format-security -gdwarf-4 -fno-debug-types-section -fvar-tracking-assignments -g2 -Wp,-D_FORTIFY_SOURCE=2 -fstack-protector-strong --param=ssp-buffer-size=4 -fomit-frame-pointer -march=i686 -fasynchronous-unwind-tables -mtune=pentium4 -gdwarf-4 -fno-debug-types-section -fvar-tracking-assignments -g2 -DNDEBUG -fno-omit-frame-pointer -fno-strict-aliasing -g -fabi-version=2 -fno-omit-frame-pointer -fno-strict-aliasing -ffp-contract=off -DDBUG_OFF -o CMakeFiles/strings.dir/strxnmov.c.o -c /tmp/B.xnuEsf/BUILD/mysql-5.7.22/strings/strxnmov.c make[2]: Leaving directory '/tmp/B.xnuEsf/BUILD/mysql-5.7.22/build' make[2]: Entering directory '/tmp/B.xnuEsf/BUILD/mysql-5.7.22/build' [ 3%] Building C object strings/CMakeFiles/strings.dir/ctype-ucs2.c.o cd /tmp/B.xnuEsf/BUILD/mysql-5.7.22/build/strings && /usr/bin/i686-pld-linux-gcc -DBOOST_GEOMETRY_SQRT_CHECK_FINITENESS -DDISABLE_MYSQL_THREAD_H -DHAVE_CONFIG_H -DHAVE_LIBEVENT2 -D_FILE_OFFSET_BITS=64 -D_GNU_SOURCE -I/tmp/B.xnuEsf/BUILD/mysql-5.7.22/build/include -I/tmp/B.xnuEsf/BUILD/mysql-5.7.22/extra/rapidjson/include -I/tmp/B.xnuEsf/BUILD/mysql-5.7.22/build/libbinlogevents/include -I/tmp/B.xnuEsf/BUILD/mysql-5.7.22/libbinlogevents/export -I/tmp/B.xnuEsf/BUILD/mysql-5.7.22/include -fPIC -Wall -Wextra -Wformat-security -Wvla -Wimplicit-fallthrough=2 -Wwrite-strings -Wdeclaration-after-statement -O3 -O2 -fwrapv -pipe -Wformat -Werror=format-security -gdwarf-4 -fno-debug-types-section -fvar-tracking-assignments -g2 -Wp,-D_FORTIFY_SOURCE=2 -fstack-protector-strong --param=ssp-buffer-size=4 -fomit-frame-pointer -march=i686 -fasynchronous-unwind-tables -mtune=pentium4 -gdwarf-4 -fno-debug-types-section -fvar-tracking-assignments -g2 -DNDEBUG -fno-omit-frame-pointer -fno-strict-aliasing -g -fabi-version=2 -fno-omit-frame-pointer -fno-strict-aliasing -ffp-contract=off -DDBUG_OFF -o CMakeFiles/strings.dir/ctype-ucs2.c.o -c /tmp/B.xnuEsf/BUILD/mysql-5.7.22/strings/ctype-ucs2.c make[2]: Leaving directory '/tmp/B.xnuEsf/BUILD/mysql-5.7.22/build' make[2]: Entering directory '/tmp/B.xnuEsf/BUILD/mysql-5.7.22/build' [ 4%] Building C object strings/CMakeFiles/strings.dir/my_strchr.c.o cd /tmp/B.xnuEsf/BUILD/mysql-5.7.22/build/strings && /usr/bin/i686-pld-linux-gcc -DBOOST_GEOMETRY_SQRT_CHECK_FINITENESS -DDISABLE_MYSQL_THREAD_H -DHAVE_CONFIG_H -DHAVE_LIBEVENT2 -D_FILE_OFFSET_BITS=64 -D_GNU_SOURCE -I/tmp/B.xnuEsf/BUILD/mysql-5.7.22/build/include -I/tmp/B.xnuEsf/BUILD/mysql-5.7.22/extra/rapidjson/include -I/tmp/B.xnuEsf/BUILD/mysql-5.7.22/build/libbinlogevents/include -I/tmp/B.xnuEsf/BUILD/mysql-5.7.22/libbinlogevents/export -I/tmp/B.xnuEsf/BUILD/mysql-5.7.22/include -fPIC -Wall -Wextra -Wformat-security -Wvla -Wimplicit-fallthrough=2 -Wwrite-strings -Wdeclaration-after-statement -O3 -O2 -fwrapv -pipe -Wformat -Werror=format-security -gdwarf-4 -fno-debug-types-section -fvar-tracking-assignments -g2 -Wp,-D_FORTIFY_SOURCE=2 -fstack-protector-strong --param=ssp-buffer-size=4 -fomit-frame-pointer -march=i686 -fasynchronous-unwind-tables -mtune=pentium4 -gdwarf-4 -fno-debug-types-section -fvar-tracking-assignments -g2 -DNDEBUG -fno-omit-frame-pointer -fno-strict-aliasing -g -fabi-version=2 -fno-omit-frame-pointer -fno-strict-aliasing -ffp-contract=off -DDBUG_OFF -o CMakeFiles/strings.dir/my_strchr.c.o -c /tmp/B.xnuEsf/BUILD/mysql-5.7.22/strings/my_strchr.c make[2]: Leaving directory '/tmp/B.xnuEsf/BUILD/mysql-5.7.22/build' make[2]: Entering directory '/tmp/B.xnuEsf/BUILD/mysql-5.7.22/build' [ 4%] Building C object strings/CMakeFiles/strings.dir/strcont.c.o cd /tmp/B.xnuEsf/BUILD/mysql-5.7.22/build/strings && /usr/bin/i686-pld-linux-gcc -DBOOST_GEOMETRY_SQRT_CHECK_FINITENESS -DDISABLE_MYSQL_THREAD_H -DHAVE_CONFIG_H -DHAVE_LIBEVENT2 -D_FILE_OFFSET_BITS=64 -D_GNU_SOURCE -I/tmp/B.xnuEsf/BUILD/mysql-5.7.22/build/include -I/tmp/B.xnuEsf/BUILD/mysql-5.7.22/extra/rapidjson/include -I/tmp/B.xnuEsf/BUILD/mysql-5.7.22/build/libbinlogevents/include -I/tmp/B.xnuEsf/BUILD/mysql-5.7.22/libbinlogevents/export -I/tmp/B.xnuEsf/BUILD/mysql-5.7.22/include -fPIC -Wall -Wextra -Wformat-security -Wvla -Wimplicit-fallthrough=2 -Wwrite-strings -Wdeclaration-after-statement -O3 -O2 -fwrapv -pipe -Wformat -Werror=format-security -gdwarf-4 -fno-debug-types-section -fvar-tracking-assignments -g2 -Wp,-D_FORTIFY_SOURCE=2 -fstack-protector-strong --param=ssp-buffer-size=4 -fomit-frame-pointer -march=i686 -fasynchronous-unwind-tables -mtune=pentium4 -gdwarf-4 -fno-debug-types-section -fvar-tracking-assignments -g2 -DNDEBUG -fno-omit-frame-pointer -fno-strict-aliasing -g -fabi-version=2 -fno-omit-frame-pointer -fno-strict-aliasing -ffp-contract=off -DDBUG_OFF -o CMakeFiles/strings.dir/strcont.c.o -c /tmp/B.xnuEsf/BUILD/mysql-5.7.22/strings/strcont.c make[2]: Leaving directory '/tmp/B.xnuEsf/BUILD/mysql-5.7.22/build' make[2]: Entering directory '/tmp/B.xnuEsf/BUILD/mysql-5.7.22/build' [ 4%] Building C object strings/CMakeFiles/strings.dir/strappend.c.o cd /tmp/B.xnuEsf/BUILD/mysql-5.7.22/build/strings && /usr/bin/i686-pld-linux-gcc -DBOOST_GEOMETRY_SQRT_CHECK_FINITENESS -DDISABLE_MYSQL_THREAD_H -DHAVE_CONFIG_H -DHAVE_LIBEVENT2 -D_FILE_OFFSET_BITS=64 -D_GNU_SOURCE -I/tmp/B.xnuEsf/BUILD/mysql-5.7.22/build/include -I/tmp/B.xnuEsf/BUILD/mysql-5.7.22/extra/rapidjson/include -I/tmp/B.xnuEsf/BUILD/mysql-5.7.22/build/libbinlogevents/include -I/tmp/B.xnuEsf/BUILD/mysql-5.7.22/libbinlogevents/export -I/tmp/B.xnuEsf/BUILD/mysql-5.7.22/include -fPIC -Wall -Wextra -Wformat-security -Wvla -Wimplicit-fallthrough=2 -Wwrite-strings -Wdeclaration-after-statement -O3 -O2 -fwrapv -pipe -Wformat -Werror=format-security -gdwarf-4 -fno-debug-types-section -fvar-tracking-assignments -g2 -Wp,-D_FORTIFY_SOURCE=2 -fstack-protector-strong --param=ssp-buffer-size=4 -fomit-frame-pointer -march=i686 -fasynchronous-unwind-tables -mtune=pentium4 -gdwarf-4 -fno-debug-types-section -fvar-tracking-assignments -g2 -DNDEBUG -fno-omit-frame-pointer -fno-strict-aliasing -g -fabi-version=2 -fno-omit-frame-pointer -fno-strict-aliasing -ffp-contract=off -DDBUG_OFF -o CMakeFiles/strings.dir/strappend.c.o -c /tmp/B.xnuEsf/BUILD/mysql-5.7.22/strings/strappend.c make[2]: Leaving directory '/tmp/B.xnuEsf/BUILD/mysql-5.7.22/build' make[2]: Entering directory '/tmp/B.xnuEsf/BUILD/mysql-5.7.22/build' [ 3%] Building C object strings/CMakeFiles/strings.dir/dtoa.c.o cd /tmp/B.xnuEsf/BUILD/mysql-5.7.22/build/strings && /usr/bin/i686-pld-linux-gcc -DBOOST_GEOMETRY_SQRT_CHECK_FINITENESS -DDISABLE_MYSQL_THREAD_H -DHAVE_CONFIG_H -DHAVE_LIBEVENT2 -D_FILE_OFFSET_BITS=64 -D_GNU_SOURCE -I/tmp/B.xnuEsf/BUILD/mysql-5.7.22/build/include -I/tmp/B.xnuEsf/BUILD/mysql-5.7.22/extra/rapidjson/include -I/tmp/B.xnuEsf/BUILD/mysql-5.7.22/build/libbinlogevents/include -I/tmp/B.xnuEsf/BUILD/mysql-5.7.22/libbinlogevents/export -I/tmp/B.xnuEsf/BUILD/mysql-5.7.22/include -fPIC -Wall -Wextra -Wformat-security -Wvla -Wimplicit-fallthrough=2 -Wwrite-strings -Wdeclaration-after-statement -O3 -O2 -fwrapv -pipe -Wformat -Werror=format-security -gdwarf-4 -fno-debug-types-section -fvar-tracking-assignments -g2 -Wp,-D_FORTIFY_SOURCE=2 -fstack-protector-strong --param=ssp-buffer-size=4 -fomit-frame-pointer -march=i686 -fasynchronous-unwind-tables -mtune=pentium4 -gdwarf-4 -fno-debug-types-section -fvar-tracking-assignments -g2 -DNDEBUG -fno-omit-frame-pointer -fno-strict-aliasing -g -fabi-version=2 -fno-omit-frame-pointer -fno-strict-aliasing -ffp-contract=off -DDBUG_OFF -o CMakeFiles/strings.dir/dtoa.c.o -c /tmp/B.xnuEsf/BUILD/mysql-5.7.22/strings/dtoa.c make[2]: Leaving directory '/tmp/B.xnuEsf/BUILD/mysql-5.7.22/build' make[2]: Entering directory '/tmp/B.xnuEsf/BUILD/mysql-5.7.22/build' [ 4%] Building C object strings/CMakeFiles/strings.dir/xml.c.o cd /tmp/B.xnuEsf/BUILD/mysql-5.7.22/build/strings && /usr/bin/i686-pld-linux-gcc -DBOOST_GEOMETRY_SQRT_CHECK_FINITENESS -DDISABLE_MYSQL_THREAD_H -DHAVE_CONFIG_H -DHAVE_LIBEVENT2 -D_FILE_OFFSET_BITS=64 -D_GNU_SOURCE -I/tmp/B.xnuEsf/BUILD/mysql-5.7.22/build/include -I/tmp/B.xnuEsf/BUILD/mysql-5.7.22/extra/rapidjson/include -I/tmp/B.xnuEsf/BUILD/mysql-5.7.22/build/libbinlogevents/include -I/tmp/B.xnuEsf/BUILD/mysql-5.7.22/libbinlogevents/export -I/tmp/B.xnuEsf/BUILD/mysql-5.7.22/include -fPIC -Wall -Wextra -Wformat-security -Wvla -Wimplicit-fallthrough=2 -Wwrite-strings -Wdeclaration-after-statement -O3 -O2 -fwrapv -pipe -Wformat -Werror=format-security -gdwarf-4 -fno-debug-types-section -fvar-tracking-assignments -g2 -Wp,-D_FORTIFY_SOURCE=2 -fstack-protector-strong --param=ssp-buffer-size=4 -fomit-frame-pointer -march=i686 -fasynchronous-unwind-tables -mtune=pentium4 -gdwarf-4 -fno-debug-types-section -fvar-tracking-assignments -g2 -DNDEBUG -fno-omit-frame-pointer -fno-strict-aliasing -g -fabi-version=2 -fno-omit-frame-pointer -fno-strict-aliasing -ffp-contract=off -DDBUG_OFF -o CMakeFiles/strings.dir/xml.c.o -c /tmp/B.xnuEsf/BUILD/mysql-5.7.22/strings/xml.c make[2]: Leaving directory '/tmp/B.xnuEsf/BUILD/mysql-5.7.22/build' make[2]: Entering directory '/tmp/B.xnuEsf/BUILD/mysql-5.7.22/build' [ 3%] Building C object strings/CMakeFiles/strings.dir/decimal.c.o cd /tmp/B.xnuEsf/BUILD/mysql-5.7.22/build/strings && /usr/bin/i686-pld-linux-gcc -DBOOST_GEOMETRY_SQRT_CHECK_FINITENESS -DDISABLE_MYSQL_THREAD_H -DHAVE_CONFIG_H -DHAVE_LIBEVENT2 -D_FILE_OFFSET_BITS=64 -D_GNU_SOURCE -I/tmp/B.xnuEsf/BUILD/mysql-5.7.22/build/include -I/tmp/B.xnuEsf/BUILD/mysql-5.7.22/extra/rapidjson/include -I/tmp/B.xnuEsf/BUILD/mysql-5.7.22/build/libbinlogevents/include -I/tmp/B.xnuEsf/BUILD/mysql-5.7.22/libbinlogevents/export -I/tmp/B.xnuEsf/BUILD/mysql-5.7.22/include -fPIC -Wall -Wextra -Wformat-security -Wvla -Wimplicit-fallthrough=2 -Wwrite-strings -Wdeclaration-after-statement -O3 -O2 -fwrapv -pipe -Wformat -Werror=format-security -gdwarf-4 -fno-debug-types-section -fvar-tracking-assignments -g2 -Wp,-D_FORTIFY_SOURCE=2 -fstack-protector-strong --param=ssp-buffer-size=4 -fomit-frame-pointer -march=i686 -fasynchronous-unwind-tables -mtune=pentium4 -gdwarf-4 -fno-debug-types-section -fvar-tracking-assignments -g2 -DNDEBUG -fno-omit-frame-pointer -fno-strict-aliasing -g -fabi-version=2 -fno-omit-frame-pointer -fno-strict-aliasing -ffp-contract=off -DDBUG_OFF -o CMakeFiles/strings.dir/decimal.c.o -c /tmp/B.xnuEsf/BUILD/mysql-5.7.22/strings/decimal.c make[2]: Leaving directory '/tmp/B.xnuEsf/BUILD/mysql-5.7.22/build' make[2]: Entering directory '/tmp/B.xnuEsf/BUILD/mysql-5.7.22/build' [ 4%] Linking C static library ../archive_output_directory/libstrings.a cd /tmp/B.xnuEsf/BUILD/mysql-5.7.22/build/strings && /usr/bin/cmake -P CMakeFiles/strings.dir/cmake_clean_target.cmake cd /tmp/B.xnuEsf/BUILD/mysql-5.7.22/build/strings && /usr/bin/cmake -E cmake_link_script CMakeFiles/strings.dir/link.txt --verbose=1 /usr/bin/ar qc ../archive_output_directory/libstrings.a CMakeFiles/strings.dir/bchange.c.o CMakeFiles/strings.dir/ctype-big5.c.o CMakeFiles/strings.dir/ctype-bin.c.o CMakeFiles/strings.dir/ctype-cp932.c.o CMakeFiles/strings.dir/ctype-czech.c.o CMakeFiles/strings.dir/ctype-euc_kr.c.o CMakeFiles/strings.dir/ctype-eucjpms.c.o CMakeFiles/strings.dir/ctype-extra.c.o CMakeFiles/strings.dir/ctype-gb2312.c.o CMakeFiles/strings.dir/ctype-gbk.c.o CMakeFiles/strings.dir/ctype-gb18030.c.o CMakeFiles/strings.dir/ctype-latin1.c.o CMakeFiles/strings.dir/ctype-mb.c.o CMakeFiles/strings.dir/ctype-simple.c.o CMakeFiles/strings.dir/ctype-sjis.c.o CMakeFiles/strings.dir/ctype-tis620.c.o CMakeFiles/strings.dir/ctype-uca.c.o CMakeFiles/strings.dir/ctype-ucs2.c.o CMakeFiles/strings.dir/ctype-ujis.c.o CMakeFiles/strings.dir/ctype-utf8.c.o CMakeFiles/strings.dir/ctype-win1250ch.c.o CMakeFiles/strings.dir/ctype.c.o CMakeFiles/strings.dir/decimal.c.o CMakeFiles/strings.dir/dtoa.c.o CMakeFiles/strings.dir/int2str.c.o CMakeFiles/strings.dir/is_prefix.c.o CMakeFiles/strings.dir/llstr.c.o CMakeFiles/strings.dir/longlong2str.c.o CMakeFiles/strings.dir/my_strtoll10.c.o CMakeFiles/strings.dir/my_vsnprintf.c.o CMakeFiles/strings.dir/str2int.c.o CMakeFiles/strings.dir/str_alloc.c.o CMakeFiles/strings.dir/strcend.c.o CMakeFiles/strings.dir/strend.c.o CMakeFiles/strings.dir/strfill.c.o CMakeFiles/strings.dir/strmake.c.o CMakeFiles/strings.dir/my_stpmov.c.o CMakeFiles/strings.dir/my_stpnmov.c.o CMakeFiles/strings.dir/strxmov.c.o CMakeFiles/strings.dir/strxnmov.c.o CMakeFiles/strings.dir/xml.c.o CMakeFiles/strings.dir/my_strchr.c.o CMakeFiles/strings.dir/strcont.c.o CMakeFiles/strings.dir/strappend.c.o /usr/bin/ranlib ../archive_output_directory/libstrings.a cd /tmp/B.xnuEsf/BUILD/mysql-5.7.22/build/strings && /usr/bin/cmake -DTARGET_NAME=strings -DTARGET_LOC=/tmp/B.xnuEsf/BUILD/mysql-5.7.22/build/archive_output_directory/libstrings.a -DCFG_INTDIR=. -P /tmp/B.xnuEsf/BUILD/mysql-5.7.22/build/archive_output_directory/lib_location_strings.cmake make[2]: Leaving directory '/tmp/B.xnuEsf/BUILD/mysql-5.7.22/build' make[1]: Entering directory '/tmp/B.xnuEsf/BUILD/mysql-5.7.22/build' [ 4%] Built target strings make[1]: Leaving directory '/tmp/B.xnuEsf/BUILD/mysql-5.7.22/build' make: *** [Makefile:166: all] Error 2 error: Bad exit status from /tmp/B.xnuEsf/BUILD/tmp/rpm-tmp.59285 (%build) RPM build errors: Bad exit status from /tmp/B.xnuEsf/BUILD/tmp/rpm-tmp.59285 (%build) ended at: Thu Sep 13 21:01:28 2018, done in 0:01:19.750398 error: No files produced. + chmod -R u+rwX /tmp/B.xnuEsf/BUILD + rm -rf /tmp/B.xnuEsf/tmp /tmp/B.xnuEsf/BUILD + rm -rf /tmp/B.xnuEsf Begin-PLD-Builder-Info Build-Time: user:101.17s sys:28.14s real:145.43s (faults io:364 non-io:2914368) End-PLD-Builder-Info
[Back to list of logs] [View rpm -qa of builder]