FailedOk

th/SRPMS[OK]
th/x32[OK]
th/i686[OK]
th/x86_64[OK]

ac/SRPMS[OK]
ac/i386[OK]
ac/i586[OK]
ac/i686[OK]
ac/alpha[OK]
ac/amd64[OK]
ac/athlon[OK]
ac/ppc[OK]
ac/sparc[OK]
ac/sparc64[OK]

Advanced Search
main()
Powered by PLD Linux
(c) 2002-2018 PLD Team
$Revision: 1.37 $
Powered by achelon.
Your IP: 54.198.103.13

mysql-ruby 6c26ffea-d0a7-45aa-b092-b5449094a1f1

Status:Failed
Source URL:ftp://buildlogs.pld-linux.org/th/i686/FAIL/mysql-ruby,6c26ffea-d0a7-45aa-b092-b5449094a1f1.bz2
text/plain URL:View!
full text:View!
rpm -qa of builder:View!
Date:2018/06/03 09:43:16
Runtime:0:00:01.435260

Toc:

  • error 1
  • mysql.c:1346:74: error: 'rb_cFixnum' undeclared (first use in this function); did you mean 'rb_isalnum'?
  • error 2
  • error: Bad exit status from /tmp/B.SQHwiL/BUILD/tmp/rpm-tmp.52238 (%build)
  • error 3
  • RPM build errors:
  • error 4
  • error: No files produced.

Content:

installing srpm: mysql-ruby-2.8.2-12.src.rpm
+ install -d /tmp/B.SQHwiL/BUILD /tmp/B.SQHwiL/RPMS
+ LC_ALL=en_US.UTF-8
+ rpm -qp --changelog mysql-ruby-2.8.2-12.src.rpm
* Sun Jun 03 2018 PLD Linux Team <feedback@pld-linux.org>
- For complete changelog see: http://git.pld-linux.org/?p=packages/mysql-ruby.git;a=log;h=master
* Tue Mar 06 2018 Jan Rękorajski <baggins@pld-linux.org> 0454d97
- rebuild with mysql 5.7 - release 12 (by relup.sh) * Sat Oct 28 2017 Elan Ruusamäe <glen@delfi.ee> 3aee2c5
- rebuild with fixed ruby ridir path - release 11 (by relup.sh) * Thu Oct 26 2017 Elan Ruusamäe <glen@pld-linux.org> 41efb61
- Revert "BR gmp-devel" * Thu Oct 26 2017 Elan Ruusamäe <glen@delfi.ee> 64126e3
- BR gmp-devel * Thu Oct 26 2017 Elan Ruusamäe <glen@pld-linux.org> 2a7ba56
- add doc bcond * Thu Oct 26 2017 Elan Ruusamäe <glen@pld-linux.org> 62277a3
- handle Config deprecation in ruby 2.3 * Wed Oct 25 2017 Jan Rękorajski <baggins@pld-linux.org> da40650
- rebuild with ruby 2.3 - release 9 (by relup.sh) + rpm -Uhv --nodeps --define '_topdir /tmp/B.SQHwiL' --define '_specdir %{_topdir}' --define '_sourcedir %{_specdir}' --define '_rpmdir %{_topdir}/RPMS' --define '_builddir %{_topdir}/BUILD' mysql-ruby-2.8.2-12.src.rpm Preparing... ################################################## mysql-ruby ################################################## + rm -f mysql-ruby-2.8.2-12.src.rpm + install -m 700 -d /tmp/B.SQHwiL/BUILD/tmp + TMPDIR=/tmp/B.SQHwiL/BUILD/tmp + exec nice -n 0 rpmbuild -bp --short-circuit --nodeps --define '_topdir /tmp/B.SQHwiL' --define '_specdir %{_topdir}' --define '_sourcedir %{_specdir}' --define '_rpmdir %{_topdir}/RPMS' --define '_builddir %{_topdir}/BUILD' --target i686-pld-linux --define 'prep exit 0' /tmp/B.SQHwiL/mysql-ruby.spec Building target platforms: i686-pld-linux checking BuildConflict-ing packages no BuildConflicts found checking BR rpm: Building target platforms: i686-pld-linux no BR needed building RPM using: set -ex; : build-id: 6c26ffea-d0a7-45aa-b092-b5449094a1f1; TMPDIR=/tmp/B.SQHwiL/BUILD/tmp exec nice -n 0 rpmbuild -bb --define '_smp_mflags -j9' --define '_make_opts -Otarget' --define '_pld_builder 1' --define '_topdir /tmp/B.SQHwiL' --define '_specdir %{_topdir}' --define '_sourcedir %{_specdir}' --define '_rpmdir %{_topdir}/RPMS' --define '_builddir %{_topdir}/BUILD' --target i686-pld-linux /tmp/B.SQHwiL/mysql-ruby.spec + : build-id: 6c26ffea-d0a7-45aa-b092-b5449094a1f1 + TMPDIR=/tmp/B.SQHwiL/BUILD/tmp + exec nice -n 0 rpmbuild -bb --define '_smp_mflags -j9' --define '_make_opts -Otarget' --define '_pld_builder 1' --define '_topdir /tmp/B.SQHwiL' --define '_specdir %{_topdir}' --define '_sourcedir %{_specdir}' --define '_rpmdir %{_topdir}/RPMS' --define '_builddir %{_topdir}/BUILD' --target i686-pld-linux /tmp/B.SQHwiL/mysql-ruby.spec Building target platforms: i686-pld-linux Executing(%prep): /bin/sh -e /tmp/B.SQHwiL/BUILD/tmp/rpm-tmp.52238 + umask 022 + cd /tmp/B.SQHwiL/BUILD + cd /tmp/B.SQHwiL/BUILD + rm -rf mysql-ruby-2.8.2 + /usr/bin/gzip -dc /tmp/B.SQHwiL/mysql-ruby-2.8.2.tar.gz + /bin/tar -xf - + STATUS=0 + '[' 0 -ne 0 ']' + cd mysql-ruby-2.8.2 + /bin/id -u + '[' 1001 '=' 0 ']' + /bin/id -u + '[' 1001 '=' 0 ']' + /bin/chmod -Rf a+rX,u+w,g-w,o-w . + echo 'Patch #0 (mysql-ruby-amd64.patch):' Patch #0 (mysql-ruby-amd64.patch): + '[' -f /tmp/B.SQHwiL/mysql-ruby-amd64.patch ']' + /bin/cat /tmp/B.SQHwiL/mysql-ruby-amd64.patch + /usr/bin/patch -s -p0 + echo 'Patch #1 (mysql-ruby-encoding.patch):' Patch #1 (mysql-ruby-encoding.patch): + '[' -f /tmp/B.SQHwiL/mysql-ruby-encoding.patch ']' + /bin/cat /tmp/B.SQHwiL/mysql-ruby-encoding.patch + /usr/bin/patch -s -p1 + echo 'Patch #2 (rbconfig-deprecation.patch):' Patch #2 (rbconfig-deprecation.patch): + '[' -f /tmp/B.SQHwiL/rbconfig-deprecation.patch ']' + /bin/cat /tmp/B.SQHwiL/rbconfig-deprecation.patch + /usr/bin/patch -s -p1 + find '(' -name '*~' -o -name '*.orig' ')' -print0 + xargs -0 -r -l512 rm -f + exit 0 Executing(%build): /bin/sh -e /tmp/B.SQHwiL/BUILD/tmp/rpm-tmp.52238 TMP=/home/users/builder/tmp HOME=/home/users/builder PATH=/home/users/builder/GNUstep/Tools:/usr/local/bin:/usr/bin:/bin:/home/users/builder/bin TMPDIR=/tmp/B.SQHwiL/BUILD/tmp + umask 022 + cd /tmp/B.SQHwiL/BUILD + cd mysql-ruby-2.8.2 + ruby extconf.rb --with-mysql-config checking for mysql_ssl_set()... yes checking for rb_str_set_len()... yes checking for rb_thread_start_timer()... no checking for mysql.h... yes creating Makefile + /usr/bin/make -Otarget -j9 'CC=i686-pld-linux-gcc' 'CFLAGS=-O2 -fwrapv -pipe -Wformat -Werror=format-security -gdwarf-4 -fno-debug-types-section -fvar-tracking-assignments -g2 -Wp,-D_FORTIFY_SOURCE=2 -fstack-protector-strong --param=ssp-buffer-size=4 -fomit-frame-pointer -march=i686 -fasynchronous-unwind-tables -mtune=pentium4 -gdwarf-4 -fno-debug-types-section -fvar-tracking-assignments -g2 -fPIC' i686-pld-linux-gcc -I. -I/usr/include/ruby-2.4 -I/usr/include/ruby-2.4/ruby/backward -I/usr/include/ruby-2.4 -I. -DHAVE_MYSQL_SSL_SET -DHAVE_RB_STR_SET_LEN -DHAVE_MYSQL_H -D_FILE_OFFSET_BITS=64 -I/usr/include/mysql -O2 -fwrapv -pipe -Wformat -Werror=format-security -gdwarf-4 -fno-debug-types-section -fvar-tracking-assignments -g2 -Wp,-D_FORTIFY_SOURCE=2 -fstack-protector-strong --param=ssp-buffer-size=4 -fomit-frame-pointer -march=i686 -fasynchronous-unwind-tables -mtune=pentium4 -gdwarf-4 -fno-debug-types-section -fvar-tracking-assignments -g2 -fPIC -o mysql.o -c mysql.c mysql.c: In function 'stmt_bind_result': mysql.c:1346:74: error: 'rb_cFixnum' undeclared (first use in this function); did you mean 'rb_isalnum'? else if (argv[i] == rb_cNumeric || argv[i] == rb_cInteger || argv[i] == rb_cFixnum) ^~~~~~~~~~ rb_isalnum mysql.c:1346:74: note: each undeclared identifier is reported only once for each function it appears in make: *** [Makefile:243: mysql.o] Error 1 error: Bad exit status from /tmp/B.SQHwiL/BUILD/tmp/rpm-tmp.52238 (%build) RPM build errors: Bad exit status from /tmp/B.SQHwiL/BUILD/tmp/rpm-tmp.52238 (%build) ended at: Sun Jun 3 09:43:16 2018, done in 0:00:01.435260 error: No files produced. + chmod -R u+rwX /tmp/B.SQHwiL/BUILD + rm -rf /tmp/B.SQHwiL/tmp /tmp/B.SQHwiL/BUILD + rm -rf /tmp/B.SQHwiL Begin-PLD-Builder-Info Build-Time: user:3.74s sys:0.31s real:5.62s (faults io:0 non-io:146083) End-PLD-Builder-Info
[Back to list of logs] [View rpm -qa of builder]