FailedOk

th/SRPMS[OK]
th/x32[OK]
th/i686[OK]
th/x86_64[OK]

ac/SRPMS[OK]
ac/i386[OK]
ac/i586[OK]
ac/i686[OK]
ac/alpha[OK]
ac/amd64[OK]
ac/athlon[OK]
ac/ppc[OK]
ac/sparc[OK]
ac/sparc64[OK]

Advanced Search
main()
Powered by PLD Linux
(c) 2002-2019 PLD Team
$Revision: 1.37 $
Powered by Real Operating System.
Your IP: 54.210.61.41

nomacs 82fd3e17-2a33-4089-9ca1-a44fc6b4e3d3

Status:Failed
Source URL:ftp://buildlogs.pld-linux.org/th/i686/FAIL/nomacs,82fd3e17-2a33-4089-9ca1-a44fc6b4e3d3.bz2
text/plain URL:View!
rpm -qa of builder:View!
Date:2019/02/10 12:00:05
Runtime:0:00:28.196990

Toc:

  • prep
  • Executing(%prep): /bin/sh -e /tmp/B.v1g57_/BUILD/tmp/rpm-tmp.64204
  • build
  • Executing(%build): /bin/sh -e /tmp/B.v1g57_/BUILD/tmp/rpm-tmp.26167
  • error 1
  • /tmp/B.v1g57_/BUILD/nomacs-3.4.1/ImageLounge/src/DkLoader/DkMetaData.cpp:1267:55: error: no matching function for call to 'Exiv2::BasicError<char>::BasicError(int, const char [29])'
  • error 2
  • make[2]: *** [CMakeFiles/nomacsLoader.dir/build.make:284: CMakeFiles/nomacsLoader.dir/src/DkLoader/DkMetaData.cpp.o] Error 1
  • error 3
  • make[1]: *** [CMakeFiles/Makefile2:154: CMakeFiles/nomacsLoader.dir/all] Error 2
  • error 4
  • error: Bad exit status from /tmp/B.v1g57_/BUILD/tmp/rpm-tmp.26167 (%build)
  • error 5
  • RPM build errors:
  • error 6
  • error: No files produced.

Content:

request from: baggins
checking if we should skip the build
started at: Sun Feb 10 11:59:31 2019
killing old processes on a builder
sending signal 9 to pid -1
Killed
cleaning up /tmp
fetching https://srcbuilder.pld-linux.org/th//srpms/82fd3e17-2a33-4089-9ca1-a44fc6b4e3d3/nomacs-3.4.1-4.src.rpm
fetched 29965110 bytes, 10410.8 K/s
installing srpm: nomacs-3.4.1-4.src.rpm
+ install -d /tmp/B.v1g57_/BUILD /tmp/B.v1g57_/RPMS
+ LC_ALL=en_US.UTF-8
+ rpm -qp --changelog nomacs-3.4.1-4.src.rpm
* Sun Feb 10 2019 PLD Linux Team <feedback@pld-linux.org>
- For complete changelog see: http://git.pld-linux.org/?p=packages/nomacs.git;a=log;h=master
* Sat Apr 28 2018 Jan Rękorajski <baggins@pld-linux.org> 2d410ba
- rebuild with opencv 3.4 - release 4 (by relup.sh) + rpm -Uhv --nodeps --define '_topdir /tmp/B.v1g57_' --define '_specdir %{_topdir}' --define '_sourcedir %{_specdir}' --define '_rpmdir %{_topdir}/RPMS' --define '_builddir %{_topdir}/BUILD' nomacs-3.4.1-4.src.rpm Preparing... ################################################## nomacs ################################################## + rm -f nomacs-3.4.1-4.src.rpm + install -m 700 -d /tmp/B.v1g57_/BUILD/tmp + TMPDIR=/tmp/B.v1g57_/BUILD/tmp + exec nice -n 0 rpmbuild -bp --short-circuit --nodeps --define '_topdir /tmp/B.v1g57_' --define '_specdir %{_topdir}' --define '_sourcedir %{_specdir}' --define '_rpmdir %{_topdir}/RPMS' --define '_builddir %{_topdir}/BUILD' --target i686-pld-linux --define 'prep exit 0' /tmp/B.v1g57_/nomacs.spec Building target platforms: i686-pld-linux checking BuildConflict-ing packages no BuildConflicts found checking BR rpm: Building target platforms: i686-pld-linux no BR needed building RPM using: set -ex; : build-id: 82fd3e17-2a33-4089-9ca1-a44fc6b4e3d3; TMPDIR=/tmp/B.v1g57_/BUILD/tmp exec nice -n 0 rpmbuild -bb --define '_smp_mflags -j9' --define '_make_opts -Otarget' --define '_pld_builder 1' --define '_topdir /tmp/B.v1g57_' --define '_specdir %{_topdir}' --define '_sourcedir %{_specdir}' --define '_rpmdir %{_topdir}/RPMS' --define '_builddir %{_topdir}/BUILD' --target i686-pld-linux /tmp/B.v1g57_/nomacs.spec + : build-id: 82fd3e17-2a33-4089-9ca1-a44fc6b4e3d3 + TMPDIR=/tmp/B.v1g57_/BUILD/tmp + exec nice -n 0 rpmbuild -bb --define '_smp_mflags -j9' --define '_make_opts -Otarget' --define '_pld_builder 1' --define '_topdir /tmp/B.v1g57_' --define '_specdir %{_topdir}' --define '_sourcedir %{_specdir}' --define '_rpmdir %{_topdir}/RPMS' --define '_builddir %{_topdir}/BUILD' --target i686-pld-linux /tmp/B.v1g57_/nomacs.spec Building target platforms: i686-pld-linux Executing(%prep): /bin/sh -e /tmp/B.v1g57_/BUILD/tmp/rpm-tmp.64204 + umask 022 + cd /tmp/B.v1g57_/BUILD + cd /tmp/B.v1g57_/BUILD + rm -rf nomacs-3.4.1 + /usr/bin/gzip -dc /tmp/B.v1g57_/nomacs-3.4.1-source.tar.gz + /bin/tar -xf - + STATUS=0 + '[' 0 -ne 0 ']' + cd nomacs-3.4.1 + /bin/id -u + '[' 1001 '=' 0 ']' + /bin/id -u + '[' 1001 '=' 0 ']' + /bin/chmod -Rf a+rX,u+w,g-w,o-w . + cd ImageLounge + echo 'Patch #0 (quazip-qt5.patch):' Patch #0 (quazip-qt5.patch): + '[' -f /tmp/B.v1g57_/quazip-qt5.patch ']' + /bin/cat /tmp/B.v1g57_/quazip-qt5.patch + /usr/bin/patch -s -p1 + echo 'Patch #1 (nomacs-libqpsd.patch):' Patch #1 (nomacs-libqpsd.patch): + '[' -f /tmp/B.v1g57_/nomacs-libqpsd.patch ']' + /bin/cat /tmp/B.v1g57_/nomacs-libqpsd.patch + /usr/bin/patch -s -p1 + dos2unix Readme/COPYRIGHT Readme/Exiv2-Update.md Readme/LICENSE.GPLv2 Readme/LICENSE.GPLv3 Readme/LICENSE.LGPL Readme/LICENSE.OPENCV Readme/README Readme/README.MacOSX Readme/WinCompileQt4.md Readme/WinCompileQt5.md Readme/nomacs.1 dos2unix: converting file Readme/COPYRIGHT to Unix format... dos2unix: converting file Readme/Exiv2-Update.md to Unix format... dos2unix: converting file Readme/LICENSE.GPLv2 to Unix format... dos2unix: converting file Readme/LICENSE.GPLv3 to Unix format... dos2unix: converting file Readme/LICENSE.LGPL to Unix format... dos2unix: converting file Readme/LICENSE.OPENCV to Unix format... dos2unix: converting file Readme/README to Unix format... dos2unix: converting file Readme/README.MacOSX to Unix format... dos2unix: converting file Readme/WinCompileQt4.md to Unix format... dos2unix: converting file Readme/WinCompileQt5.md to Unix format... dos2unix: converting file Readme/nomacs.1 to Unix format... + /bin/rm '--interactive=never' -r 3rdparty/libqpsd 3rdparty/quazip-0.7 + exit 0 Executing(%build): /bin/sh -e /tmp/B.v1g57_/BUILD/tmp/rpm-tmp.26167 TMP=/home/users/builder/tmp HOME=/home/users/builder PATH=/usr/local/bin:/usr/bin:/bin:/home/users/builder/bin TMPDIR=/tmp/B.v1g57_/BUILD/tmp + umask 022 + cd /tmp/B.v1g57_/BUILD + cd nomacs-3.4.1 + install -d build + cd build + CC=i686-pld-linux-gcc CXX=i686-pld-linux-g++ CPPFLAGS= /usr/bin/cmake '-DCMAKE_VERBOSE_MAKEFILE=ON' '-DCMAKE_BUILD_TYPE=PLD' '-DCMAKE_INSTALL_BINDIR:PATH=/usr/bin' '-DCMAKE_INSTALL_SBINDIR:PATH=/usr/sbin' '-DCMAKE_INSTALL_LIBEXECDIR:PATH=/usr/libexec' '-DCMAKE_INSTALL_SYSCONFDIR:PATH=/etc' '-DCMAKE_INSTALL_SHAREDSTATEDIRPATH:PATH=/var/lib' '-DCMAKE_INSTALL_LOCALSTATEDIRPATH:PATH=/var' '-DCMAKE_INSTALL_LIBDIR:PATH=/usr/lib' '-DCMAKE_INSTALL_INCLUDEDIR:PATH=/usr/include' '-DCMAKE_INSTALL_OLDINCLUDEDIR:PATH=/usr/include' '-DCMAKE_INSTALL_DATAROOTDIR:PATH=/usr/share' '-DCMAKE_INSTALL_DATADIR:PATH=/usr/share' '-DCMAKE_INSTALL_INFODIR:PATH=/usr/share/info' '-DCMAKE_INSTALL_LOCALEDIR:PATH=/usr/share/locale' '-DCMAKE_INSTALL_MANDIR:PATH=/usr/share/man' '-DCMAKE_INSTALL_DOCDIR:PATH=/usr/share/doc' '-DCMAKE_INSTALL_PREFIX:PATH=/usr' '-DSYSCONF_INSTALL_DIR:PATH=/etc' '-DCMAKE_CXX_FLAGS_PLD=-O2 -fwrapv -pipe -Wformat -Werror=format-security -gdwarf-4 -fno-debug-types-section -fvar-tracking-assignments -g2 -Wp,-D_FORTIFY_SOURCE=2 -fstack-protector-strong --param=ssp-buffer-size=4 -fomit-frame-pointer -march=i686 -fasynchronous-unwind-tables -mtune=pentium4 -gdwarf-4 -fno-debug-types-section -fvar-tracking-assignments -g2 -DNDEBUG -DQT_NO_DEBUG' '-DCMAKE_C_FLAGS_PLD=-O2 -fwrapv -pipe -Wformat -Werror=format-security -gdwarf-4 -fno-debug-types-section -fvar-tracking-assignments -g2 -Wp,-D_FORTIFY_SOURCE=2 -fstack-protector-strong --param=ssp-buffer-size=4 -fomit-frame-pointer -march=i686 -fasynchronous-unwind-tables -mtune=pentium4 -gdwarf-4 -fno-debug-types-section -fvar-tracking-assignments -g2 -DNDEBUG -DQT_NO_DEBUG' '-DCMAKE_Fortran_FLAGS_PLD=-O2 -fwrapv -pipe -Wformat -Werror=format-security -gdwarf-4 -fno-debug-types-section -fvar-tracking-assignments -g2 -Wp,-D_FORTIFY_SOURCE=2 -fstack-protector-strong --param=ssp-buffer-size=4 -fomit-frame-pointer -march=i686 -fasynchronous-unwind-tables -mtune=pentium4 -gdwarf-4 -fno-debug-types-section -fvar-tracking-assignments -g2 -DNDEBUG -DQT_NO_DEBUG' '-DCMAKE_EXE_LINKER_FLAGS_PLD=-Wl,--as-needed -Wl,--no-copy-dt-needed-entries -Wl,-z,relro -Wl,-z,combreloc ' '-DCMAKE_SHARED_LINKER_FLAGS_PLD=-Wl,--as-needed -Wl,--no-copy-dt-needed-entries -Wl,-z,relro -Wl,-z,combreloc ' '-DCMAKE_MODULE_LINKER_FLAGS_PLD=-Wl,--as-needed -Wl,--no-copy-dt-needed-entries -Wl,-z,relro -Wl,-z,combreloc ' '-DBUILD_SHARED_LIBS:BOOL=ON' ../ImageLounge '-DENABLE_PLUGINS=ON' '-DENABLE_RAW=1' '-DUSE_SYSTEM_LIBQPSD=ON' '-DUSE_SYSTEM_QUAZIP=ON' '-DUSE_SYSTEM_WEBP=ON' -- The C compiler identification is GNU 8.2.0 -- The CXX compiler identification is GNU 8.2.0 -- Check for working C compiler: /usr/bin/i686-pld-linux-gcc -- Check for working C compiler: /usr/bin/i686-pld-linux-gcc -- works -- Detecting C compiler ABI info -- Detecting C compiler ABI info - done -- Detecting C compile features -- Detecting C compile features - done -- Check for working CXX compiler: /usr/bin/i686-pld-linux-g++ -- Check for working CXX compiler: /usr/bin/i686-pld-linux-g++ -- works -- Detecting CXX compiler ABI info -- Detecting CXX compiler ABI info - done -- Detecting CXX compile features -- Detecting CXX compile features - done -- QuaZip enabled -- Performing Test COMPILER_SUPPORTS_CXX11 -- Performing Test COMPILER_SUPPORTS_CXX11 - Success -- Performing Test COMPILER_SUPPORTS_CXX0X -- Performing Test COMPILER_SUPPORTS_CXX0X - Success -- QMake found: /usr/bin/qmake -- A release build (non-debug). Debugging outputs are silently ignored. -- Found PkgConfig: /usr/bin/pkg-config (found version "0.29.2") -- Checking for module 'exiv2>=0.20' -- Found exiv2, version 0.27.0 -- exiv2 version by pkg-config: 0.27.0 -- exiv2 contains exiv2.hpp, using it -- Found OpenCV: /usr (found version "3.4.1") found components: core imgproc -- Checking for module 'libraw>=0.12.0' -- Found libraw, version 0.18.13 -- Found TIFF: /usr/lib/libtiff.so (found version "4.0.10") -- Found QUAZIP: /usr/include -- Found QPSD: /usr/include/qt5 -- opencv libs: opencv_core;opencv_imgproc CMake Warning at CMakeLists.txt:217 (message): plugins directory not found, not building plugins. You have to check out the nomacs-plugins git to the 'plugins' folder if you want to build them -- Configuring done CMake Warning (dev) at cmake/UnixBuildTarget.cmake:45 (add_dependencies): Policy CMP0046 is not set: Error on non-existent dependency in add_dependencies. Run "cmake --help-policy CMP0046" for policy details. Use the cmake_policy command to set the policy and suppress this warning. The dependency target "/usr/lib/libqpsd5.so" of target "nomacs" does not exist. Call Stack (most recent call first): CMakeLists.txt:194 (include) This warning is for project developers. Use -Wno-dev to suppress it. CMake Warning (dev) in CMakeLists.txt: Policy CMP0046 is not set: Error on non-existent dependency in add_dependencies. Run "cmake --help-policy CMP0046" for policy details. Use the cmake_policy command to set the policy and suppress this warning. The dependency target "/usr/lib/libqpsd5.so" of target "nomacs_autogen" does not exist. This warning is for project developers. Use -Wno-dev to suppress it. -- Generating done CMake Warning: Manually-specified variables were not used by the project: CMAKE_Fortran_FLAGS_PLD CMAKE_INSTALL_BINDIR CMAKE_INSTALL_DATADIR CMAKE_INSTALL_DATAROOTDIR CMAKE_INSTALL_DOCDIR CMAKE_INSTALL_INCLUDEDIR CMAKE_INSTALL_INFODIR CMAKE_INSTALL_LIBDIR CMAKE_INSTALL_LIBEXECDIR CMAKE_INSTALL_LOCALEDIR CMAKE_INSTALL_LOCALSTATEDIRPATH CMAKE_INSTALL_MANDIR CMAKE_INSTALL_OLDINCLUDEDIR CMAKE_INSTALL_SBINDIR CMAKE_INSTALL_SHAREDSTATEDIRPATH CMAKE_INSTALL_SYSCONFDIR SYSCONF_INSTALL_DIR USE_SYSTEM_WEBP -- Build files have been written to: /tmp/B.v1g57_/BUILD/nomacs-3.4.1/build + /usr/bin/make -Otarget -j9 /usr/bin/cmake -S/tmp/B.v1g57_/BUILD/nomacs-3.4.1/ImageLounge -B/tmp/B.v1g57_/BUILD/nomacs-3.4.1/build --check-build-system CMakeFiles/Makefile.cmake 0 /usr/bin/cmake -E cmake_progress_start /tmp/B.v1g57_/BUILD/nomacs-3.4.1/build/CMakeFiles /tmp/B.v1g57_/BUILD/nomacs-3.4.1/build/CMakeFiles/progress.marks /usr/bin/make -f CMakeFiles/Makefile2 all /usr/bin/make -f CMakeFiles/nomacsCore_autogen.dir/build.make CMakeFiles/nomacsCore_autogen.dir/depend make[2]: Entering directory '/tmp/B.v1g57_/BUILD/nomacs-3.4.1/build' cd /tmp/B.v1g57_/BUILD/nomacs-3.4.1/build && /usr/bin/cmake -E cmake_depends "Unix Makefiles" /tmp/B.v1g57_/BUILD/nomacs-3.4.1/ImageLounge /tmp/B.v1g57_/BUILD/nomacs-3.4.1/ImageLounge /tmp/B.v1g57_/BUILD/nomacs-3.4.1/build /tmp/B.v1g57_/BUILD/nomacs-3.4.1/build /tmp/B.v1g57_/BUILD/nomacs-3.4.1/build/CMakeFiles/nomacsCore_autogen.dir/DependInfo.cmake --color= Scanning dependencies of target nomacsCore_autogen make[2]: Leaving directory '/tmp/B.v1g57_/BUILD/nomacs-3.4.1/build' /usr/bin/make -f CMakeFiles/nomacsCore_autogen.dir/build.make CMakeFiles/nomacsCore_autogen.dir/build make[2]: Entering directory '/tmp/B.v1g57_/BUILD/nomacs-3.4.1/build' [ 1%] Automatic MOC for target nomacsCore /usr/bin/cmake -E cmake_autogen /tmp/B.v1g57_/BUILD/nomacs-3.4.1/build/CMakeFiles/nomacsCore_autogen.dir/AutogenInfo.cmake PLD make[2]: Leaving directory '/tmp/B.v1g57_/BUILD/nomacs-3.4.1/build' make[1]: Entering directory '/tmp/B.v1g57_/BUILD/nomacs-3.4.1/build' [ 1%] Built target nomacsCore_autogen make[1]: Leaving directory '/tmp/B.v1g57_/BUILD/nomacs-3.4.1/build' /usr/bin/make -f CMakeFiles/nomacsCore.dir/build.make CMakeFiles/nomacsCore.dir/depend make[2]: Entering directory '/tmp/B.v1g57_/BUILD/nomacs-3.4.1/build' [ 2%] Generating qrc_nomacs.cpp /usr/lib/qt5/bin/rcc --name nomacs --output /tmp/B.v1g57_/BUILD/nomacs-3.4.1/build/qrc_nomacs.cpp /tmp/B.v1g57_/BUILD/nomacs-3.4.1/ImageLounge/src/nomacs.qrc make[2]: Leaving directory '/tmp/B.v1g57_/BUILD/nomacs-3.4.1/build' make[2]: Entering directory '/tmp/B.v1g57_/BUILD/nomacs-3.4.1/build' cd /tmp/B.v1g57_/BUILD/nomacs-3.4.1/build && /usr/bin/cmake -E cmake_depends "Unix Makefiles" /tmp/B.v1g57_/BUILD/nomacs-3.4.1/ImageLounge /tmp/B.v1g57_/BUILD/nomacs-3.4.1/ImageLounge /tmp/B.v1g57_/BUILD/nomacs-3.4.1/build /tmp/B.v1g57_/BUILD/nomacs-3.4.1/build /tmp/B.v1g57_/BUILD/nomacs-3.4.1/build/CMakeFiles/nomacsCore.dir/DependInfo.cmake --color= Scanning dependencies of target nomacsCore make[2]: Leaving directory '/tmp/B.v1g57_/BUILD/nomacs-3.4.1/build' /usr/bin/make -f CMakeFiles/nomacsCore.dir/build.make CMakeFiles/nomacsCore.dir/build make[2]: Entering directory '/tmp/B.v1g57_/BUILD/nomacs-3.4.1/build' [ 9%] Building CXX object CMakeFiles/nomacsCore.dir/qrc_nomacs.cpp.o /usr/bin/i686-pld-linux-g++ -DHAVE_EXIV2_HPP -DNOMACS_VERSION=\"3.4\" -DQT5 -DQT_CONCURRENT_LIB -DQT_CORE_LIB -DQT_GUI_LIB -DQT_NETWORK_LIB -DQT_NO_DEBUG -DQT_NO_DEBUG_OUTPUT -DQT_PRINTSUPPORT_LIB -DQT_SVG_LIB -DQT_WIDGETS_LIB -DWITH_LIBRAW -DWITH_LIBTIFF -DWITH_OPENCV -DWITH_PLUGINS -DWITH_QUAZIP -DnomacsCore_EXPORTS -I/tmp/B.v1g57_/BUILD/nomacs-3.4.1/build -I/tmp/B.v1g57_/BUILD/nomacs-3.4.1/ImageLounge -I/tmp/B.v1g57_/BUILD/nomacs-3.4.1/build/nomacsCore_autogen/include -I/usr/include/libraw -I/tmp/B.v1g57_/BUILD/nomacs-3.4.1/ImageLounge/src -I/tmp/B.v1g57_/BUILD/nomacs-3.4.1/ImageLounge/src/DkCore -I/tmp/B.v1g57_/BUILD/nomacs-3.4.1/ImageLounge/src/DkLoader -I/tmp/B.v1g57_/BUILD/nomacs-3.4.1/ImageLounge/src/DkGui -isystem /usr/include/qt5 -isystem /usr/include/qt5/QtWidgets -isystem /usr/include/qt5/QtGui -isystem /usr/include/qt5/QtCore -isystem /usr/lib/qt5/./mkspecs/linux-g++ -isystem /usr/include/qt5/QtNetwork -isystem /usr/include/qt5/QtPrintSupport -isystem /usr/include/qt5/QtConcurrent -isystem /usr/include/qt5/QtSvg -isystem /usr/include/opencv -std=c++11 -Wno-unknown-pragmas -O2 -fwrapv -pipe -Wformat -Werror=format-security -gdwarf-4 -fno-debug-types-section -fvar-tracking-assignments -g2 -Wp,-D_FORTIFY_SOURCE=2 -fstack-protector-strong --param=ssp-buffer-size=4 -fomit-frame-pointer -march=i686 -fasynchronous-unwind-tables -mtune=pentium4 -gdwarf-4 -fno-debug-types-section -fvar-tracking-assignments -g2 -DNDEBUG -DQT_NO_DEBUG -fPIC -DDK_CORE_DLL_EXPORT -DNOMINMAX -fPIC -std=gnu++11 -o CMakeFiles/nomacsCore.dir/qrc_nomacs.cpp.o -c /tmp/B.v1g57_/BUILD/nomacs-3.4.1/build/qrc_nomacs.cpp make[2]: Leaving directory '/tmp/B.v1g57_/BUILD/nomacs-3.4.1/build' make[2]: Entering directory '/tmp/B.v1g57_/BUILD/nomacs-3.4.1/build' [ 10%] Building CXX object CMakeFiles/nomacsCore.dir/nomacsCore_autogen/mocs_compilation.cpp.o /usr/bin/i686-pld-linux-g++ -DHAVE_EXIV2_HPP -DNOMACS_VERSION=\"3.4\" -DQT5 -DQT_CONCURRENT_LIB -DQT_CORE_LIB -DQT_GUI_LIB -DQT_NETWORK_LIB -DQT_NO_DEBUG -DQT_NO_DEBUG_OUTPUT -DQT_PRINTSUPPORT_LIB -DQT_SVG_LIB -DQT_WIDGETS_LIB -DWITH_LIBRAW -DWITH_LIBTIFF -DWITH_OPENCV -DWITH_PLUGINS -DWITH_QUAZIP -DnomacsCore_EXPORTS -I/tmp/B.v1g57_/BUILD/nomacs-3.4.1/build -I/tmp/B.v1g57_/BUILD/nomacs-3.4.1/ImageLounge -I/tmp/B.v1g57_/BUILD/nomacs-3.4.1/build/nomacsCore_autogen/include -I/usr/include/libraw -I/tmp/B.v1g57_/BUILD/nomacs-3.4.1/ImageLounge/src -I/tmp/B.v1g57_/BUILD/nomacs-3.4.1/ImageLounge/src/DkCore -I/tmp/B.v1g57_/BUILD/nomacs-3.4.1/ImageLounge/src/DkLoader -I/tmp/B.v1g57_/BUILD/nomacs-3.4.1/ImageLounge/src/DkGui -isystem /usr/include/qt5 -isystem /usr/include/qt5/QtWidgets -isystem /usr/include/qt5/QtGui -isystem /usr/include/qt5/QtCore -isystem /usr/lib/qt5/./mkspecs/linux-g++ -isystem /usr/include/qt5/QtNetwork -isystem /usr/include/qt5/QtPrintSupport -isystem /usr/include/qt5/QtConcurrent -isystem /usr/include/qt5/QtSvg -isystem /usr/include/opencv -std=c++11 -Wno-unknown-pragmas -O2 -fwrapv -pipe -Wformat -Werror=format-security -gdwarf-4 -fno-debug-types-section -fvar-tracking-assignments -g2 -Wp,-D_FORTIFY_SOURCE=2 -fstack-protector-strong --param=ssp-buffer-size=4 -fomit-frame-pointer -march=i686 -fasynchronous-unwind-tables -mtune=pentium4 -gdwarf-4 -fno-debug-types-section -fvar-tracking-assignments -g2 -DNDEBUG -DQT_NO_DEBUG -fPIC -DDK_CORE_DLL_EXPORT -DNOMINMAX -fPIC -std=gnu++11 -o CMakeFiles/nomacsCore.dir/nomacsCore_autogen/mocs_compilation.cpp.o -c /tmp/B.v1g57_/BUILD/nomacs-3.4.1/build/nomacsCore_autogen/mocs_compilation.cpp make[2]: Leaving directory '/tmp/B.v1g57_/BUILD/nomacs-3.4.1/build' make[2]: Entering directory '/tmp/B.v1g57_/BUILD/nomacs-3.4.1/build' [ 5%] Building CXX object CMakeFiles/nomacsCore.dir/src/DkCore/DkTimer.cpp.o /usr/bin/i686-pld-linux-g++ -DHAVE_EXIV2_HPP -DNOMACS_VERSION=\"3.4\" -DQT5 -DQT_CONCURRENT_LIB -DQT_CORE_LIB -DQT_GUI_LIB -DQT_NETWORK_LIB -DQT_NO_DEBUG -DQT_NO_DEBUG_OUTPUT -DQT_PRINTSUPPORT_LIB -DQT_SVG_LIB -DQT_WIDGETS_LIB -DWITH_LIBRAW -DWITH_LIBTIFF -DWITH_OPENCV -DWITH_PLUGINS -DWITH_QUAZIP -DnomacsCore_EXPORTS -I/tmp/B.v1g57_/BUILD/nomacs-3.4.1/build -I/tmp/B.v1g57_/BUILD/nomacs-3.4.1/ImageLounge -I/tmp/B.v1g57_/BUILD/nomacs-3.4.1/build/nomacsCore_autogen/include -I/usr/include/libraw -I/tmp/B.v1g57_/BUILD/nomacs-3.4.1/ImageLounge/src -I/tmp/B.v1g57_/BUILD/nomacs-3.4.1/ImageLounge/src/DkCore -I/tmp/B.v1g57_/BUILD/nomacs-3.4.1/ImageLounge/src/DkLoader -I/tmp/B.v1g57_/BUILD/nomacs-3.4.1/ImageLounge/src/DkGui -isystem /usr/include/qt5 -isystem /usr/include/qt5/QtWidgets -isystem /usr/include/qt5/QtGui -isystem /usr/include/qt5/QtCore -isystem /usr/lib/qt5/./mkspecs/linux-g++ -isystem /usr/include/qt5/QtNetwork -isystem /usr/include/qt5/QtPrintSupport -isystem /usr/include/qt5/QtConcurrent -isystem /usr/include/qt5/QtSvg -isystem /usr/include/opencv -std=c++11 -Wno-unknown-pragmas -O2 -fwrapv -pipe -Wformat -Werror=format-security -gdwarf-4 -fno-debug-types-section -fvar-tracking-assignments -g2 -Wp,-D_FORTIFY_SOURCE=2 -fstack-protector-strong --param=ssp-buffer-size=4 -fomit-frame-pointer -march=i686 -fasynchronous-unwind-tables -mtune=pentium4 -gdwarf-4 -fno-debug-types-section -fvar-tracking-assignments -g2 -DNDEBUG -DQT_NO_DEBUG -fPIC -DDK_CORE_DLL_EXPORT -DNOMINMAX -fPIC -std=gnu++11 -o CMakeFiles/nomacsCore.dir/src/DkCore/DkTimer.cpp.o -c /tmp/B.v1g57_/BUILD/nomacs-3.4.1/ImageLounge/src/DkCore/DkTimer.cpp make[2]: Leaving directory '/tmp/B.v1g57_/BUILD/nomacs-3.4.1/build' make[2]: Entering directory '/tmp/B.v1g57_/BUILD/nomacs-3.4.1/build' [ 4%] Building CXX object CMakeFiles/nomacsCore.dir/src/DkCore/DkMath.cpp.o /usr/bin/i686-pld-linux-g++ -DHAVE_EXIV2_HPP -DNOMACS_VERSION=\"3.4\" -DQT5 -DQT_CONCURRENT_LIB -DQT_CORE_LIB -DQT_GUI_LIB -DQT_NETWORK_LIB -DQT_NO_DEBUG -DQT_NO_DEBUG_OUTPUT -DQT_PRINTSUPPORT_LIB -DQT_SVG_LIB -DQT_WIDGETS_LIB -DWITH_LIBRAW -DWITH_LIBTIFF -DWITH_OPENCV -DWITH_PLUGINS -DWITH_QUAZIP -DnomacsCore_EXPORTS -I/tmp/B.v1g57_/BUILD/nomacs-3.4.1/build -I/tmp/B.v1g57_/BUILD/nomacs-3.4.1/ImageLounge -I/tmp/B.v1g57_/BUILD/nomacs-3.4.1/build/nomacsCore_autogen/include -I/usr/include/libraw -I/tmp/B.v1g57_/BUILD/nomacs-3.4.1/ImageLounge/src -I/tmp/B.v1g57_/BUILD/nomacs-3.4.1/ImageLounge/src/DkCore -I/tmp/B.v1g57_/BUILD/nomacs-3.4.1/ImageLounge/src/DkLoader -I/tmp/B.v1g57_/BUILD/nomacs-3.4.1/ImageLounge/src/DkGui -isystem /usr/include/qt5 -isystem /usr/include/qt5/QtWidgets -isystem /usr/include/qt5/QtGui -isystem /usr/include/qt5/QtCore -isystem /usr/lib/qt5/./mkspecs/linux-g++ -isystem /usr/include/qt5/QtNetwork -isystem /usr/include/qt5/QtPrintSupport -isystem /usr/include/qt5/QtConcurrent -isystem /usr/include/qt5/QtSvg -isystem /usr/include/opencv -std=c++11 -Wno-unknown-pragmas -O2 -fwrapv -pipe -Wformat -Werror=format-security -gdwarf-4 -fno-debug-types-section -fvar-tracking-assignments -g2 -Wp,-D_FORTIFY_SOURCE=2 -fstack-protector-strong --param=ssp-buffer-size=4 -fomit-frame-pointer -march=i686 -fasynchronous-unwind-tables -mtune=pentium4 -gdwarf-4 -fno-debug-types-section -fvar-tracking-assignments -g2 -DNDEBUG -DQT_NO_DEBUG -fPIC -DDK_CORE_DLL_EXPORT -DNOMINMAX -fPIC -std=gnu++11 -o CMakeFiles/nomacsCore.dir/src/DkCore/DkMath.cpp.o -c /tmp/B.v1g57_/BUILD/nomacs-3.4.1/ImageLounge/src/DkCore/DkMath.cpp make[2]: Leaving directory '/tmp/B.v1g57_/BUILD/nomacs-3.4.1/build' make[2]: Entering directory '/tmp/B.v1g57_/BUILD/nomacs-3.4.1/build' [ 7%] Building CXX object CMakeFiles/nomacsCore.dir/src/DkCore/DkUpdater.cpp.o /usr/bin/i686-pld-linux-g++ -DHAVE_EXIV2_HPP -DNOMACS_VERSION=\"3.4\" -DQT5 -DQT_CONCURRENT_LIB -DQT_CORE_LIB -DQT_GUI_LIB -DQT_NETWORK_LIB -DQT_NO_DEBUG -DQT_NO_DEBUG_OUTPUT -DQT_PRINTSUPPORT_LIB -DQT_SVG_LIB -DQT_WIDGETS_LIB -DWITH_LIBRAW -DWITH_LIBTIFF -DWITH_OPENCV -DWITH_PLUGINS -DWITH_QUAZIP -DnomacsCore_EXPORTS -I/tmp/B.v1g57_/BUILD/nomacs-3.4.1/build -I/tmp/B.v1g57_/BUILD/nomacs-3.4.1/ImageLounge -I/tmp/B.v1g57_/BUILD/nomacs-3.4.1/build/nomacsCore_autogen/include -I/usr/include/libraw -I/tmp/B.v1g57_/BUILD/nomacs-3.4.1/ImageLounge/src -I/tmp/B.v1g57_/BUILD/nomacs-3.4.1/ImageLounge/src/DkCore -I/tmp/B.v1g57_/BUILD/nomacs-3.4.1/ImageLounge/src/DkLoader -I/tmp/B.v1g57_/BUILD/nomacs-3.4.1/ImageLounge/src/DkGui -isystem /usr/include/qt5 -isystem /usr/include/qt5/QtWidgets -isystem /usr/include/qt5/QtGui -isystem /usr/include/qt5/QtCore -isystem /usr/lib/qt5/./mkspecs/linux-g++ -isystem /usr/include/qt5/QtNetwork -isystem /usr/include/qt5/QtPrintSupport -isystem /usr/include/qt5/QtConcurrent -isystem /usr/include/qt5/QtSvg -isystem /usr/include/opencv -std=c++11 -Wno-unknown-pragmas -O2 -fwrapv -pipe -Wformat -Werror=format-security -gdwarf-4 -fno-debug-types-section -fvar-tracking-assignments -g2 -Wp,-D_FORTIFY_SOURCE=2 -fstack-protector-strong --param=ssp-buffer-size=4 -fomit-frame-pointer -march=i686 -fasynchronous-unwind-tables -mtune=pentium4 -gdwarf-4 -fno-debug-types-section -fvar-tracking-assignments -g2 -DNDEBUG -DQT_NO_DEBUG -fPIC -DDK_CORE_DLL_EXPORT -DNOMINMAX -fPIC -std=gnu++11 -o CMakeFiles/nomacsCore.dir/src/DkCore/DkUpdater.cpp.o -c /tmp/B.v1g57_/BUILD/nomacs-3.4.1/ImageLounge/src/DkCore/DkUpdater.cpp make[2]: Leaving directory '/tmp/B.v1g57_/BUILD/nomacs-3.4.1/build' make[2]: Entering directory '/tmp/B.v1g57_/BUILD/nomacs-3.4.1/build' [ 8%] Building CXX object CMakeFiles/nomacsCore.dir/src/DkCore/DkUtils.cpp.o /usr/bin/i686-pld-linux-g++ -DHAVE_EXIV2_HPP -DNOMACS_VERSION=\"3.4\" -DQT5 -DQT_CONCURRENT_LIB -DQT_CORE_LIB -DQT_GUI_LIB -DQT_NETWORK_LIB -DQT_NO_DEBUG -DQT_NO_DEBUG_OUTPUT -DQT_PRINTSUPPORT_LIB -DQT_SVG_LIB -DQT_WIDGETS_LIB -DWITH_LIBRAW -DWITH_LIBTIFF -DWITH_OPENCV -DWITH_PLUGINS -DWITH_QUAZIP -DnomacsCore_EXPORTS -I/tmp/B.v1g57_/BUILD/nomacs-3.4.1/build -I/tmp/B.v1g57_/BUILD/nomacs-3.4.1/ImageLounge -I/tmp/B.v1g57_/BUILD/nomacs-3.4.1/build/nomacsCore_autogen/include -I/usr/include/libraw -I/tmp/B.v1g57_/BUILD/nomacs-3.4.1/ImageLounge/src -I/tmp/B.v1g57_/BUILD/nomacs-3.4.1/ImageLounge/src/DkCore -I/tmp/B.v1g57_/BUILD/nomacs-3.4.1/ImageLounge/src/DkLoader -I/tmp/B.v1g57_/BUILD/nomacs-3.4.1/ImageLounge/src/DkGui -isystem /usr/include/qt5 -isystem /usr/include/qt5/QtWidgets -isystem /usr/include/qt5/QtGui -isystem /usr/include/qt5/QtCore -isystem /usr/lib/qt5/./mkspecs/linux-g++ -isystem /usr/include/qt5/QtNetwork -isystem /usr/include/qt5/QtPrintSupport -isystem /usr/include/qt5/QtConcurrent -isystem /usr/include/qt5/QtSvg -isystem /usr/include/opencv -std=c++11 -Wno-unknown-pragmas -O2 -fwrapv -pipe -Wformat -Werror=format-security -gdwarf-4 -fno-debug-types-section -fvar-tracking-assignments -g2 -Wp,-D_FORTIFY_SOURCE=2 -fstack-protector-strong --param=ssp-buffer-size=4 -fomit-frame-pointer -march=i686 -fasynchronous-unwind-tables -mtune=pentium4 -gdwarf-4 -fno-debug-types-section -fvar-tracking-assignments -g2 -DNDEBUG -DQT_NO_DEBUG -fPIC -DDK_CORE_DLL_EXPORT -DNOMINMAX -fPIC -std=gnu++11 -o CMakeFiles/nomacsCore.dir/src/DkCore/DkUtils.cpp.o -c /tmp/B.v1g57_/BUILD/nomacs-3.4.1/ImageLounge/src/DkCore/DkUtils.cpp make[2]: Leaving directory '/tmp/B.v1g57_/BUILD/nomacs-3.4.1/build' make[2]: Entering directory '/tmp/B.v1g57_/BUILD/nomacs-3.4.1/build' [ 4%] Building CXX object CMakeFiles/nomacsCore.dir/src/DkCore/DkSettings.cpp.o /usr/bin/i686-pld-linux-g++ -DHAVE_EXIV2_HPP -DNOMACS_VERSION=\"3.4\" -DQT5 -DQT_CONCURRENT_LIB -DQT_CORE_LIB -DQT_GUI_LIB -DQT_NETWORK_LIB -DQT_NO_DEBUG -DQT_NO_DEBUG_OUTPUT -DQT_PRINTSUPPORT_LIB -DQT_SVG_LIB -DQT_WIDGETS_LIB -DWITH_LIBRAW -DWITH_LIBTIFF -DWITH_OPENCV -DWITH_PLUGINS -DWITH_QUAZIP -DnomacsCore_EXPORTS -I/tmp/B.v1g57_/BUILD/nomacs-3.4.1/build -I/tmp/B.v1g57_/BUILD/nomacs-3.4.1/ImageLounge -I/tmp/B.v1g57_/BUILD/nomacs-3.4.1/build/nomacsCore_autogen/include -I/usr/include/libraw -I/tmp/B.v1g57_/BUILD/nomacs-3.4.1/ImageLounge/src -I/tmp/B.v1g57_/BUILD/nomacs-3.4.1/ImageLounge/src/DkCore -I/tmp/B.v1g57_/BUILD/nomacs-3.4.1/ImageLounge/src/DkLoader -I/tmp/B.v1g57_/BUILD/nomacs-3.4.1/ImageLounge/src/DkGui -isystem /usr/include/qt5 -isystem /usr/include/qt5/QtWidgets -isystem /usr/include/qt5/QtGui -isystem /usr/include/qt5/QtCore -isystem /usr/lib/qt5/./mkspecs/linux-g++ -isystem /usr/include/qt5/QtNetwork -isystem /usr/include/qt5/QtPrintSupport -isystem /usr/include/qt5/QtConcurrent -isystem /usr/include/qt5/QtSvg -isystem /usr/include/opencv -std=c++11 -Wno-unknown-pragmas -O2 -fwrapv -pipe -Wformat -Werror=format-security -gdwarf-4 -fno-debug-types-section -fvar-tracking-assignments -g2 -Wp,-D_FORTIFY_SOURCE=2 -fstack-protector-strong --param=ssp-buffer-size=4 -fomit-frame-pointer -march=i686 -fasynchronous-unwind-tables -mtune=pentium4 -gdwarf-4 -fno-debug-types-section -fvar-tracking-assignments -g2 -DNDEBUG -DQT_NO_DEBUG -fPIC -DDK_CORE_DLL_EXPORT -DNOMINMAX -fPIC -std=gnu++11 -o CMakeFiles/nomacsCore.dir/src/DkCore/DkSettings.cpp.o -c /tmp/B.v1g57_/BUILD/nomacs-3.4.1/ImageLounge/src/DkCore/DkSettings.cpp make[2]: Leaving directory '/tmp/B.v1g57_/BUILD/nomacs-3.4.1/build' make[2]: Entering directory '/tmp/B.v1g57_/BUILD/nomacs-3.4.1/build' [ 11%] Linking CXX shared library libnomacsCore.so /usr/bin/cmake -E cmake_link_script CMakeFiles/nomacsCore.dir/link.txt --verbose=1 /usr/bin/i686-pld-linux-g++ -fPIC -std=c++11 -Wno-unknown-pragmas -O2 -fwrapv -pipe -Wformat -Werror=format-security -gdwarf-4 -fno-debug-types-section -fvar-tracking-assignments -g2 -Wp,-D_FORTIFY_SOURCE=2 -fstack-protector-strong --param=ssp-buffer-size=4 -fomit-frame-pointer -march=i686 -fasynchronous-unwind-tables -mtune=pentium4 -gdwarf-4 -fno-debug-types-section -fvar-tracking-assignments -g2 -DNDEBUG -DQT_NO_DEBUG -Wl,--as-needed -Wl,--no-copy-dt-needed-entries -Wl,-z,relro -Wl,-z,combreloc -shared -Wl,-soname,libnomacsCore.so.3 -o libnomacsCore.so.3.4.0 CMakeFiles/nomacsCore.dir/src/DkCore/DkMath.cpp.o CMakeFiles/nomacsCore.dir/src/DkCore/DkSettings.cpp.o CMakeFiles/nomacsCore.dir/src/DkCore/DkTimer.cpp.o CMakeFiles/nomacsCore.dir/src/DkCore/DkUpdater.cpp.o CMakeFiles/nomacsCore.dir/src/DkCore/DkUtils.cpp.o CMakeFiles/nomacsCore.dir/qrc_nomacs.cpp.o CMakeFiles/nomacsCore.dir/nomacsCore_autogen/mocs_compilation.cpp.o -L/tmp/B.v1g57_/BUILD/nomacs-3.4.1/build -Wl,-rpath,/tmp/B.v1g57_/BUILD/nomacs-3.4.1/build: /usr/lib/libopencv_imgproc.so.3.4.1 /usr/lib/libQt5Network.so.5.11.1 /usr/lib/libQt5PrintSupport.so.5.11.1 /usr/lib/libQt5Concurrent.so.5.11.1 /usr/lib/libQt5Svg.so.5.11.1 /usr/lib/libopencv_core.so.3.4.1 /usr/lib/libQt5Widgets.so.5.11.1 /usr/lib/libQt5Gui.so.5.11.1 /usr/lib/libQt5Core.so.5.11.1 /usr/bin/cmake -E cmake_symlink_library libnomacsCore.so.3.4.0 libnomacsCore.so.3 libnomacsCore.so make[2]: Leaving directory '/tmp/B.v1g57_/BUILD/nomacs-3.4.1/build' make[1]: Entering directory '/tmp/B.v1g57_/BUILD/nomacs-3.4.1/build' [ 11%] Built target nomacsCore make[1]: Leaving directory '/tmp/B.v1g57_/BUILD/nomacs-3.4.1/build' /usr/bin/make -f CMakeFiles/nomacsLoader_autogen.dir/build.make CMakeFiles/nomacsLoader_autogen.dir/depend make[2]: Entering directory '/tmp/B.v1g57_/BUILD/nomacs-3.4.1/build' cd /tmp/B.v1g57_/BUILD/nomacs-3.4.1/build && /usr/bin/cmake -E cmake_depends "Unix Makefiles" /tmp/B.v1g57_/BUILD/nomacs-3.4.1/ImageLounge /tmp/B.v1g57_/BUILD/nomacs-3.4.1/ImageLounge /tmp/B.v1g57_/BUILD/nomacs-3.4.1/build /tmp/B.v1g57_/BUILD/nomacs-3.4.1/build /tmp/B.v1g57_/BUILD/nomacs-3.4.1/build/CMakeFiles/nomacsLoader_autogen.dir/DependInfo.cmake --color= Scanning dependencies of target nomacsLoader_autogen make[2]: Leaving directory '/tmp/B.v1g57_/BUILD/nomacs-3.4.1/build' /usr/bin/make -f CMakeFiles/nomacsLoader_autogen.dir/build.make CMakeFiles/nomacsLoader_autogen.dir/build make[2]: Entering directory '/tmp/B.v1g57_/BUILD/nomacs-3.4.1/build' [ 13%] Automatic MOC for target nomacsLoader /usr/bin/cmake -E cmake_autogen /tmp/B.v1g57_/BUILD/nomacs-3.4.1/build/CMakeFiles/nomacsLoader_autogen.dir/AutogenInfo.cmake PLD AutoMoc: /tmp/B.v1g57_/BUILD/nomacs-3.4.1/ImageLounge/src/DkLoader/DkUpnp.h:0: Note: No relevant classes found. No output generated. make[2]: Leaving directory '/tmp/B.v1g57_/BUILD/nomacs-3.4.1/build' make[1]: Entering directory '/tmp/B.v1g57_/BUILD/nomacs-3.4.1/build' [ 13%] Built target nomacsLoader_autogen make[1]: Leaving directory '/tmp/B.v1g57_/BUILD/nomacs-3.4.1/build' /usr/bin/make -f CMakeFiles/nomacsLoader.dir/build.make CMakeFiles/nomacsLoader.dir/depend make[2]: Entering directory '/tmp/B.v1g57_/BUILD/nomacs-3.4.1/build' cd /tmp/B.v1g57_/BUILD/nomacs-3.4.1/build && /usr/bin/cmake -E cmake_depends "Unix Makefiles" /tmp/B.v1g57_/BUILD/nomacs-3.4.1/ImageLounge /tmp/B.v1g57_/BUILD/nomacs-3.4.1/ImageLounge /tmp/B.v1g57_/BUILD/nomacs-3.4.1/build /tmp/B.v1g57_/BUILD/nomacs-3.4.1/build /tmp/B.v1g57_/BUILD/nomacs-3.4.1/build/CMakeFiles/nomacsLoader.dir/DependInfo.cmake --color= Scanning dependencies of target nomacsLoader make[2]: Leaving directory '/tmp/B.v1g57_/BUILD/nomacs-3.4.1/build' /usr/bin/make -f CMakeFiles/nomacsLoader.dir/build.make CMakeFiles/nomacsLoader.dir/build make[2]: Entering directory '/tmp/B.v1g57_/BUILD/nomacs-3.4.1/build' [ 17%] Building CXX object CMakeFiles/nomacsLoader.dir/src/DkLoader/DkBatchInfo.cpp.o /usr/bin/i686-pld-linux-g++ -DHAVE_EXIV2_HPP -DNOMACS_VERSION=\"3.4\" -DQT5 -DQT_CONCURRENT_LIB -DQT_CORE_LIB -DQT_GUI_LIB -DQT_NETWORK_LIB -DQT_NO_DEBUG -DQT_NO_DEBUG_OUTPUT -DQT_PRINTSUPPORT_LIB -DQT_SVG_LIB -DQT_WIDGETS_LIB -DWITH_LIBRAW -DWITH_LIBTIFF -DWITH_OPENCV -DWITH_PLUGINS -DWITH_QUAZIP -DnomacsLoader_EXPORTS -I/tmp/B.v1g57_/BUILD/nomacs-3.4.1/build -I/tmp/B.v1g57_/BUILD/nomacs-3.4.1/ImageLounge -I/tmp/B.v1g57_/BUILD/nomacs-3.4.1/build/nomacsLoader_autogen/include -I/usr/include/libraw -I/tmp/B.v1g57_/BUILD/nomacs-3.4.1/ImageLounge/src -I/tmp/B.v1g57_/BUILD/nomacs-3.4.1/ImageLounge/src/DkCore -I/tmp/B.v1g57_/BUILD/nomacs-3.4.1/ImageLounge/src/DkLoader -I/tmp/B.v1g57_/BUILD/nomacs-3.4.1/ImageLounge/src/DkGui -isystem /usr/include/qt5 -isystem /usr/include/qt5/QtWidgets -isystem /usr/include/qt5/QtGui -isystem /usr/include/qt5/QtCore -isystem /usr/lib/qt5/./mkspecs/linux-g++ -isystem /usr/include/qt5/QtNetwork -isystem /usr/include/qt5/QtPrintSupport -isystem /usr/include/qt5/QtConcurrent -isystem /usr/include/qt5/QtSvg -isystem /usr/include/opencv -std=c++11 -Wno-unknown-pragmas -O2 -fwrapv -pipe -Wformat -Werror=format-security -gdwarf-4 -fno-debug-types-section -fvar-tracking-assignments -g2 -Wp,-D_FORTIFY_SOURCE=2 -fstack-protector-strong --param=ssp-buffer-size=4 -fomit-frame-pointer -march=i686 -fasynchronous-unwind-tables -mtune=pentium4 -gdwarf-4 -fno-debug-types-section -fvar-tracking-assignments -g2 -DNDEBUG -DQT_NO_DEBUG -fPIC -DDK_LOADER_DLL_EXPORT -DNOMINMAX -fPIC -std=gnu++11 -o CMakeFiles/nomacsLoader.dir/src/DkLoader/DkBatchInfo.cpp.o -c /tmp/B.v1g57_/BUILD/nomacs-3.4.1/ImageLounge/src/DkLoader/DkBatchInfo.cpp make[2]: Leaving directory '/tmp/B.v1g57_/BUILD/nomacs-3.4.1/build' make[2]: Entering directory '/tmp/B.v1g57_/BUILD/nomacs-3.4.1/build' [ 21%] Building CXX object CMakeFiles/nomacsLoader.dir/src/DkLoader/DkDependencyResolver.cpp.o /usr/bin/i686-pld-linux-g++ -DHAVE_EXIV2_HPP -DNOMACS_VERSION=\"3.4\" -DQT5 -DQT_CONCURRENT_LIB -DQT_CORE_LIB -DQT_GUI_LIB -DQT_NETWORK_LIB -DQT_NO_DEBUG -DQT_NO_DEBUG_OUTPUT -DQT_PRINTSUPPORT_LIB -DQT_SVG_LIB -DQT_WIDGETS_LIB -DWITH_LIBRAW -DWITH_LIBTIFF -DWITH_OPENCV -DWITH_PLUGINS -DWITH_QUAZIP -DnomacsLoader_EXPORTS -I/tmp/B.v1g57_/BUILD/nomacs-3.4.1/build -I/tmp/B.v1g57_/BUILD/nomacs-3.4.1/ImageLounge -I/tmp/B.v1g57_/BUILD/nomacs-3.4.1/build/nomacsLoader_autogen/include -I/usr/include/libraw -I/tmp/B.v1g57_/BUILD/nomacs-3.4.1/ImageLounge/src -I/tmp/B.v1g57_/BUILD/nomacs-3.4.1/ImageLounge/src/DkCore -I/tmp/B.v1g57_/BUILD/nomacs-3.4.1/ImageLounge/src/DkLoader -I/tmp/B.v1g57_/BUILD/nomacs-3.4.1/ImageLounge/src/DkGui -isystem /usr/include/qt5 -isystem /usr/include/qt5/QtWidgets -isystem /usr/include/qt5/QtGui -isystem /usr/include/qt5/QtCore -isystem /usr/lib/qt5/./mkspecs/linux-g++ -isystem /usr/include/qt5/QtNetwork -isystem /usr/include/qt5/QtPrintSupport -isystem /usr/include/qt5/QtConcurrent -isystem /usr/include/qt5/QtSvg -isystem /usr/include/opencv -std=c++11 -Wno-unknown-pragmas -O2 -fwrapv -pipe -Wformat -Werror=format-security -gdwarf-4 -fno-debug-types-section -fvar-tracking-assignments -g2 -Wp,-D_FORTIFY_SOURCE=2 -fstack-protector-strong --param=ssp-buffer-size=4 -fomit-frame-pointer -march=i686 -fasynchronous-unwind-tables -mtune=pentium4 -gdwarf-4 -fno-debug-types-section -fvar-tracking-assignments -g2 -DNDEBUG -DQT_NO_DEBUG -fPIC -DDK_LOADER_DLL_EXPORT -DNOMINMAX -fPIC -std=gnu++11 -o CMakeFiles/nomacsLoader.dir/src/DkLoader/DkDependencyResolver.cpp.o -c /tmp/B.v1g57_/BUILD/nomacs-3.4.1/ImageLounge/src/DkLoader/DkDependencyResolver.cpp make[2]: Leaving directory '/tmp/B.v1g57_/BUILD/nomacs-3.4.1/build' make[2]: Entering directory '/tmp/B.v1g57_/BUILD/nomacs-3.4.1/build' [ 20%] Building CXX object CMakeFiles/nomacsLoader.dir/src/DkLoader/DkBasicWidgets.cpp.o /usr/bin/i686-pld-linux-g++ -DHAVE_EXIV2_HPP -DNOMACS_VERSION=\"3.4\" -DQT5 -DQT_CONCURRENT_LIB -DQT_CORE_LIB -DQT_GUI_LIB -DQT_NETWORK_LIB -DQT_NO_DEBUG -DQT_NO_DEBUG_OUTPUT -DQT_PRINTSUPPORT_LIB -DQT_SVG_LIB -DQT_WIDGETS_LIB -DWITH_LIBRAW -DWITH_LIBTIFF -DWITH_OPENCV -DWITH_PLUGINS -DWITH_QUAZIP -DnomacsLoader_EXPORTS -I/tmp/B.v1g57_/BUILD/nomacs-3.4.1/build -I/tmp/B.v1g57_/BUILD/nomacs-3.4.1/ImageLounge -I/tmp/B.v1g57_/BUILD/nomacs-3.4.1/build/nomacsLoader_autogen/include -I/usr/include/libraw -I/tmp/B.v1g57_/BUILD/nomacs-3.4.1/ImageLounge/src -I/tmp/B.v1g57_/BUILD/nomacs-3.4.1/ImageLounge/src/DkCore -I/tmp/B.v1g57_/BUILD/nomacs-3.4.1/ImageLounge/src/DkLoader -I/tmp/B.v1g57_/BUILD/nomacs-3.4.1/ImageLounge/src/DkGui -isystem /usr/include/qt5 -isystem /usr/include/qt5/QtWidgets -isystem /usr/include/qt5/QtGui -isystem /usr/include/qt5/QtCore -isystem /usr/lib/qt5/./mkspecs/linux-g++ -isystem /usr/include/qt5/QtNetwork -isystem /usr/include/qt5/QtPrintSupport -isystem /usr/include/qt5/QtConcurrent -isystem /usr/include/qt5/QtSvg -isystem /usr/include/opencv -std=c++11 -Wno-unknown-pragmas -O2 -fwrapv -pipe -Wformat -Werror=format-security -gdwarf-4 -fno-debug-types-section -fvar-tracking-assignments -g2 -Wp,-D_FORTIFY_SOURCE=2 -fstack-protector-strong --param=ssp-buffer-size=4 -fomit-frame-pointer -march=i686 -fasynchronous-unwind-tables -mtune=pentium4 -gdwarf-4 -fno-debug-types-section -fvar-tracking-assignments -g2 -DNDEBUG -DQT_NO_DEBUG -fPIC -DDK_LOADER_DLL_EXPORT -DNOMINMAX -fPIC -std=gnu++11 -o CMakeFiles/nomacsLoader.dir/src/DkLoader/DkBasicWidgets.cpp.o -c /tmp/B.v1g57_/BUILD/nomacs-3.4.1/ImageLounge/src/DkLoader/DkBasicWidgets.cpp make[2]: Leaving directory '/tmp/B.v1g57_/BUILD/nomacs-3.4.1/build' make[2]: Entering directory '/tmp/B.v1g57_/BUILD/nomacs-3.4.1/build' [ 15%] Building CXX object CMakeFiles/nomacsLoader.dir/src/DkLoader/DkBaseViewPort.cpp.o /usr/bin/i686-pld-linux-g++ -DHAVE_EXIV2_HPP -DNOMACS_VERSION=\"3.4\" -DQT5 -DQT_CONCURRENT_LIB -DQT_CORE_LIB -DQT_GUI_LIB -DQT_NETWORK_LIB -DQT_NO_DEBUG -DQT_NO_DEBUG_OUTPUT -DQT_PRINTSUPPORT_LIB -DQT_SVG_LIB -DQT_WIDGETS_LIB -DWITH_LIBRAW -DWITH_LIBTIFF -DWITH_OPENCV -DWITH_PLUGINS -DWITH_QUAZIP -DnomacsLoader_EXPORTS -I/tmp/B.v1g57_/BUILD/nomacs-3.4.1/build -I/tmp/B.v1g57_/BUILD/nomacs-3.4.1/ImageLounge -I/tmp/B.v1g57_/BUILD/nomacs-3.4.1/build/nomacsLoader_autogen/include -I/usr/include/libraw -I/tmp/B.v1g57_/BUILD/nomacs-3.4.1/ImageLounge/src -I/tmp/B.v1g57_/BUILD/nomacs-3.4.1/ImageLounge/src/DkCore -I/tmp/B.v1g57_/BUILD/nomacs-3.4.1/ImageLounge/src/DkLoader -I/tmp/B.v1g57_/BUILD/nomacs-3.4.1/ImageLounge/src/DkGui -isystem /usr/include/qt5 -isystem /usr/include/qt5/QtWidgets -isystem /usr/include/qt5/QtGui -isystem /usr/include/qt5/QtCore -isystem /usr/lib/qt5/./mkspecs/linux-g++ -isystem /usr/include/qt5/QtNetwork -isystem /usr/include/qt5/QtPrintSupport -isystem /usr/include/qt5/QtConcurrent -isystem /usr/include/qt5/QtSvg -isystem /usr/include/opencv -std=c++11 -Wno-unknown-pragmas -O2 -fwrapv -pipe -Wformat -Werror=format-security -gdwarf-4 -fno-debug-types-section -fvar-tracking-assignments -g2 -Wp,-D_FORTIFY_SOURCE=2 -fstack-protector-strong --param=ssp-buffer-size=4 -fomit-frame-pointer -march=i686 -fasynchronous-unwind-tables -mtune=pentium4 -gdwarf-4 -fno-debug-types-section -fvar-tracking-assignments -g2 -DNDEBUG -DQT_NO_DEBUG -fPIC -DDK_LOADER_DLL_EXPORT -DNOMINMAX -fPIC -std=gnu++11 -o CMakeFiles/nomacsLoader.dir/src/DkLoader/DkBaseViewPort.cpp.o -c /tmp/B.v1g57_/BUILD/nomacs-3.4.1/ImageLounge/src/DkLoader/DkBaseViewPort.cpp make[2]: Leaving directory '/tmp/B.v1g57_/BUILD/nomacs-3.4.1/build' make[2]: Entering directory '/tmp/B.v1g57_/BUILD/nomacs-3.4.1/build' [ 25%] Building CXX object CMakeFiles/nomacsLoader.dir/src/DkLoader/DkMessageBox.cpp.o /usr/bin/i686-pld-linux-g++ -DHAVE_EXIV2_HPP -DNOMACS_VERSION=\"3.4\" -DQT5 -DQT_CONCURRENT_LIB -DQT_CORE_LIB -DQT_GUI_LIB -DQT_NETWORK_LIB -DQT_NO_DEBUG -DQT_NO_DEBUG_OUTPUT -DQT_PRINTSUPPORT_LIB -DQT_SVG_LIB -DQT_WIDGETS_LIB -DWITH_LIBRAW -DWITH_LIBTIFF -DWITH_OPENCV -DWITH_PLUGINS -DWITH_QUAZIP -DnomacsLoader_EXPORTS -I/tmp/B.v1g57_/BUILD/nomacs-3.4.1/build -I/tmp/B.v1g57_/BUILD/nomacs-3.4.1/ImageLounge -I/tmp/B.v1g57_/BUILD/nomacs-3.4.1/build/nomacsLoader_autogen/include -I/usr/include/libraw -I/tmp/B.v1g57_/BUILD/nomacs-3.4.1/ImageLounge/src -I/tmp/B.v1g57_/BUILD/nomacs-3.4.1/ImageLounge/src/DkCore -I/tmp/B.v1g57_/BUILD/nomacs-3.4.1/ImageLounge/src/DkLoader -I/tmp/B.v1g57_/BUILD/nomacs-3.4.1/ImageLounge/src/DkGui -isystem /usr/include/qt5 -isystem /usr/include/qt5/QtWidgets -isystem /usr/include/qt5/QtGui -isystem /usr/include/qt5/QtCore -isystem /usr/lib/qt5/./mkspecs/linux-g++ -isystem /usr/include/qt5/QtNetwork -isystem /usr/include/qt5/QtPrintSupport -isystem /usr/include/qt5/QtConcurrent -isystem /usr/include/qt5/QtSvg -isystem /usr/include/opencv -std=c++11 -Wno-unknown-pragmas -O2 -fwrapv -pipe -Wformat -Werror=format-security -gdwarf-4 -fno-debug-types-section -fvar-tracking-assignments -g2 -Wp,-D_FORTIFY_SOURCE=2 -fstack-protector-strong --param=ssp-buffer-size=4 -fomit-frame-pointer -march=i686 -fasynchronous-unwind-tables -mtune=pentium4 -gdwarf-4 -fno-debug-types-section -fvar-tracking-assignments -g2 -DNDEBUG -DQT_NO_DEBUG -fPIC -DDK_LOADER_DLL_EXPORT -DNOMINMAX -fPIC -std=gnu++11 -o CMakeFiles/nomacsLoader.dir/src/DkLoader/DkMessageBox.cpp.o -c /tmp/B.v1g57_/BUILD/nomacs-3.4.1/ImageLounge/src/DkLoader/DkMessageBox.cpp make[2]: Leaving directory '/tmp/B.v1g57_/BUILD/nomacs-3.4.1/build' make[2]: Entering directory '/tmp/B.v1g57_/BUILD/nomacs-3.4.1/build' [ 26%] Building CXX object CMakeFiles/nomacsLoader.dir/src/DkLoader/DkMetaData.cpp.o /usr/bin/i686-pld-linux-g++ -DHAVE_EXIV2_HPP -DNOMACS_VERSION=\"3.4\" -DQT5 -DQT_CONCURRENT_LIB -DQT_CORE_LIB -DQT_GUI_LIB -DQT_NETWORK_LIB -DQT_NO_DEBUG -DQT_NO_DEBUG_OUTPUT -DQT_PRINTSUPPORT_LIB -DQT_SVG_LIB -DQT_WIDGETS_LIB -DWITH_LIBRAW -DWITH_LIBTIFF -DWITH_OPENCV -DWITH_PLUGINS -DWITH_QUAZIP -DnomacsLoader_EXPORTS -I/tmp/B.v1g57_/BUILD/nomacs-3.4.1/build -I/tmp/B.v1g57_/BUILD/nomacs-3.4.1/ImageLounge -I/tmp/B.v1g57_/BUILD/nomacs-3.4.1/build/nomacsLoader_autogen/include -I/usr/include/libraw -I/tmp/B.v1g57_/BUILD/nomacs-3.4.1/ImageLounge/src -I/tmp/B.v1g57_/BUILD/nomacs-3.4.1/ImageLounge/src/DkCore -I/tmp/B.v1g57_/BUILD/nomacs-3.4.1/ImageLounge/src/DkLoader -I/tmp/B.v1g57_/BUILD/nomacs-3.4.1/ImageLounge/src/DkGui -isystem /usr/include/qt5 -isystem /usr/include/qt5/QtWidgets -isystem /usr/include/qt5/QtGui -isystem /usr/include/qt5/QtCore -isystem /usr/lib/qt5/./mkspecs/linux-g++ -isystem /usr/include/qt5/QtNetwork -isystem /usr/include/qt5/QtPrintSupport -isystem /usr/include/qt5/QtConcurrent -isystem /usr/include/qt5/QtSvg -isystem /usr/include/opencv -std=c++11 -Wno-unknown-pragmas -O2 -fwrapv -pipe -Wformat -Werror=format-security -gdwarf-4 -fno-debug-types-section -fvar-tracking-assignments -g2 -Wp,-D_FORTIFY_SOURCE=2 -fstack-protector-strong --param=ssp-buffer-size=4 -fomit-frame-pointer -march=i686 -fasynchronous-unwind-tables -mtune=pentium4 -gdwarf-4 -fno-debug-types-section -fvar-tracking-assignments -g2 -DNDEBUG -DQT_NO_DEBUG -fPIC -DDK_LOADER_DLL_EXPORT -DNOMINMAX -fPIC -std=gnu++11 -o CMakeFiles/nomacsLoader.dir/src/DkLoader/DkMetaData.cpp.o -c /tmp/B.v1g57_/BUILD/nomacs-3.4.1/ImageLounge/src/DkLoader/DkMetaData.cpp /tmp/B.v1g57_/BUILD/nomacs-3.4.1/ImageLounge/src/DkLoader/DkMetaData.cpp: In member function 'void nmc::DkMetaDataT::printMetaData() const': /tmp/B.v1g57_/BUILD/nomacs-3.4.1/ImageLounge/src/DkLoader/DkMetaData.cpp:1267:55: error: no matching function for call to 'Exiv2::BasicError<char>::BasicError(int, const char [29])' throw Exiv2::Error(1, "Failed to serialize XMP data"); ^ In file included from /usr/include/exiv2/iptc.hpp:34, from /usr/include/exiv2/bmpimage.hpp:33, from /usr/include/exiv2/exiv2.hpp:35, from /tmp/B.v1g57_/BUILD/nomacs-3.4.1/ImageLounge/src/DkLoader/DkMetaData.h:39, from /tmp/B.v1g57_/BUILD/nomacs-3.4.1/ImageLounge/src/DkLoader/DkMetaData.cpp:28: /usr/include/exiv2/error.hpp:280:9: note: candidate: 'template<class A, class B, class C> Exiv2::BasicError<charT>::BasicError(Exiv2::ErrorCode, const A&, const B&, const C&)' BasicError(ErrorCode code, const A& arg1, const B& arg2, const C& arg3); ^~~~~~~~~~ /usr/include/exiv2/error.hpp:280:9: note: template argument deduction/substitution failed: /tmp/B.v1g57_/BUILD/nomacs-3.4.1/ImageLounge/src/DkLoader/DkMetaData.cpp:1267:55: note: candidate expects 4 arguments, 2 provided throw Exiv2::Error(1, "Failed to serialize XMP data"); ^ In file included from /usr/include/exiv2/iptc.hpp:34, from /usr/include/exiv2/bmpimage.hpp:33, from /usr/include/exiv2/exiv2.hpp:35, from /tmp/B.v1g57_/BUILD/nomacs-3.4.1/ImageLounge/src/DkLoader/DkMetaData.h:39, from /tmp/B.v1g57_/BUILD/nomacs-3.4.1/ImageLounge/src/DkLoader/DkMetaData.cpp:28: /usr/include/exiv2/error.hpp:276:9: note: candidate: 'template<class A, class B> Exiv2::BasicError<charT>::BasicError(Exiv2::ErrorCode, const A&, const B&)' BasicError(ErrorCode code, const A& arg1, const B& arg2); ^~~~~~~~~~ /usr/include/exiv2/error.hpp:276:9: note: template argument deduction/substitution failed: /tmp/B.v1g57_/BUILD/nomacs-3.4.1/ImageLounge/src/DkLoader/DkMetaData.cpp:1267:55: note: candidate expects 3 arguments, 2 provided throw Exiv2::Error(1, "Failed to serialize XMP data"); ^ In file included from /usr/include/exiv2/iptc.hpp:34, from /usr/include/exiv2/bmpimage.hpp:33, from /usr/include/exiv2/exiv2.hpp:35, from /tmp/B.v1g57_/BUILD/nomacs-3.4.1/ImageLounge/src/DkLoader/DkMetaData.h:39, from /tmp/B.v1g57_/BUILD/nomacs-3.4.1/ImageLounge/src/DkLoader/DkMetaData.cpp:28: /usr/include/exiv2/error.hpp:272:9: note: candidate: 'template<class A> Exiv2::BasicError<charT>::BasicError(Exiv2::ErrorCode, const A&)' BasicError(ErrorCode code, const A& arg1); ^~~~~~~~~~ /usr/include/exiv2/error.hpp:272:9: note: template argument deduction/substitution failed: /tmp/B.v1g57_/BUILD/nomacs-3.4.1/ImageLounge/src/DkLoader/DkMetaData.cpp:1267:55: note: cannot convert '1' (type 'int') to type 'Exiv2::ErrorCode' throw Exiv2::Error(1, "Failed to serialize XMP data"); ^ In file included from /usr/include/exiv2/iptc.hpp:34, from /usr/include/exiv2/bmpimage.hpp:33, from /usr/include/exiv2/exiv2.hpp:35, from /tmp/B.v1g57_/BUILD/nomacs-3.4.1/ImageLounge/src/DkLoader/DkMetaData.h:39, from /tmp/B.v1g57_/BUILD/nomacs-3.4.1/ImageLounge/src/DkLoader/DkMetaData.cpp:28: /usr/include/exiv2/error.hpp:336:5: note: candidate: 'Exiv2::BasicError<charT>::BasicError(Exiv2::ErrorCode) [with charT = char]' BasicError<charT>::BasicError(ErrorCode code) ^~~~~~~~~~~~~~~~~ /usr/include/exiv2/error.hpp:336:5: note: candidate expects 1 argument, 2 provided /usr/include/exiv2/error.hpp:263:11: note: candidate: 'Exiv2::BasicError<char>::BasicError(const Exiv2::BasicError<char>&)' class BasicError : public AnyError { ^~~~~~~~~~ /usr/include/exiv2/error.hpp:263:11: note: candidate expects 1 argument, 2 provided make[2]: *** [CMakeFiles/nomacsLoader.dir/build.make:284: CMakeFiles/nomacsLoader.dir/src/DkLoader/DkMetaData.cpp.o] Error 1 make[2]: Leaving directory '/tmp/B.v1g57_/BUILD/nomacs-3.4.1/build' make[2]: *** Waiting for unfinished jobs.... make[2]: Entering directory '/tmp/B.v1g57_/BUILD/nomacs-3.4.1/build' [ 23%] Building CXX object CMakeFiles/nomacsLoader.dir/src/DkLoader/DkImageStorage.cpp.o /usr/bin/i686-pld-linux-g++ -DHAVE_EXIV2_HPP -DNOMACS_VERSION=\"3.4\" -DQT5 -DQT_CONCURRENT_LIB -DQT_CORE_LIB -DQT_GUI_LIB -DQT_NETWORK_LIB -DQT_NO_DEBUG -DQT_NO_DEBUG_OUTPUT -DQT_PRINTSUPPORT_LIB -DQT_SVG_LIB -DQT_WIDGETS_LIB -DWITH_LIBRAW -DWITH_LIBTIFF -DWITH_OPENCV -DWITH_PLUGINS -DWITH_QUAZIP -DnomacsLoader_EXPORTS -I/tmp/B.v1g57_/BUILD/nomacs-3.4.1/build -I/tmp/B.v1g57_/BUILD/nomacs-3.4.1/ImageLounge -I/tmp/B.v1g57_/BUILD/nomacs-3.4.1/build/nomacsLoader_autogen/include -I/usr/include/libraw -I/tmp/B.v1g57_/BUILD/nomacs-3.4.1/ImageLounge/src -I/tmp/B.v1g57_/BUILD/nomacs-3.4.1/ImageLounge/src/DkCore -I/tmp/B.v1g57_/BUILD/nomacs-3.4.1/ImageLounge/src/DkLoader -I/tmp/B.v1g57_/BUILD/nomacs-3.4.1/ImageLounge/src/DkGui -isystem /usr/include/qt5 -isystem /usr/include/qt5/QtWidgets -isystem /usr/include/qt5/QtGui -isystem /usr/include/qt5/QtCore -isystem /usr/lib/qt5/./mkspecs/linux-g++ -isystem /usr/include/qt5/QtNetwork -isystem /usr/include/qt5/QtPrintSupport -isystem /usr/include/qt5/QtConcurrent -isystem /usr/include/qt5/QtSvg -isystem /usr/include/opencv -std=c++11 -Wno-unknown-pragmas -O2 -fwrapv -pipe -Wformat -Werror=format-security -gdwarf-4 -fno-debug-types-section -fvar-tracking-assignments -g2 -Wp,-D_FORTIFY_SOURCE=2 -fstack-protector-strong --param=ssp-buffer-size=4 -fomit-frame-pointer -march=i686 -fasynchronous-unwind-tables -mtune=pentium4 -gdwarf-4 -fno-debug-types-section -fvar-tracking-assignments -g2 -DNDEBUG -DQT_NO_DEBUG -fPIC -DDK_LOADER_DLL_EXPORT -DNOMINMAX -fPIC -std=gnu++11 -o CMakeFiles/nomacsLoader.dir/src/DkLoader/DkImageStorage.cpp.o -c /tmp/B.v1g57_/BUILD/nomacs-3.4.1/ImageLounge/src/DkLoader/DkImageStorage.cpp make[2]: Leaving directory '/tmp/B.v1g57_/BUILD/nomacs-3.4.1/build' make[2]: Entering directory '/tmp/B.v1g57_/BUILD/nomacs-3.4.1/build' [ 17%] Building CXX object CMakeFiles/nomacsLoader.dir/src/DkLoader/DkBasicLoader.cpp.o /usr/bin/i686-pld-linux-g++ -DHAVE_EXIV2_HPP -DNOMACS_VERSION=\"3.4\" -DQT5 -DQT_CONCURRENT_LIB -DQT_CORE_LIB -DQT_GUI_LIB -DQT_NETWORK_LIB -DQT_NO_DEBUG -DQT_NO_DEBUG_OUTPUT -DQT_PRINTSUPPORT_LIB -DQT_SVG_LIB -DQT_WIDGETS_LIB -DWITH_LIBRAW -DWITH_LIBTIFF -DWITH_OPENCV -DWITH_PLUGINS -DWITH_QUAZIP -DnomacsLoader_EXPORTS -I/tmp/B.v1g57_/BUILD/nomacs-3.4.1/build -I/tmp/B.v1g57_/BUILD/nomacs-3.4.1/ImageLounge -I/tmp/B.v1g57_/BUILD/nomacs-3.4.1/build/nomacsLoader_autogen/include -I/usr/include/libraw -I/tmp/B.v1g57_/BUILD/nomacs-3.4.1/ImageLounge/src -I/tmp/B.v1g57_/BUILD/nomacs-3.4.1/ImageLounge/src/DkCore -I/tmp/B.v1g57_/BUILD/nomacs-3.4.1/ImageLounge/src/DkLoader -I/tmp/B.v1g57_/BUILD/nomacs-3.4.1/ImageLounge/src/DkGui -isystem /usr/include/qt5 -isystem /usr/include/qt5/QtWidgets -isystem /usr/include/qt5/QtGui -isystem /usr/include/qt5/QtCore -isystem /usr/lib/qt5/./mkspecs/linux-g++ -isystem /usr/include/qt5/QtNetwork -isystem /usr/include/qt5/QtPrintSupport -isystem /usr/include/qt5/QtConcurrent -isystem /usr/include/qt5/QtSvg -isystem /usr/include/opencv -std=c++11 -Wno-unknown-pragmas -O2 -fwrapv -pipe -Wformat -Werror=format-security -gdwarf-4 -fno-debug-types-section -fvar-tracking-assignments -g2 -Wp,-D_FORTIFY_SOURCE=2 -fstack-protector-strong --param=ssp-buffer-size=4 -fomit-frame-pointer -march=i686 -fasynchronous-unwind-tables -mtune=pentium4 -gdwarf-4 -fno-debug-types-section -fvar-tracking-assignments -g2 -DNDEBUG -DQT_NO_DEBUG -fPIC -DDK_LOADER_DLL_EXPORT -DNOMINMAX -fPIC -std=gnu++11 -o CMakeFiles/nomacsLoader.dir/src/DkLoader/DkBasicLoader.cpp.o -c /tmp/B.v1g57_/BUILD/nomacs-3.4.1/ImageLounge/src/DkLoader/DkBasicLoader.cpp make[2]: Leaving directory '/tmp/B.v1g57_/BUILD/nomacs-3.4.1/build' make[2]: Entering directory '/tmp/B.v1g57_/BUILD/nomacs-3.4.1/build' [ 20%] Building CXX object CMakeFiles/nomacsLoader.dir/src/DkLoader/DkImageContainer.cpp.o /usr/bin/i686-pld-linux-g++ -DHAVE_EXIV2_HPP -DNOMACS_VERSION=\"3.4\" -DQT5 -DQT_CONCURRENT_LIB -DQT_CORE_LIB -DQT_GUI_LIB -DQT_NETWORK_LIB -DQT_NO_DEBUG -DQT_NO_DEBUG_OUTPUT -DQT_PRINTSUPPORT_LIB -DQT_SVG_LIB -DQT_WIDGETS_LIB -DWITH_LIBRAW -DWITH_LIBTIFF -DWITH_OPENCV -DWITH_PLUGINS -DWITH_QUAZIP -DnomacsLoader_EXPORTS -I/tmp/B.v1g57_/BUILD/nomacs-3.4.1/build -I/tmp/B.v1g57_/BUILD/nomacs-3.4.1/ImageLounge -I/tmp/B.v1g57_/BUILD/nomacs-3.4.1/build/nomacsLoader_autogen/include -I/usr/include/libraw -I/tmp/B.v1g57_/BUILD/nomacs-3.4.1/ImageLounge/src -I/tmp/B.v1g57_/BUILD/nomacs-3.4.1/ImageLounge/src/DkCore -I/tmp/B.v1g57_/BUILD/nomacs-3.4.1/ImageLounge/src/DkLoader -I/tmp/B.v1g57_/BUILD/nomacs-3.4.1/ImageLounge/src/DkGui -isystem /usr/include/qt5 -isystem /usr/include/qt5/QtWidgets -isystem /usr/include/qt5/QtGui -isystem /usr/include/qt5/QtCore -isystem /usr/lib/qt5/./mkspecs/linux-g++ -isystem /usr/include/qt5/QtNetwork -isystem /usr/include/qt5/QtPrintSupport -isystem /usr/include/qt5/QtConcurrent -isystem /usr/include/qt5/QtSvg -isystem /usr/include/opencv -std=c++11 -Wno-unknown-pragmas -O2 -fwrapv -pipe -Wformat -Werror=format-security -gdwarf-4 -fno-debug-types-section -fvar-tracking-assignments -g2 -Wp,-D_FORTIFY_SOURCE=2 -fstack-protector-strong --param=ssp-buffer-size=4 -fomit-frame-pointer -march=i686 -fasynchronous-unwind-tables -mtune=pentium4 -gdwarf-4 -fno-debug-types-section -fvar-tracking-assignments -g2 -DNDEBUG -DQT_NO_DEBUG -fPIC -DDK_LOADER_DLL_EXPORT -DNOMINMAX -fPIC -std=gnu++11 -o CMakeFiles/nomacsLoader.dir/src/DkLoader/DkImageContainer.cpp.o -c /tmp/B.v1g57_/BUILD/nomacs-3.4.1/ImageLounge/src/DkLoader/DkImageContainer.cpp make[2]: Leaving directory '/tmp/B.v1g57_/BUILD/nomacs-3.4.1/build' make[2]: Entering directory '/tmp/B.v1g57_/BUILD/nomacs-3.4.1/build' [ 22%] Building CXX object CMakeFiles/nomacsLoader.dir/src/DkLoader/DkImageLoader.cpp.o /usr/bin/i686-pld-linux-g++ -DHAVE_EXIV2_HPP -DNOMACS_VERSION=\"3.4\" -DQT5 -DQT_CONCURRENT_LIB -DQT_CORE_LIB -DQT_GUI_LIB -DQT_NETWORK_LIB -DQT_NO_DEBUG -DQT_NO_DEBUG_OUTPUT -DQT_PRINTSUPPORT_LIB -DQT_SVG_LIB -DQT_WIDGETS_LIB -DWITH_LIBRAW -DWITH_LIBTIFF -DWITH_OPENCV -DWITH_PLUGINS -DWITH_QUAZIP -DnomacsLoader_EXPORTS -I/tmp/B.v1g57_/BUILD/nomacs-3.4.1/build -I/tmp/B.v1g57_/BUILD/nomacs-3.4.1/ImageLounge -I/tmp/B.v1g57_/BUILD/nomacs-3.4.1/build/nomacsLoader_autogen/include -I/usr/include/libraw -I/tmp/B.v1g57_/BUILD/nomacs-3.4.1/ImageLounge/src -I/tmp/B.v1g57_/BUILD/nomacs-3.4.1/ImageLounge/src/DkCore -I/tmp/B.v1g57_/BUILD/nomacs-3.4.1/ImageLounge/src/DkLoader -I/tmp/B.v1g57_/BUILD/nomacs-3.4.1/ImageLounge/src/DkGui -isystem /usr/include/qt5 -isystem /usr/include/qt5/QtWidgets -isystem /usr/include/qt5/QtGui -isystem /usr/include/qt5/QtCore -isystem /usr/lib/qt5/./mkspecs/linux-g++ -isystem /usr/include/qt5/QtNetwork -isystem /usr/include/qt5/QtPrintSupport -isystem /usr/include/qt5/QtConcurrent -isystem /usr/include/qt5/QtSvg -isystem /usr/include/opencv -std=c++11 -Wno-unknown-pragmas -O2 -fwrapv -pipe -Wformat -Werror=format-security -gdwarf-4 -fno-debug-types-section -fvar-tracking-assignments -g2 -Wp,-D_FORTIFY_SOURCE=2 -fstack-protector-strong --param=ssp-buffer-size=4 -fomit-frame-pointer -march=i686 -fasynchronous-unwind-tables -mtune=pentium4 -gdwarf-4 -fno-debug-types-section -fvar-tracking-assignments -g2 -DNDEBUG -DQT_NO_DEBUG -fPIC -DDK_LOADER_DLL_EXPORT -DNOMINMAX -fPIC -std=gnu++11 -o CMakeFiles/nomacsLoader.dir/src/DkLoader/DkImageLoader.cpp.o -c /tmp/B.v1g57_/BUILD/nomacs-3.4.1/ImageLounge/src/DkLoader/DkImageLoader.cpp make[2]: Leaving directory '/tmp/B.v1g57_/BUILD/nomacs-3.4.1/build' make[2]: Entering directory '/tmp/B.v1g57_/BUILD/nomacs-3.4.1/build' [ 29%] Building CXX object CMakeFiles/nomacsLoader.dir/src/DkLoader/DkSaveDialog.cpp.o /usr/bin/i686-pld-linux-g++ -DHAVE_EXIV2_HPP -DNOMACS_VERSION=\"3.4\" -DQT5 -DQT_CONCURRENT_LIB -DQT_CORE_LIB -DQT_GUI_LIB -DQT_NETWORK_LIB -DQT_NO_DEBUG -DQT_NO_DEBUG_OUTPUT -DQT_PRINTSUPPORT_LIB -DQT_SVG_LIB -DQT_WIDGETS_LIB -DWITH_LIBRAW -DWITH_LIBTIFF -DWITH_OPENCV -DWITH_PLUGINS -DWITH_QUAZIP -DnomacsLoader_EXPORTS -I/tmp/B.v1g57_/BUILD/nomacs-3.4.1/build -I/tmp/B.v1g57_/BUILD/nomacs-3.4.1/ImageLounge -I/tmp/B.v1g57_/BUILD/nomacs-3.4.1/build/nomacsLoader_autogen/include -I/usr/include/libraw -I/tmp/B.v1g57_/BUILD/nomacs-3.4.1/ImageLounge/src -I/tmp/B.v1g57_/BUILD/nomacs-3.4.1/ImageLounge/src/DkCore -I/tmp/B.v1g57_/BUILD/nomacs-3.4.1/ImageLounge/src/DkLoader -I/tmp/B.v1g57_/BUILD/nomacs-3.4.1/ImageLounge/src/DkGui -isystem /usr/include/qt5 -isystem /usr/include/qt5/QtWidgets -isystem /usr/include/qt5/QtGui -isystem /usr/include/qt5/QtCore -isystem /usr/lib/qt5/./mkspecs/linux-g++ -isystem /usr/include/qt5/QtNetwork -isystem /usr/include/qt5/QtPrintSupport -isystem /usr/include/qt5/QtConcurrent -isystem /usr/include/qt5/QtSvg -isystem /usr/include/opencv -std=c++11 -Wno-unknown-pragmas -O2 -fwrapv -pipe -Wformat -Werror=format-security -gdwarf-4 -fno-debug-types-section -fvar-tracking-assignments -g2 -Wp,-D_FORTIFY_SOURCE=2 -fstack-protector-strong --param=ssp-buffer-size=4 -fomit-frame-pointer -march=i686 -fasynchronous-unwind-tables -mtune=pentium4 -gdwarf-4 -fno-debug-types-section -fvar-tracking-assignments -g2 -DNDEBUG -DQT_NO_DEBUG -fPIC -DDK_LOADER_DLL_EXPORT -DNOMINMAX -fPIC -std=gnu++11 -o CMakeFiles/nomacsLoader.dir/src/DkLoader/DkSaveDialog.cpp.o -c /tmp/B.v1g57_/BUILD/nomacs-3.4.1/ImageLounge/src/DkLoader/DkSaveDialog.cpp make[2]: Leaving directory '/tmp/B.v1g57_/BUILD/nomacs-3.4.1/build' make[2]: Entering directory '/tmp/B.v1g57_/BUILD/nomacs-3.4.1/build' [ 27%] Building CXX object CMakeFiles/nomacsLoader.dir/src/DkLoader/DkPluginManager.cpp.o /usr/bin/i686-pld-linux-g++ -DHAVE_EXIV2_HPP -DNOMACS_VERSION=\"3.4\" -DQT5 -DQT_CONCURRENT_LIB -DQT_CORE_LIB -DQT_GUI_LIB -DQT_NETWORK_LIB -DQT_NO_DEBUG -DQT_NO_DEBUG_OUTPUT -DQT_PRINTSUPPORT_LIB -DQT_SVG_LIB -DQT_WIDGETS_LIB -DWITH_LIBRAW -DWITH_LIBTIFF -DWITH_OPENCV -DWITH_PLUGINS -DWITH_QUAZIP -DnomacsLoader_EXPORTS -I/tmp/B.v1g57_/BUILD/nomacs-3.4.1/build -I/tmp/B.v1g57_/BUILD/nomacs-3.4.1/ImageLounge -I/tmp/B.v1g57_/BUILD/nomacs-3.4.1/build/nomacsLoader_autogen/include -I/usr/include/libraw -I/tmp/B.v1g57_/BUILD/nomacs-3.4.1/ImageLounge/src -I/tmp/B.v1g57_/BUILD/nomacs-3.4.1/ImageLounge/src/DkCore -I/tmp/B.v1g57_/BUILD/nomacs-3.4.1/ImageLounge/src/DkLoader -I/tmp/B.v1g57_/BUILD/nomacs-3.4.1/ImageLounge/src/DkGui -isystem /usr/include/qt5 -isystem /usr/include/qt5/QtWidgets -isystem /usr/include/qt5/QtGui -isystem /usr/include/qt5/QtCore -isystem /usr/lib/qt5/./mkspecs/linux-g++ -isystem /usr/include/qt5/QtNetwork -isystem /usr/include/qt5/QtPrintSupport -isystem /usr/include/qt5/QtConcurrent -isystem /usr/include/qt5/QtSvg -isystem /usr/include/opencv -std=c++11 -Wno-unknown-pragmas -O2 -fwrapv -pipe -Wformat -Werror=format-security -gdwarf-4 -fno-debug-types-section -fvar-tracking-assignments -g2 -Wp,-D_FORTIFY_SOURCE=2 -fstack-protector-strong --param=ssp-buffer-size=4 -fomit-frame-pointer -march=i686 -fasynchronous-unwind-tables -mtune=pentium4 -gdwarf-4 -fno-debug-types-section -fvar-tracking-assignments -g2 -DNDEBUG -DQT_NO_DEBUG -fPIC -DDK_LOADER_DLL_EXPORT -DNOMINMAX -fPIC -std=gnu++11 -o CMakeFiles/nomacsLoader.dir/src/DkLoader/DkPluginManager.cpp.o -c /tmp/B.v1g57_/BUILD/nomacs-3.4.1/ImageLounge/src/DkLoader/DkPluginManager.cpp make[2]: Leaving directory '/tmp/B.v1g57_/BUILD/nomacs-3.4.1/build' make[2]: Entering directory '/tmp/B.v1g57_/BUILD/nomacs-3.4.1/build' [ 28%] Building CXX object CMakeFiles/nomacsLoader.dir/src/DkLoader/DkProcess.cpp.o /usr/bin/i686-pld-linux-g++ -DHAVE_EXIV2_HPP -DNOMACS_VERSION=\"3.4\" -DQT5 -DQT_CONCURRENT_LIB -DQT_CORE_LIB -DQT_GUI_LIB -DQT_NETWORK_LIB -DQT_NO_DEBUG -DQT_NO_DEBUG_OUTPUT -DQT_PRINTSUPPORT_LIB -DQT_SVG_LIB -DQT_WIDGETS_LIB -DWITH_LIBRAW -DWITH_LIBTIFF -DWITH_OPENCV -DWITH_PLUGINS -DWITH_QUAZIP -DnomacsLoader_EXPORTS -I/tmp/B.v1g57_/BUILD/nomacs-3.4.1/build -I/tmp/B.v1g57_/BUILD/nomacs-3.4.1/ImageLounge -I/tmp/B.v1g57_/BUILD/nomacs-3.4.1/build/nomacsLoader_autogen/include -I/usr/include/libraw -I/tmp/B.v1g57_/BUILD/nomacs-3.4.1/ImageLounge/src -I/tmp/B.v1g57_/BUILD/nomacs-3.4.1/ImageLounge/src/DkCore -I/tmp/B.v1g57_/BUILD/nomacs-3.4.1/ImageLounge/src/DkLoader -I/tmp/B.v1g57_/BUILD/nomacs-3.4.1/ImageLounge/src/DkGui -isystem /usr/include/qt5 -isystem /usr/include/qt5/QtWidgets -isystem /usr/include/qt5/QtGui -isystem /usr/include/qt5/QtCore -isystem /usr/lib/qt5/./mkspecs/linux-g++ -isystem /usr/include/qt5/QtNetwork -isystem /usr/include/qt5/QtPrintSupport -isystem /usr/include/qt5/QtConcurrent -isystem /usr/include/qt5/QtSvg -isystem /usr/include/opencv -std=c++11 -Wno-unknown-pragmas -O2 -fwrapv -pipe -Wformat -Werror=format-security -gdwarf-4 -fno-debug-types-section -fvar-tracking-assignments -g2 -Wp,-D_FORTIFY_SOURCE=2 -fstack-protector-strong --param=ssp-buffer-size=4 -fomit-frame-pointer -march=i686 -fasynchronous-unwind-tables -mtune=pentium4 -gdwarf-4 -fno-debug-types-section -fvar-tracking-assignments -g2 -DNDEBUG -DQT_NO_DEBUG -fPIC -DDK_LOADER_DLL_EXPORT -DNOMINMAX -fPIC -std=gnu++11 -o CMakeFiles/nomacsLoader.dir/src/DkLoader/DkProcess.cpp.o -c /tmp/B.v1g57_/BUILD/nomacs-3.4.1/ImageLounge/src/DkLoader/DkProcess.cpp make[2]: Leaving directory '/tmp/B.v1g57_/BUILD/nomacs-3.4.1/build' make[2]: Entering directory '/tmp/B.v1g57_/BUILD/nomacs-3.4.1/build' [ 15%] Building CXX object CMakeFiles/nomacsLoader.dir/src/DkLoader/DkActionManager.cpp.o /usr/bin/i686-pld-linux-g++ -DHAVE_EXIV2_HPP -DNOMACS_VERSION=\"3.4\" -DQT5 -DQT_CONCURRENT_LIB -DQT_CORE_LIB -DQT_GUI_LIB -DQT_NETWORK_LIB -DQT_NO_DEBUG -DQT_NO_DEBUG_OUTPUT -DQT_PRINTSUPPORT_LIB -DQT_SVG_LIB -DQT_WIDGETS_LIB -DWITH_LIBRAW -DWITH_LIBTIFF -DWITH_OPENCV -DWITH_PLUGINS -DWITH_QUAZIP -DnomacsLoader_EXPORTS -I/tmp/B.v1g57_/BUILD/nomacs-3.4.1/build -I/tmp/B.v1g57_/BUILD/nomacs-3.4.1/ImageLounge -I/tmp/B.v1g57_/BUILD/nomacs-3.4.1/build/nomacsLoader_autogen/include -I/usr/include/libraw -I/tmp/B.v1g57_/BUILD/nomacs-3.4.1/ImageLounge/src -I/tmp/B.v1g57_/BUILD/nomacs-3.4.1/ImageLounge/src/DkCore -I/tmp/B.v1g57_/BUILD/nomacs-3.4.1/ImageLounge/src/DkLoader -I/tmp/B.v1g57_/BUILD/nomacs-3.4.1/ImageLounge/src/DkGui -isystem /usr/include/qt5 -isystem /usr/include/qt5/QtWidgets -isystem /usr/include/qt5/QtGui -isystem /usr/include/qt5/QtCore -isystem /usr/lib/qt5/./mkspecs/linux-g++ -isystem /usr/include/qt5/QtNetwork -isystem /usr/include/qt5/QtPrintSupport -isystem /usr/include/qt5/QtConcurrent -isystem /usr/include/qt5/QtSvg -isystem /usr/include/opencv -std=c++11 -Wno-unknown-pragmas -O2 -fwrapv -pipe -Wformat -Werror=format-security -gdwarf-4 -fno-debug-types-section -fvar-tracking-assignments -g2 -Wp,-D_FORTIFY_SOURCE=2 -fstack-protector-strong --param=ssp-buffer-size=4 -fomit-frame-pointer -march=i686 -fasynchronous-unwind-tables -mtune=pentium4 -gdwarf-4 -fno-debug-types-section -fvar-tracking-assignments -g2 -DNDEBUG -DQT_NO_DEBUG -fPIC -DDK_LOADER_DLL_EXPORT -DNOMINMAX -fPIC -std=gnu++11 -o CMakeFiles/nomacsLoader.dir/src/DkLoader/DkActionManager.cpp.o -c /tmp/B.v1g57_/BUILD/nomacs-3.4.1/ImageLounge/src/DkLoader/DkActionManager.cpp make[2]: Leaving directory '/tmp/B.v1g57_/BUILD/nomacs-3.4.1/build' make[1]: *** [CMakeFiles/Makefile2:154: CMakeFiles/nomacsLoader.dir/all] Error 2 make: *** [Makefile:155: all] Error 2 error: Bad exit status from /tmp/B.v1g57_/BUILD/tmp/rpm-tmp.26167 (%build) RPM build errors: Bad exit status from /tmp/B.v1g57_/BUILD/tmp/rpm-tmp.26167 (%build) ended at: Sun Feb 10 12:00:05 2019, done in 0:00:28.196990 error: No files produced. + chmod -R u+rwX /tmp/B.v1g57_/BUILD + rm -rf /tmp/B.v1g57_/tmp /tmp/B.v1g57_/BUILD + rm -rf /tmp/B.v1g57_ Begin-PLD-Builder-Info Build-Time: user:95.47s sys:6.57s real:34.48s (faults io:0 non-io:1323897) End-PLD-Builder-Info
[Back to list of logs] [View rpm -qa of builder]