FailedOk

th/SRPMS[OK]
th/x32[OK]
th/i686[OK]
th/x86_64[OK]

ac/SRPMS[OK]
ac/i386[OK]
ac/i586[OK]
ac/i686[OK]
ac/alpha[OK]
ac/amd64[OK]
ac/athlon[OK]
ac/ppc[OK]
ac/sparc[OK]
ac/sparc64[OK]

Advanced Search
main()
Powered by PLD Linux
(c) 2002-2023 PLD Team
$Revision: 1.37 $
Powered by foobar.
Your IP: 44.211.239.1

perl-HTML-Mason-PSGIHandler 5af7c7e5-d8bf-4c8f-aea5-09076291673e

Status:Failed
Source URL:https://buildlogs.pld-linux.org/pld/th/i686/FAIL/perl-HTML-Mason-PSGIHandler,5af7c7e5-d8bf-4c8f-aea5-09076291673e.bz2
text/plain URL:View!
full text:View!
rpm -qa of builder:View!
Date:2022/11/01 19:45:48
Runtime:0:00:01.833156

Toc:

  • error 1
  • rpm: error: Failed build dependencies:
  • error 2
  • rpm: error: Failed build dependencies:
  • error 3
  • rpm: error: Failed build dependencies:
  • prep
  • Executing(%prep): /bin/sh -e /tmp/B.7_qixkk2/BUILD/tmp/rpm-tmp.QgKu4v
  • build
  • Executing(%build): /bin/sh -e /tmp/B.7_qixkk2/BUILD/tmp/rpm-tmp.sGmeeR
  • error 4
  • Parse errors: No plan found in TAP output
  • error 5
  • Parse errors: No plan found in TAP output
  • error 6
  • Parse errors: No plan found in TAP output
  • error 7
  • error: Bad exit status from /tmp/B.7_qixkk2/BUILD/tmp/rpm-tmp.sGmeeR (%build)
  • error 8
  • RPM build errors:
  • error 9
  • error: No files produced.

Content:

checking if we should skip the build
started at: Tue Nov  1 19:45:27 2022
killing old processes on a builder
sending signal 9 to pid -1
cleaning up /tmp
fetching https://srcbuilder.pld-linux.org/th//srpms/5af7c7e5-d8bf-4c8f-aea5-09076291673e/perl-HTML-Mason-PSGIHandler-0.53-4.src.rpm
fetched 23292 bytes, 90.8 K/s
installing srpm: perl-HTML-Mason-PSGIHandler-0.53-4.src.rpm
+ install -d /tmp/B.7_qixkk2/BUILD /tmp/B.7_qixkk2/RPMS
+ LC_ALL=en_US.UTF-8
+ rpm -qp --changelog perl-HTML-Mason-PSGIHandler-0.53-4.src.rpm
* Tue Nov 01 2022 PLD Linux Team <feedback@pld-linux.org>
- For complete changelog see: http://git.pld-linux.org/?p=packages/perl-HTML-Mason-PSGIHandler.git;a=log;h=master
* Tue Nov 01 2022 Arkadiusz Miśkiewicz <arekm@maven.pl> c94b951
- Rel 4 * Tue Feb 22 2022 Jan Rękorajski <baggins@pld-linux.org> 288d8c0
- Release 3 (by relup.sh) * Sat Jan 25 2020 Jan Rękorajski <baggins@pld-linux.org> 0b435a2
- drop obsolete and outdated manual inclusion of rpm macros * Thu Oct 17 2013 Jan Rękorajski <baggins@pld-linux.org> 14e3fe8
- use new noautoreq macros - rel 2 * Thu Oct 10 2013 Arkadiusz Miśkiewicz <arekm@maven.pl> 56ff380
- up to 0.53 * Mon Jul 16 2012 Jan Rękorajski <baggins@pld-linux.org> 0dbc2de
- Fix auto-reqs Release 3 * Wed Jul 06 2011 Arkadiusz Miśkiewicz <arekm@maven.pl> 51bae54
- rel 2 * Wed Jul 06 2011 Arkadiusz Miśkiewicz <arekm@maven.pl> ba7af55
- initial + rpm -Uhv --nodeps --define '_topdir /tmp/B.7_qixkk2' --define '_specdir %{_topdir}' --define '_sourcedir %{_specdir}' --define '_rpmdir %{_topdir}/RPMS' --define '_builddir %{_topdir}/BUILD' perl-HTML-Mason-PSGIHandler-0.53-4.src.rpm Updating / installing... perl-HTML-Mason-PSGIHandler-0.53-4 ######################################## + rm -f perl-HTML-Mason-PSGIHandler-0.53-4.src.rpm + install -m 700 -d /tmp/B.7_qixkk2/BUILD/tmp + TMPDIR=/tmp/B.7_qixkk2/BUILD/tmp + exec nice -n 0 rpmbuild -bp --short-circuit --nodeps --define '_topdir /tmp/B.7_qixkk2' --define '_specdir %{_topdir}' --define '_sourcedir %{_specdir}' --define '_rpmdir %{_topdir}/RPMS' --define '_builddir %{_topdir}/BUILD' --target i686-pld-linux --define 'prep exit 0' /tmp/B.7_qixkk2/perl-HTML-Mason-PSGIHandler.spec warning: Could not canonicalize hostname: nereid Building target platforms: i686-pld-linux Building for target i686-pld-linux RPM build warnings: Could not canonicalize hostname: nereid checking BuildConflict-ing packages rpm: warning: Could not canonicalize hostname: nereid rpm: error: Failed build dependencies: rpm: perl-CGI-PSGI is needed by perl-HTML-Mason-PSGIHandler-0.53-4.noarch rpm: perl-HTML-Mason >= 1.12 is needed by perl-HTML-Mason-PSGIHandler-0.53-4.noarch rpm: Building target platforms: i686-pld-linux rpm: Building for target i686-pld-linux rpm: rpm: RPM build warnings: rpm: Could not canonicalize hostname: nereid no BuildConflicts found checking BR rpm: warning: Could not canonicalize hostname: nereid rpm: error: Failed build dependencies: rpm: perl-CGI-PSGI is needed by perl-HTML-Mason-PSGIHandler-0.53-4.noarch rpm: perl-HTML-Mason >= 1.12 is needed by perl-HTML-Mason-PSGIHandler-0.53-4.noarch rpm: Building target platforms: i686-pld-linux rpm: Building for target i686-pld-linux rpm: rpm: RPM build warnings: rpm: Could not canonicalize hostname: nereid updating poldek cache... ready is up to date th is up to date th is up to date th-ready is up to date th-ready is up to date Retrieving diff::packages.ndir.2022.11.01-17.59.01.gz......................................done Loading [pndir]th-test... Applying packages.ndir.2022.11.01-17.59.01.gz... Writing /root/.cache/poldek/[...]/packages.ndir.gz... Loading [pndir]th-test... Applying packages.ndir.2022.11.01-18.07.02.gz... Applying packages.ndir.2022.11.01-18.11.02.gz... Applying packages.ndir.2022.11.01-18.12.01.gz... Writing /root/.cache/poldek/[...]/packages.ndir.gz... checking conflicting packages in BRed packages poldek: Loading [pndir]ready... poldek: Loading [pndir]th-test... poldek: Loading [pndir]th-test... poldek: Loading [pndir]th-ready... poldek: Loading [pndir]th-ready... poldek: Loading [pndir]th... poldek: Loading [pndir]th... poldek: 34752 packages read poldek: Removed 4371 duplicate packages from available set poldek: Processing dependencies... poldek: There are 2 packages to install: poldek: A perl-CGI-PSGI-0.15-1 perl-HTML-Mason-1.59-1 poldek: This operation will use 702.9KB of disk space. poldek: Need to get 318.9KB of archives (318.9KB to download). poldek: poldek: Retrieving [1/2] th::perl-CGI-PSGI-0.15-1.noarch.rpm.......................................done poldek: Retrieving [2/2] th::perl-HTML-Mason-1.59-1.noarch.rpm.....................................done poldek: perl-CGI-PSGI-0.15-1.noarch.rpm: digests OK poldek: perl-HTML-Mason-1.59-1.noarch.rpm: digests OK poldek: Executing pm-command.sh --upgrade -vh --test --root / --define _check_dirname_deps 0... poldek: warning: /root/.cache/poldek/ftp_ftp1.pld-linux.org.dists.th.PLD.noarch.RPMS/perl-CGI-PSGI-0.15-1.noarch.rpm: Header V4 DSA/SHA1 Signature, key ID e4f1bc2d: NOKEY poldek: Verifying... ######################################## poldek: Preparing... ######################################## no conflicts found checking BR rpm: warning: Could not canonicalize hostname: nereid rpm: error: Failed build dependencies: rpm: perl-CGI-PSGI is needed by perl-HTML-Mason-PSGIHandler-0.53-4.noarch rpm: perl-HTML-Mason >= 1.12 is needed by perl-HTML-Mason-PSGIHandler-0.53-4.noarch rpm: Building target platforms: i686-pld-linux rpm: Building for target i686-pld-linux rpm: rpm: RPM build warnings: rpm: Could not canonicalize hostname: nereid installing BR: perl\-CGI\-PSGI perl\-HTML\-Mason + poldek --noask --caplookup -Q -v '--ignore=hhvm-*' '--ignore=php4-*' '--ignore=php52-*' '--ignore=php54-*' '--ignore=php55-*' '--ignore=php56-*' '--ignore=php70-*' '--ignore=php71-*' '--ignore=php72-*' '--ignore=php73-*' '--ignore=php74-*' '--ignore=php80-*' '--ignore=php81-*' '--ignore=php82-*' --upgrade perl-CGI-PSGI perl-HTML-Mason Loading [pndir]ready... Loading [pndir]th-test... Loading [pndir]th-test... Loading [pndir]th-ready... Loading [pndir]th-ready... Loading [pndir]th... Loading [pndir]th... 34752 packages read Removed 4371 duplicate packages from available set Processing dependencies... There are 2 packages to install: A perl-CGI-PSGI-0.15-1 perl-HTML-Mason-1.59-1 This operation will use 702.9KB of disk space. perl-CGI-PSGI-0.15-1.noarch.rpm: digests OK perl-HTML-Mason-1.59-1.noarch.rpm: digests OK Need to get 318.9KB of archives. perl-CGI-PSGI-0.15-1.noarch.rpm: digests OK perl-HTML-Mason-1.59-1.noarch.rpm: digests OK Executing pm-command.sh --upgrade -vh --root / --define _check_dirname_deps 0... warning: /root/.cache/poldek/ftp_ftp1.pld-linux.org.dists.th.PLD.noarch.RPMS/perl-CGI-PSGI-0.15-1.noarch.rpm: Header V4 DSA/SHA1 Signature, key ID e4f1bc2d: NOKEY Verifying... ######################################## Preparing... ######################################## Updating / installing... perl-HTML-Mason-3:1.59-1 ######################################## perl-CGI-PSGI-0:0.15-1 ######################################## building RPM using: set -ex; : build-id: 5af7c7e5-d8bf-4c8f-aea5-09076291673e; TMPDIR=/tmp/B.7_qixkk2/BUILD/tmp exec nice -n 0 rpmbuild -bb --define '__jobs 28' --define '_smp_mflags -j28' --define '_make_opts -Otarget' --define '_pld_builder 1' --define '_topdir /tmp/B.7_qixkk2' --define '_specdir %{_topdir}' --define '_sourcedir %{_specdir}' --define '_rpmdir %{_topdir}/RPMS' --define '_builddir %{_topdir}/BUILD' --target i686-pld-linux /tmp/B.7_qixkk2/perl-HTML-Mason-PSGIHandler.spec + : build-id: 5af7c7e5-d8bf-4c8f-aea5-09076291673e + TMPDIR=/tmp/B.7_qixkk2/BUILD/tmp + exec nice -n 0 rpmbuild -bb --define '__jobs 28' --define '_smp_mflags -j28' --define '_make_opts -Otarget' --define '_pld_builder 1' --define '_topdir /tmp/B.7_qixkk2' --define '_specdir %{_topdir}' --define '_sourcedir %{_specdir}' --define '_rpmdir %{_topdir}/RPMS' --define '_builddir %{_topdir}/BUILD' --target i686-pld-linux /tmp/B.7_qixkk2/perl-HTML-Mason-PSGIHandler.spec warning: Could not canonicalize hostname: nereid Building target platforms: i686-pld-linux Building for target i686-pld-linux Executing(%prep): /bin/sh -e /tmp/B.7_qixkk2/BUILD/tmp/rpm-tmp.QgKu4v + umask 022 + cd /tmp/B.7_qixkk2/BUILD + cd /tmp/B.7_qixkk2/BUILD + rm -rf HTML-Mason-PSGIHandler-0.53 + /bin/gzip -dc /tmp/B.7_qixkk2/HTML-Mason-PSGIHandler-0.53.tar.gz + /bin/tar -xof - + STATUS=0 + '[' 0 -ne 0 ']' + cd HTML-Mason-PSGIHandler-0.53 + /bin/chmod -Rf a+rX,u+w,g-w,o-w . + RPM_EC=0 + jobs -p + exit 0 Executing(%build): /bin/sh -e /tmp/B.7_qixkk2/BUILD/tmp/rpm-tmp.sGmeeR TMP=/home/users/builder/tmp HOME=/home/users/builder PATH=/home/users/builder/GNUstep/Tools:/bin:/usr/bin:/usr/local/bin:/home/users/builder/bin TMPDIR=/tmp/B.7_qixkk2/BUILD/tmp + umask 022 + cd /tmp/B.7_qixkk2/BUILD + cd HTML-Mason-PSGIHandler-0.53 + /usr/bin/perl Makefile.PL 'INSTALLDIRS=vendor' Warning: prerequisite Plack::Test 0 not found. Checking if your kit is complete... Looks good Generating a Unix-style Makefile Writing Makefile for HTML::Mason::PSGIHandler Writing MYMETA.yml and MYMETA.json + /usr/bin/make -Otarget -j28 cp lib/HTML/Mason/PSGIHandler.pm blib/lib/HTML/Mason/PSGIHandler.pm cp lib/HTML/Mason/PSGIHandler/Streamy.pm blib/lib/HTML/Mason/PSGIHandler/Streamy.pm Manifying 1 pod document + /usr/bin/make -Otarget -j28 test PERL_DL_NONLAZY=1 "/usr/bin/perl5.36.0" "-MExtUtils::Command::MM" "-MTest::Harness" "-e" "undef *Test::Harness::Switches; test_harness(0, 'blib/lib', 'blib/arch')" t/*.t t/00-compile.t ............. ok Can't locate Plack/Test.pm in @INC (you may need to install the Plack::Test module) (@INC contains: /tmp/B.7_qixkk2/BUILD/HTML-Mason-PSGIHandler-0.53/blib/lib /tmp/B.7_qixkk2/BUILD/HTML-Mason-PSGIHandler-0.53/blib/arch /usr/local/lib/perl5/5.36.0/i686-pld-linux-thread-multi /usr/local/share/perl5 /usr/lib/perl5/vendor_perl/5.36.0/i686-pld-linux-thread-multi /usr/share/perl5/vendor_perl /usr/lib/perl5/5.36.0/i686-pld-linux-thread-multi /usr/share/perl5/5.36.0 .) at t/hello.t line 4. BEGIN failed--compilation aborted at t/hello.t line 4. t/hello.t .................. Dubious, test returned 2 (wstat 512, 0x200) No subtests run Can't locate Plack/Test.pm in @INC (you may need to install the Plack::Test module) (@INC contains: /tmp/B.7_qixkk2/BUILD/HTML-Mason-PSGIHandler-0.53/blib/lib /tmp/B.7_qixkk2/BUILD/HTML-Mason-PSGIHandler-0.53/blib/arch /usr/local/lib/perl5/5.36.0/i686-pld-linux-thread-multi /usr/local/share/perl5 /usr/lib/perl5/vendor_perl/5.36.0/i686-pld-linux-thread-multi /usr/share/perl5/vendor_perl /usr/lib/perl5/5.36.0/i686-pld-linux-thread-multi /usr/share/perl5/5.36.0 .) at t/leaks.t line 4. BEGIN failed--compilation aborted at t/leaks.t line 4. t/leaks.t .................. Dubious, test returned 2 (wstat 512, 0x200) No subtests run t/release-dist-manifest.t .. skipped: these tests are for release candidate testing t/release-distmeta.t ....... skipped: these tests are for release candidate testing t/release-eol.t ............ skipped: these tests are for release candidate testing t/release-has-version.t .... skipped: these tests are for release candidate testing t/release-no-tabs.t ........ skipped: these tests are for release candidate testing t/release-pod.t ............ skipped: these tests are for release candidate testing t/release-synopsis.t ....... skipped: these tests are for release candidate testing Can't locate Plack/Test.pm in @INC (you may need to install the Plack::Test module) (@INC contains: /tmp/B.7_qixkk2/BUILD/HTML-Mason-PSGIHandler-0.53/blib/lib /tmp/B.7_qixkk2/BUILD/HTML-Mason-PSGIHandler-0.53/blib/arch /usr/local/lib/perl5/5.36.0/i686-pld-linux-thread-multi /usr/local/share/perl5 /usr/lib/perl5/vendor_perl/5.36.0/i686-pld-linux-thread-multi /usr/share/perl5/vendor_perl /usr/lib/perl5/5.36.0/i686-pld-linux-thread-multi /usr/share/perl5/5.36.0 .) at t/streamy.t line 4. BEGIN failed--compilation aborted at t/streamy.t line 4. t/streamy.t ................ Dubious, test returned 2 (wstat 512, 0x200) No subtests run Test Summary Report ------------------- t/hello.t (Wstat: 512 (exited 2) Tests: 0 Failed: 0) Non-zero exit status: 2 Parse errors: No plan found in TAP output t/leaks.t (Wstat: 512 (exited 2) Tests: 0 Failed: 0) Non-zero exit status: 2 Parse errors: No plan found in TAP output t/streamy.t (Wstat: 512 (exited 2) Tests: 0 Failed: 0) Non-zero exit status: 2 Parse errors: No plan found in TAP output Files=11, Tests=2, 1 wallclock secs ( 0.06 usr 0.01 sys + 0.93 cusr 0.14 csys = 1.14 CPU) Result: FAIL Failed 3/11 test programs. 0/2 subtests failed. make: *** [Makefile:858: test_dynamic] Error 2 error: Bad exit status from /tmp/B.7_qixkk2/BUILD/tmp/rpm-tmp.sGmeeR (%build) RPM build warnings: Could not canonicalize hostname: nereid RPM build errors: Bad exit status from /tmp/B.7_qixkk2/BUILD/tmp/rpm-tmp.sGmeeR (%build) ended at: Tue Nov 1 19:45:48 2022, done in 0:00:01.833156 error: No files produced. + chmod -R u+rwX /tmp/B.7_qixkk2/BUILD + rm -rf /tmp/B.7_qixkk2/tmp /tmp/B.7_qixkk2/BUILD + rm -rf /tmp/B.7_qixkk2 Begin-PLD-Builder-Info Build-Time: user:10.06s sys:2.35s real:21.44s (faults io:17 non-io:405040) End-PLD-Builder-Info
[Back to list of logs] [View rpm -qa of builder]