FailedOk

th/SRPMS[OK]
th/x32[OK]
th/i686[OK]
th/x86_64[OK]

ac/SRPMS[OK]
ac/i386[OK]
ac/i586[OK]
ac/i686[OK]
ac/alpha[OK]
ac/amd64[OK]
ac/athlon[OK]
ac/ppc[OK]
ac/sparc[OK]
ac/sparc64[OK]

Advanced Search
main()
Powered by PLD Linux
(c) 2002-2020 PLD Team
$Revision: 1.37 $
Powered by computron.
Your IP: 34.200.222.93

perl-MooX-TypeTiny B938190A-DE4A-4240-BF2C-2A328BD61D0D

Status:Failed
Source URL:https://buildlogs.pld-linux.org/pld/th/i686/FAIL/perl-MooX-TypeTiny,B938190A-DE4A-4240-BF2C-2A328BD61D0D.bz2
text/plain URL:View!
full text:View!
rpm -qa of builder:View!
Date:2020/07/21 10:47:38
Runtime:0:00:02.073482

Toc:

  • error 1
  • rpm: error: Failed build dependencies:
  • error 2
  • rpm: error: Failed build dependencies:
  • prep
  • Executing(%prep): /bin/sh -e /tmp/B.etQLVD/BUILD/tmp/rpm-tmp.45818
  • build
  • Executing(%build): /bin/sh -e /tmp/B.etQLVD/BUILD/tmp/rpm-tmp.45818
  • error 3
  • Parse errors: No plan found in TAP output
  • error 4
  • Parse errors: No plan found in TAP output
  • error 5
  • Parse errors: No plan found in TAP output
  • error 6
  • Parse errors: No plan found in TAP output
  • error 7
  • Parse errors: No plan found in TAP output
  • error 8
  • error: Bad exit status from /tmp/B.etQLVD/BUILD/tmp/rpm-tmp.45818 (%build)
  • error 9
  • RPM build errors:
  • error 10
  • error: No files produced.

Content:

checking if we should skip the build
started at: Tue Jul 21 10:47:17 2020
killing old processes on a builder
sending signal 9 to pid -1
Killed
cleaning up /tmp
fetching https://srcbuilder.pld-linux.org/th//srpms/B938190A-DE4A-4240-BF2C-2A328BD61D0D/perl-MooX-TypeTiny-0.002003-1.src.rpm
fetched 21307 bytes, 77.0 K/s
installing srpm: perl-MooX-TypeTiny-0.002003-1.src.rpm
+ install -d /tmp/B.etQLVD/BUILD /tmp/B.etQLVD/RPMS
+ LC_ALL=en_US.UTF-8
+ rpm -qp --changelog perl-MooX-TypeTiny-0.002003-1.src.rpm
* Tue Jul 21 2020 PLD Linux Team <feedback@pld-linux.org>
- For complete changelog see: http://git.pld-linux.org/?p=packages/perl-MooX-TypeTiny.git;a=log;h=master
* Tue Jul 21 2020 Arkadiusz Miƛkiewicz <arekm@maven.pl> 705b933
- initial + rpm -Uhv --nodeps --define '_topdir /tmp/B.etQLVD' --define '_specdir %{_topdir}' --define '_sourcedir %{_specdir}' --define '_rpmdir %{_topdir}/RPMS' --define '_builddir %{_topdir}/BUILD' perl-MooX-TypeTiny-0.002003-1.src.rpm Preparing... ################################################## perl-MooX-TypeTiny ################################################## + rm -f perl-MooX-TypeTiny-0.002003-1.src.rpm + install -m 700 -d /tmp/B.etQLVD/BUILD/tmp + TMPDIR=/tmp/B.etQLVD/BUILD/tmp + exec nice -n 0 rpmbuild -bp --short-circuit --nodeps --define '_topdir /tmp/B.etQLVD' --define '_specdir %{_topdir}' --define '_sourcedir %{_specdir}' --define '_rpmdir %{_topdir}/RPMS' --define '_builddir %{_topdir}/BUILD' --target i686-pld-linux --define 'prep exit 0' /tmp/B.etQLVD/perl-MooX-TypeTiny.spec Building target platforms: i686-pld-linux checking BuildConflict-ing packages no BuildConflicts found checking BR rpm: error: Failed build dependencies: rpm: perl-Type-Tiny >= 1.008 is needed by perl-MooX-TypeTiny-0.002003-1.src rpm: Building target platforms: i686-pld-linux updating poldek cache... ready is up to date th is up to date th is up to date th-ready is up to date th-ready is up to date Retrieving diff::packages.ndir.2020.07.21-01.47.02.gz......................................done Loading [pndir]th-test... Applying packages.ndir.2020.07.21-01.47.02.gz... Writing /root/.poldek-cache/[...]/packages.ndir.gz... th-test is up to date checking conflicting packages in BRed packages poldek: Loading [pndir]ready... poldek: Loading [pndir]th-test... poldek: Loading [pndir]th-test... poldek: Loading [pndir]th-ready... poldek: Loading [pndir]th-ready... poldek: Loading [pndir]th... poldek: Loading [pndir]th... poldek: 30905 packages read poldek: Removed 2502 duplicate packages from available set poldek: Processing dependencies... poldek: perl-Type-Tiny-1.006000-1.noarch marks perl-Reply-0.42-1.noarch (cap /usr/share/perl5/vendor_perl/Reply/Plugin) poldek: perl-Reply-0.42-1.noarch marks perl-App-Nopaste-1.013-1.noarch (cap perl(App::Nopaste)) poldek: perl-App-Nopaste-1.013-1.noarch marks perl-Getopt-Long-Descriptive-0.096-1.noarch (cap perl(Getopt::Long::Descriptive)) poldek: perl-App-Nopaste-1.013-1.noarch marks perl-JSON-MaybeXS-1.004000-1.noarch (cap perl(JSON::MaybeXS)) poldek: perl-App-Nopaste-1.013-1.noarch marks perl-WWW-Mechanize-1.95-1.noarch (cap perl(WWW::Mechanize)) poldek: perl-WWW-Mechanize-1.95-1.noarch marks perl-HTML-Form-6.07-1.noarch (cap perl(HTML::Form) >= 1.00) poldek: perl-Reply-0.42-1.noarch marks perl-B-Keywords-1.20-1.noarch (cap perl(B::Keywords)) poldek: perl-Reply-0.42-1.noarch marks perl-Class-Refresh-0.07-2.noarch (cap perl(Class::Refresh) >= 0.05) poldek: perl-Class-Refresh-0.07-2.noarch marks perl-Class-Unload-0.11-1.noarch (cap perl(Class::Unload)) poldek: perl-Reply-0.42-1.noarch marks perl-Config-INI-Reader-Ordered-0.020-1.noarch (cap perl(Config::INI::Reader::Ordered)) poldek: perl-Config-INI-Reader-Ordered-0.020-1.noarch marks perl-Config-INI-0.025-1.noarch (cap /usr/share/perl5/vendor_perl/Config/INI) poldek: perl-Config-INI-0.025-1.noarch marks perl-Mixin-Linewise-0.108-1.noarch (cap perl(Mixin::Linewise::Readers) >= 0.105) poldek: perl-Mixin-Linewise-0.108-1.noarch marks perl-PerlIO-utf8_strict-0.007-2.i686 (cap perl(PerlIO::utf8_strict)) poldek: perl-Reply-0.42-1.noarch marks perl-Data-Printer-0.40-1.noarch (cap perl(Data::Printer)) poldek: perl-Data-Printer-0.40-1.noarch marks perl-Clone-PP-1.07-1.noarch (cap perl(Clone::PP)) poldek: perl-Data-Printer-0.40-1.noarch marks perl-Sort-Naturally-1.03-1.noarch (cap perl(Sort::Naturally)) poldek: perl-Reply-0.42-1.noarch marks perl-Proc-InvokeEditor-1.13-1.noarch (cap perl(Proc::InvokeEditor)) poldek: There are 18 packages to install (17 marked by dependencies): poldek: A perl-App-Nopaste-1.013-1.noarch perl-B-Keywords-1.20-1.noarch poldek: A perl-Class-Refresh-0.07-2.noarch perl-Class-Unload-0.11-1.noarch poldek: A perl-Clone-PP-1.07-1.noarch perl-Config-INI-0.025-1.noarch poldek: A perl-Config-INI-Reader-Ordered-0.020-1.noarch poldek: A perl-Data-Printer-0.40-1.noarch poldek: A perl-Getopt-Long-Descriptive-0.096-1.noarch poldek: A perl-HTML-Form-6.07-1.noarch perl-JSON-MaybeXS-1.004000-1.noarch poldek: A perl-Mixin-Linewise-0.108-1.noarch perl-PerlIO-utf8_strict-0.007-2.i686 poldek: A perl-Proc-InvokeEditor-1.13-1.noarch perl-Reply-0.42-1.noarch poldek: A perl-Sort-Naturally-1.03-1.noarch perl-Type-Tiny-1.006000-1.noarch poldek: A perl-WWW-Mechanize-1.95-1.noarch poldek: This operation will use 1.4MB of disk space. poldek: Need to get 780.9KB of archives (747.1KB to download). poldek: poldek: Retrieving [1/16] th::perl-Getopt-Long-Descriptive-0.096-1.noarch.rpm..............................done poldek: Retrieving [2/16] th::perl-HTML-Form-6.07-1.noarch.rpm.....................................done poldek: Retrieving [3/16] th::perl-WWW-Mechanize-1.95-1.noarch.rpm.................................done poldek: Retrieving [4/16] th::perl-App-Nopaste-1.013-1.noarch.rpm..................................done poldek: Retrieving [5/16] th::perl-B-Keywords-1.20-1.noarch.rpm....................................done poldek: Retrieving [6/16] th::perl-Class-Unload-0.11-1.noarch.rpm..................................done poldek: Retrieving [7/16] th::perl-Class-Refresh-0.07-2.noarch.rpm.................................done poldek: Retrieving [8/16] th::perl-Clone-PP-1.07-1.noarch.rpm......................................done poldek: Retrieving [9/16] th::perl-Mixin-Linewise-0.108-1.noarch.rpm...............................done poldek: Retrieving [10/16] th::perl-Config-INI-0.025-1.noarch.rpm..................................done poldek: Retrieving [11/16] th::perl-Config-INI-Reader-Ordered-0.020-1.noarch.rpm..............................done poldek: Retrieving [12/16] th::perl-Data-Printer-0.40-1.noarch.rpm.................................done poldek: Retrieving [13/16] th::perl-Proc-InvokeEditor-1.13-1.noarch.rpm..............................done poldek: Retrieving [14/16] th::perl-Reply-0.42-1.noarch.rpm........................................done poldek: Retrieving [15/16] th::perl-Type-Tiny-1.006000-1.noarch.rpm................................done poldek: Retrieving [16/16] th::perl-PerlIO-utf8_strict-0.007-2.i686.rpm..............................done poldek: Executing pm-command.sh --upgrade -vh --test --root / --define _check_dirname_deps 1... poldek: Preparing... ################################################## no conflicts found checking BR rpm: error: Failed build dependencies: rpm: perl-Type-Tiny >= 1.008 is needed by perl-MooX-TypeTiny-0.002003-1.src rpm: Building target platforms: i686-pld-linux installing BR: perl\-Type\-Tiny + poldek --noask --caplookup -Q -v '--ignore=hhvm-*' '--ignore=php4-*' '--ignore=php52-*' '--ignore=php54-*' '--ignore=php55-*' '--ignore=php56-*' '--ignore=php70-*' '--ignore=php71-*' '--ignore=php72-*' '--ignore=php73-*' '--ignore=php74-*' --upgrade perl-Type-Tiny Loading [pndir]ready... Loading [pndir]th-test... Loading [pndir]th-test... Loading [pndir]th-ready... Loading [pndir]th-ready... Loading [pndir]th... Loading [pndir]th... 30905 packages read Removed 2502 duplicate packages from available set Processing dependencies... perl-Type-Tiny-1.006000-1.noarch marks perl-Reply-0.42-1.noarch (cap /usr/share/perl5/vendor_perl/Reply/Plugin) perl-Reply-0.42-1.noarch marks perl-App-Nopaste-1.013-1.noarch (cap perl(App::Nopaste)) perl-App-Nopaste-1.013-1.noarch marks perl-Getopt-Long-Descriptive-0.096-1.noarch (cap perl(Getopt::Long::Descriptive)) perl-App-Nopaste-1.013-1.noarch marks perl-JSON-MaybeXS-1.004000-1.noarch (cap perl(JSON::MaybeXS)) perl-App-Nopaste-1.013-1.noarch marks perl-WWW-Mechanize-1.95-1.noarch (cap perl(WWW::Mechanize)) perl-WWW-Mechanize-1.95-1.noarch marks perl-HTML-Form-6.07-1.noarch (cap perl(HTML::Form) >= 1.00) perl-Reply-0.42-1.noarch marks perl-B-Keywords-1.20-1.noarch (cap perl(B::Keywords)) perl-Reply-0.42-1.noarch marks perl-Class-Refresh-0.07-2.noarch (cap perl(Class::Refresh) >= 0.05) perl-Class-Refresh-0.07-2.noarch marks perl-Class-Unload-0.11-1.noarch (cap perl(Class::Unload)) perl-Reply-0.42-1.noarch marks perl-Config-INI-Reader-Ordered-0.020-1.noarch (cap perl(Config::INI::Reader::Ordered)) perl-Config-INI-Reader-Ordered-0.020-1.noarch marks perl-Config-INI-0.025-1.noarch (cap /usr/share/perl5/vendor_perl/Config/INI) perl-Config-INI-0.025-1.noarch marks perl-Mixin-Linewise-0.108-1.noarch (cap perl(Mixin::Linewise::Readers) >= 0.105) perl-Mixin-Linewise-0.108-1.noarch marks perl-PerlIO-utf8_strict-0.007-2.i686 (cap perl(PerlIO::utf8_strict)) perl-Reply-0.42-1.noarch marks perl-Data-Printer-0.40-1.noarch (cap perl(Data::Printer)) perl-Data-Printer-0.40-1.noarch marks perl-Clone-PP-1.07-1.noarch (cap perl(Clone::PP)) perl-Data-Printer-0.40-1.noarch marks perl-Sort-Naturally-1.03-1.noarch (cap perl(Sort::Naturally)) perl-Reply-0.42-1.noarch marks perl-Proc-InvokeEditor-1.13-1.noarch (cap perl(Proc::InvokeEditor)) There are 18 packages to install (17 marked by dependencies): A perl-App-Nopaste-1.013-1.noarch perl-B-Keywords-1.20-1.noarch A perl-Class-Refresh-0.07-2.noarch perl-Class-Unload-0.11-1.noarch A perl-Clone-PP-1.07-1.noarch perl-Config-INI-0.025-1.noarch A perl-Config-INI-Reader-Ordered-0.020-1.noarch A perl-Data-Printer-0.40-1.noarch A perl-Getopt-Long-Descriptive-0.096-1.noarch A perl-HTML-Form-6.07-1.noarch perl-JSON-MaybeXS-1.004000-1.noarch A perl-Mixin-Linewise-0.108-1.noarch perl-PerlIO-utf8_strict-0.007-2.i686 A perl-Proc-InvokeEditor-1.13-1.noarch perl-Reply-0.42-1.noarch A perl-Sort-Naturally-1.03-1.noarch perl-Type-Tiny-1.006000-1.noarch A perl-WWW-Mechanize-1.95-1.noarch This operation will use 1.4MB of disk space. Need to get 780.9KB of archives. Executing pm-command.sh --upgrade -vh --root / --define _check_dirname_deps 1... Preparing... ################################################## perl-Proc-InvokeEditor ################################################## perl-Sort-Naturally ################################################## perl-Clone-PP ################################################## perl-Class-Unload ################################################## perl-B-Keywords ################################################## perl-HTML-Form ################################################## perl-JSON-MaybeXS ################################################## perl-Getopt-Long-Descriptive################################################## perl-PerlIO-utf8_strict ################################################## perl-Data-Printer ################################################## perl-Class-Refresh ################################################## perl-WWW-Mechanize ################################################## perl-Mixin-Linewise ################################################## perl-App-Nopaste ################################################## perl-Config-INI ################################################## perl-Config-INI-Reader-Order################################################## perl-Reply ################################################## perl-Type-Tiny ################################################## building RPM using: set -ex; : build-id: B938190A-DE4A-4240-BF2C-2A328BD61D0D; TMPDIR=/tmp/B.etQLVD/BUILD/tmp exec nice -n 0 rpmbuild -bb --define '_smp_mflags -j9' --define '_make_opts -Otarget' --define '_pld_builder 1' --define '_topdir /tmp/B.etQLVD' --define '_specdir %{_topdir}' --define '_sourcedir %{_specdir}' --define '_rpmdir %{_topdir}/RPMS' --define '_builddir %{_topdir}/BUILD' --target i686-pld-linux /tmp/B.etQLVD/perl-MooX-TypeTiny.spec + : build-id: B938190A-DE4A-4240-BF2C-2A328BD61D0D + TMPDIR=/tmp/B.etQLVD/BUILD/tmp + exec nice -n 0 rpmbuild -bb --define '_smp_mflags -j9' --define '_make_opts -Otarget' --define '_pld_builder 1' --define '_topdir /tmp/B.etQLVD' --define '_specdir %{_topdir}' --define '_sourcedir %{_specdir}' --define '_rpmdir %{_topdir}/RPMS' --define '_builddir %{_topdir}/BUILD' --target i686-pld-linux /tmp/B.etQLVD/perl-MooX-TypeTiny.spec Building target platforms: i686-pld-linux Executing(%prep): /bin/sh -e /tmp/B.etQLVD/BUILD/tmp/rpm-tmp.45818 + umask 022 + cd /tmp/B.etQLVD/BUILD + cd /tmp/B.etQLVD/BUILD + rm -rf MooX-TypeTiny-0.002003 + /bin/gzip -dc /tmp/B.etQLVD/MooX-TypeTiny-0.002003.tar.gz + /bin/tar -xf - + STATUS=0 + '[' 0 -ne 0 ']' + cd MooX-TypeTiny-0.002003 + /bin/id -u + '[' 1001 '=' 0 ']' + /bin/id -u + '[' 1001 '=' 0 ']' + /bin/chmod -Rf a+rX,u+w,g-w,o-w . + exit 0 Executing(%build): /bin/sh -e /tmp/B.etQLVD/BUILD/tmp/rpm-tmp.45818 TMP=/home/users/builder/tmp HOME=/home/users/builder PATH=/home/users/builder/GNUstep/Tools:/bin:/usr/bin:/usr/local/bin:/home/users/builder/bin TMPDIR=/tmp/B.etQLVD/BUILD/tmp + umask 022 + cd /tmp/B.etQLVD/BUILD + cd MooX-TypeTiny-0.002003 + /usr/bin/perl Makefile.PL 'INSTALLDIRS=vendor' Warning: prerequisite Moo 2.004 not found. We have 2.003006. Warning: prerequisite Type::Tiny 1.008 not found. We have 1.006000. Checking if your kit is complete... Looks good Generating a Unix-style Makefile Writing Makefile for MooX::TypeTiny Writing MYMETA.yml and MYMETA.json + /usr/bin/make -Otarget -j9 cp lib/MooX/TypeTiny/Role/GenerateAccessor.pm blib/lib/MooX/TypeTiny/Role/GenerateAccessor.pm cp lib/MooX/TypeTiny.pm blib/lib/MooX/TypeTiny.pm Manifying 1 pod document + /usr/bin/make -Otarget -j9 test PERL_DL_NONLAZY=1 "/usr/bin/perl5.30.3" "-MExtUtils::Command::MM" "-MTest::Harness" "-e" "undef *Test::Harness::Switches; test_harness(0, 'blib/lib', 'blib/arch')" t/*.t Can't locate object method "is_class" via package "Moo" at /tmp/B.etQLVD/BUILD/MooX-TypeTiny-0.002003/blib/lib/MooX/TypeTiny.pm line 14. BEGIN failed--compilation aborted at t/basic.t line 17. t/basic.t ......... Dubious, test returned 255 (wstat 65280, 0xff00) No subtests run # Failed test 'no c3 conflicts for attributes with lazy+coerce' # at t/c3-conflict.t line 25. # got: 'Can't locate object method "is_class" via package "Moo" at /tmp/B.etQLVD/BUILD/MooX-TypeTiny-0.002003/blib/lib/MooX/TypeTiny.pm line 14. # BEGIN failed--compilation aborted at (eval 62) line 4. # ' # expected: undef # Looks like you failed 1 test of 1. t/c3-conflict.t ... Dubious, test returned 1 (wstat 256, 0x100) Failed 1/1 subtests Can't locate object method "is_class" via package "Moo" at /tmp/B.etQLVD/BUILD/MooX-TypeTiny-0.002003/blib/lib/MooX/TypeTiny.pm line 14. BEGIN failed--compilation aborted at t/clean.t line 8. t/clean.t ......... Dubious, test returned 255 (wstat 65280, 0xff00) No subtests run Can't locate object method "is_class" via package "Moo" at /tmp/B.etQLVD/BUILD/MooX-TypeTiny-0.002003/blib/lib/MooX/TypeTiny.pm line 14. BEGIN failed--compilation aborted at t/default-once.t line 11. t/default-once.t .. Dubious, test returned 255 (wstat 65280, 0xff00) No subtests run Can't locate object method "is_class" via package "Moo" at /tmp/B.etQLVD/BUILD/MooX-TypeTiny-0.002003/blib/lib/MooX/TypeTiny.pm line 14. BEGIN failed--compilation aborted at t/nested.t line 10. t/nested.t ........ Dubious, test returned 255 (wstat 65280, 0xff00) No subtests run Can't locate object method "is_class" via package "Moo" at /tmp/B.etQLVD/BUILD/MooX-TypeTiny-0.002003/blib/lib/MooX/TypeTiny.pm line 14. BEGIN failed--compilation aborted at t/noninline.t line 17. t/noninline.t ..... Dubious, test returned 255 (wstat 65280, 0xff00) No subtests run Test Summary Report ------------------- t/basic.t (Wstat: 65280 Tests: 0 Failed: 0) Non-zero exit status: 255 Parse errors: No plan found in TAP output t/c3-conflict.t (Wstat: 256 Tests: 1 Failed: 1) Failed test: 1 Non-zero exit status: 1 t/clean.t (Wstat: 65280 Tests: 0 Failed: 0) Non-zero exit status: 255 Parse errors: No plan found in TAP output t/default-once.t (Wstat: 65280 Tests: 0 Failed: 0) Non-zero exit status: 255 Parse errors: No plan found in TAP output t/nested.t (Wstat: 65280 Tests: 0 Failed: 0) Non-zero exit status: 255 Parse errors: No plan found in TAP output t/noninline.t (Wstat: 65280 Tests: 0 Failed: 0) Non-zero exit status: 255 Parse errors: No plan found in TAP output Files=6, Tests=1, 1 wallclock secs ( 0.03 usr 0.00 sys + 0.80 cusr 0.07 csys = 0.90 CPU) Result: FAIL Failed 6/6 test programs. 1/1 subtests failed. make: *** [Makefile:849: test_dynamic] Error 255 error: Bad exit status from /tmp/B.etQLVD/BUILD/tmp/rpm-tmp.45818 (%build) RPM build errors: Bad exit status from /tmp/B.etQLVD/BUILD/tmp/rpm-tmp.45818 (%build) ended at: Tue Jul 21 10:47:38 2020, done in 0:00:02.073482 error: No files produced. + chmod -R u+rwX /tmp/B.etQLVD/BUILD + rm -rf /tmp/B.etQLVD/tmp /tmp/B.etQLVD/BUILD + rm -rf /tmp/B.etQLVD Begin-PLD-Builder-Info Build-Time: user:10.43s sys:1.67s real:21.89s (faults io:0 non-io:449822) End-PLD-Builder-Info
[Back to list of logs] [View rpm -qa of builder]