FailedOk

th/SRPMS[OK]
th/x32[OK]
th/i686[OK]
th/x86_64[OK]

ac/SRPMS[OK]
ac/i386[OK]
ac/i586[OK]
ac/i686[OK]
ac/alpha[OK]
ac/amd64[OK]
ac/athlon[OK]
ac/ppc[OK]
ac/sparc[OK]
ac/sparc64[OK]

Advanced Search
main()
Powered by PLD Linux
(c) 2002-2021 PLD Team
$Revision: 1.37 $
Powered by ufo.
Your IP: 54.227.97.219

php-pecl-bcompiler a370d466-09aa-42f8-9483-2b4804246e9b

Status:Failed
Source URL:https://buildlogs.pld-linux.org/pld/th/i686/FAIL/php-pecl-bcompiler,a370d466-09aa-42f8-9483-2b4804246e9b.bz2
text/plain URL:View!
full text:View!
rpm -qa of builder:View!
Date:2014/04/28 14:13:48
Runtime:0:00:06.549749

Toc:

  • error 1
  • /tmp/B.df031185-3ec0-4917-99ce-0ce3740a8d2c/BUILD/php-pecl-bcompiler-1.0.2/bcompiler_zend.c:475:7: error: 'IS_CLASS' undeclared (first use in this function)
  • error 2
  • /tmp/B.df031185-3ec0-4917-99ce-0ce3740a8d2c/BUILD/php-pecl-bcompiler-1.0.2/bcompiler_zend.c:476:7: error: 'IS_SCALAR' undeclared (first use in this function)
  • error 3
  • /tmp/B.df031185-3ec0-4917-99ce-0ce3740a8d2c/BUILD/php-pecl-bcompiler-1.0.2/bcompiler_zend.c:477:7: error: 'IS_NUMERIC' undeclared (first use in this function)
  • error 4
  • /tmp/B.df031185-3ec0-4917-99ce-0ce3740a8d2c/BUILD/php-pecl-bcompiler-1.0.2/bcompiler_zend.c:555:7: error: 'IS_CLASS' undeclared (first use in this function)
  • error 5
  • /tmp/B.df031185-3ec0-4917-99ce-0ce3740a8d2c/BUILD/php-pecl-bcompiler-1.0.2/bcompiler_zend.c:556:7: error: 'IS_SCALAR' undeclared (first use in this function)
  • error 6
  • /tmp/B.df031185-3ec0-4917-99ce-0ce3740a8d2c/BUILD/php-pecl-bcompiler-1.0.2/bcompiler_zend.c:557:7: error: 'IS_NUMERIC' undeclared (first use in this function)
  • error 7
  • /tmp/B.df031185-3ec0-4917-99ce-0ce3740a8d2c/BUILD/php-pecl-bcompiler-1.0.2/php_bcompiler.c:574:10: error: 'zend_class_entry' has no member named 'filename'
  • error 8
  • /tmp/B.df031185-3ec0-4917-99ce-0ce3740a8d2c/BUILD/php-pecl-bcompiler-1.0.2/php_bcompiler.c:574:33: error: 'zend_class_entry' has no member named 'filename'
  • error 9
  • /tmp/B.df031185-3ec0-4917-99ce-0ce3740a8d2c/BUILD/php-pecl-bcompiler-1.0.2/bcompiler_zend.c:639:27: error: 'zend_arg_info' has no member named 'return_reference'
  • error 10
  • /tmp/B.df031185-3ec0-4917-99ce-0ce3740a8d2c/BUILD/php-pecl-bcompiler-1.0.2/php_bcompiler.c:574:33: error: 'zend_class_entry' has no member named 'filename'
  • error 11
  • /tmp/B.df031185-3ec0-4917-99ce-0ce3740a8d2c/BUILD/php-pecl-bcompiler-1.0.2/php_bcompiler.c:574:33: error: 'zend_class_entry' has no member named 'filename'
  • error 12
  • /tmp/B.df031185-3ec0-4917-99ce-0ce3740a8d2c/BUILD/php-pecl-bcompiler-1.0.2/bcompiler_zend.c:640:27: error: 'zend_arg_info' has no member named 'required_num_args'
  • error 13
  • /tmp/B.df031185-3ec0-4917-99ce-0ce3740a8d2c/BUILD/php-pecl-bcompiler-1.0.2/php_bcompiler.c:574:33: error: 'zend_class_entry' has no member named 'filename'
  • error 14
  • /tmp/B.df031185-3ec0-4917-99ce-0ce3740a8d2c/BUILD/php-pecl-bcompiler-1.0.2/php_bcompiler.c:574:33: error: 'zend_class_entry' has no member named 'filename'
  • error 15
  • /tmp/B.df031185-3ec0-4917-99ce-0ce3740a8d2c/BUILD/php-pecl-bcompiler-1.0.2/php_bcompiler.c:574:33: error: 'zend_class_entry' has no member named 'filename'
  • error 16
  • /tmp/B.df031185-3ec0-4917-99ce-0ce3740a8d2c/BUILD/php-pecl-bcompiler-1.0.2/php_bcompiler.c:574:33: error: 'zend_class_entry' has no member named 'filename'
  • error 17
  • /tmp/B.df031185-3ec0-4917-99ce-0ce3740a8d2c/BUILD/php-pecl-bcompiler-1.0.2/php_bcompiler.c:574:33: error: 'zend_class_entry' has no member named 'filename'
  • error 18
  • /tmp/B.df031185-3ec0-4917-99ce-0ce3740a8d2c/BUILD/php-pecl-bcompiler-1.0.2/php_bcompiler.c:574:33: error: 'zend_class_entry' has no member named 'filename'
  • error 19
  • /tmp/B.df031185-3ec0-4917-99ce-0ce3740a8d2c/BUILD/php-pecl-bcompiler-1.0.2/php_bcompiler.c:574:33: error: 'zend_class_entry' has no member named 'filename'
  • error 20
  • /tmp/B.df031185-3ec0-4917-99ce-0ce3740a8d2c/BUILD/php-pecl-bcompiler-1.0.2/php_bcompiler.c:574:33: error: 'zend_class_entry' has no member named 'filename'
  • error 21
  • /tmp/B.df031185-3ec0-4917-99ce-0ce3740a8d2c/BUILD/php-pecl-bcompiler-1.0.2/php_bcompiler.c:574:33: error: 'zend_class_entry' has no member named 'filename'
  • error 22
  • /tmp/B.df031185-3ec0-4917-99ce-0ce3740a8d2c/BUILD/php-pecl-bcompiler-1.0.2/php_bcompiler.c:574:33: error: 'zend_class_entry' has no member named 'filename'
  • error 23
  • /tmp/B.df031185-3ec0-4917-99ce-0ce3740a8d2c/BUILD/php-pecl-bcompiler-1.0.2/php_bcompiler.c:574:33: error: 'zend_class_entry' has no member named 'filename'
  • error 24
  • /tmp/B.df031185-3ec0-4917-99ce-0ce3740a8d2c/BUILD/php-pecl-bcompiler-1.0.2/php_bcompiler.c:574:33: error: 'zend_class_entry' has no member named 'filename'
  • error 25
  • /tmp/B.df031185-3ec0-4917-99ce-0ce3740a8d2c/BUILD/php-pecl-bcompiler-1.0.2/php_bcompiler.c:574:33: error: 'zend_class_entry' has no member named 'filename'
  • error 26
  • /tmp/B.df031185-3ec0-4917-99ce-0ce3740a8d2c/BUILD/php-pecl-bcompiler-1.0.2/php_bcompiler.c:574:33: error: 'zend_class_entry' has no member named 'filename'
  • error 27
  • /tmp/B.df031185-3ec0-4917-99ce-0ce3740a8d2c/BUILD/php-pecl-bcompiler-1.0.2/php_bcompiler.c:574:33: error: 'zend_class_entry' has no member named 'filename'
  • error 28
  • /tmp/B.df031185-3ec0-4917-99ce-0ce3740a8d2c/BUILD/php-pecl-bcompiler-1.0.2/php_bcompiler.c:574:33: error: 'zend_class_entry' has no member named 'filename'
  • error 29
  • /tmp/B.df031185-3ec0-4917-99ce-0ce3740a8d2c/BUILD/php-pecl-bcompiler-1.0.2/php_bcompiler.c:574:33: error: 'zend_class_entry' has no member named 'filename'
  • error 30
  • /tmp/B.df031185-3ec0-4917-99ce-0ce3740a8d2c/BUILD/php-pecl-bcompiler-1.0.2/bcompiler_zend.c:670:30: error: 'zend_arg_info' has no member named 'return_reference'
  • error 31
  • /tmp/B.df031185-3ec0-4917-99ce-0ce3740a8d2c/BUILD/php-pecl-bcompiler-1.0.2/bcompiler_zend.c:671:30: error: 'zend_arg_info' has no member named 'required_num_args'
  • error 32
  • /tmp/B.df031185-3ec0-4917-99ce-0ce3740a8d2c/BUILD/php-pecl-bcompiler-1.0.2/php_bcompiler.c:635:10: error: 'zend_class_entry' has no member named 'filename'
  • error 33
  • /tmp/B.df031185-3ec0-4917-99ce-0ce3740a8d2c/BUILD/php-pecl-bcompiler-1.0.2/php_bcompiler.c:635:33: error: 'zend_class_entry' has no member named 'filename'
  • error 34
  • /tmp/B.df031185-3ec0-4917-99ce-0ce3740a8d2c/BUILD/php-pecl-bcompiler-1.0.2/php_bcompiler.c:635:33: error: 'zend_class_entry' has no member named 'filename'
  • error 35
  • /tmp/B.df031185-3ec0-4917-99ce-0ce3740a8d2c/BUILD/php-pecl-bcompiler-1.0.2/php_bcompiler.c:635:33: error: 'zend_class_entry' has no member named 'filename'
  • error 36
  • /tmp/B.df031185-3ec0-4917-99ce-0ce3740a8d2c/BUILD/php-pecl-bcompiler-1.0.2/php_bcompiler.c:635:33: error: 'zend_class_entry' has no member named 'filename'
  • error 37
  • /tmp/B.df031185-3ec0-4917-99ce-0ce3740a8d2c/BUILD/php-pecl-bcompiler-1.0.2/php_bcompiler.c:635:33: error: 'zend_class_entry' has no member named 'filename'
  • error 38
  • /tmp/B.df031185-3ec0-4917-99ce-0ce3740a8d2c/BUILD/php-pecl-bcompiler-1.0.2/php_bcompiler.c:635:33: error: 'zend_class_entry' has no member named 'filename'
  • error 39
  • /tmp/B.df031185-3ec0-4917-99ce-0ce3740a8d2c/BUILD/php-pecl-bcompiler-1.0.2/php_bcompiler.c:635:33: error: 'zend_class_entry' has no member named 'filename'
  • error 40
  • /tmp/B.df031185-3ec0-4917-99ce-0ce3740a8d2c/BUILD/php-pecl-bcompiler-1.0.2/php_bcompiler.c:635:33: error: 'zend_class_entry' has no member named 'filename'
  • error 41
  • /tmp/B.df031185-3ec0-4917-99ce-0ce3740a8d2c/BUILD/php-pecl-bcompiler-1.0.2/bcompiler_zend.c:886:22: error: 'zend_class_entry' has no member named 'constants_updated'
  • error 42
  • /tmp/B.df031185-3ec0-4917-99ce-0ce3740a8d2c/BUILD/php-pecl-bcompiler-1.0.2/php_bcompiler.c:635:33: error: 'zend_class_entry' has no member named 'filename'
  • error 43
  • /tmp/B.df031185-3ec0-4917-99ce-0ce3740a8d2c/BUILD/php-pecl-bcompiler-1.0.2/php_bcompiler.c:635:33: error: 'zend_class_entry' has no member named 'filename'
  • error 44
  • /tmp/B.df031185-3ec0-4917-99ce-0ce3740a8d2c/BUILD/php-pecl-bcompiler-1.0.2/bcompiler_zend.c:933:45: error: 'zend_class_entry' has no member named 'builtin_functions'
  • error 45
  • /tmp/B.df031185-3ec0-4917-99ce-0ce3740a8d2c/BUILD/php-pecl-bcompiler-1.0.2/php_bcompiler.c:635:33: error: 'zend_class_entry' has no member named 'filename'
  • error 46
  • /tmp/B.df031185-3ec0-4917-99ce-0ce3740a8d2c/BUILD/php-pecl-bcompiler-1.0.2/php_bcompiler.c:635:33: error: 'zend_class_entry' has no member named 'filename'
  • error 47
  • /tmp/B.df031185-3ec0-4917-99ce-0ce3740a8d2c/BUILD/php-pecl-bcompiler-1.0.2/bcompiler_zend.c:934:39: error: 'zend_class_entry' has no member named 'builtin_functions'
  • error 48
  • /tmp/B.df031185-3ec0-4917-99ce-0ce3740a8d2c/BUILD/php-pecl-bcompiler-1.0.2/php_bcompiler.c:635:33: error: 'zend_class_entry' has no member named 'filename'
  • error 49
  • /tmp/B.df031185-3ec0-4917-99ce-0ce3740a8d2c/BUILD/php-pecl-bcompiler-1.0.2/php_bcompiler.c:635:33: error: 'zend_class_entry' has no member named 'filename'
  • error 50
  • /tmp/B.df031185-3ec0-4917-99ce-0ce3740a8d2c/BUILD/php-pecl-bcompiler-1.0.2/bcompiler_zend.c:941:64: error: 'zend_class_entry' has no member named 'builtin_functions'
  • error 51
  • /tmp/B.df031185-3ec0-4917-99ce-0ce3740a8d2c/BUILD/php-pecl-bcompiler-1.0.2/php_bcompiler.c:635:33: error: 'zend_class_entry' has no member named 'filename'
  • error 52
  • /tmp/B.df031185-3ec0-4917-99ce-0ce3740a8d2c/BUILD/php-pecl-bcompiler-1.0.2/php_bcompiler.c:635:33: error: 'zend_class_entry' has no member named 'filename'
  • error 53
  • /tmp/B.df031185-3ec0-4917-99ce-0ce3740a8d2c/BUILD/php-pecl-bcompiler-1.0.2/php_bcompiler.c:635:33: error: 'zend_class_entry' has no member named 'filename'
  • error 54
  • /tmp/B.df031185-3ec0-4917-99ce-0ce3740a8d2c/BUILD/php-pecl-bcompiler-1.0.2/php_bcompiler.c:635:33: error: 'zend_class_entry' has no member named 'filename'
  • error 55
  • /tmp/B.df031185-3ec0-4917-99ce-0ce3740a8d2c/BUILD/php-pecl-bcompiler-1.0.2/php_bcompiler.c:635:33: error: 'zend_class_entry' has no member named 'filename'
  • error 56
  • /tmp/B.df031185-3ec0-4917-99ce-0ce3740a8d2c/BUILD/php-pecl-bcompiler-1.0.2/php_bcompiler.c:635:33: error: 'zend_class_entry' has no member named 'filename'
  • error 57
  • /tmp/B.df031185-3ec0-4917-99ce-0ce3740a8d2c/BUILD/php-pecl-bcompiler-1.0.2/bcompiler_zend.c:977:46: error: 'zend_class_entry' has no member named 'filename'
  • error 58
  • /tmp/B.df031185-3ec0-4917-99ce-0ce3740a8d2c/BUILD/php-pecl-bcompiler-1.0.2/bcompiler_zend.c:979:23: error: 'zend_class_entry' has no member named 'line_start'
  • error 59
  • /tmp/B.df031185-3ec0-4917-99ce-0ce3740a8d2c/BUILD/php-pecl-bcompiler-1.0.2/bcompiler_zend.c:980:23: error: 'zend_class_entry' has no member named 'line_end'
  • error 60
  • /tmp/B.df031185-3ec0-4917-99ce-0ce3740a8d2c/BUILD/php-pecl-bcompiler-1.0.2/bcompiler_zend.c:981:28: error: 'zend_class_entry' has no member named 'doc_comment'
  • error 61
  • /tmp/B.df031185-3ec0-4917-99ce-0ce3740a8d2c/BUILD/php-pecl-bcompiler-1.0.2/bcompiler_zend.c:981:46: error: 'zend_class_entry' has no member named 'doc_comment_len'
  • error 62
  • /tmp/B.df031185-3ec0-4917-99ce-0ce3740a8d2c/BUILD/php-pecl-bcompiler-1.0.2/bcompiler_zend.c:982:23: error: 'zend_class_entry' has no member named 'doc_comment_len'
  • error 63
  • /tmp/B.df031185-3ec0-4917-99ce-0ce3740a8d2c/BUILD/php-pecl-bcompiler-1.0.2/bcompiler_zend.c:1092:25: error: 'zend_class_entry' has no member named 'constants_updated'
  • error 64
  • /tmp/B.df031185-3ec0-4917-99ce-0ce3740a8d2c/BUILD/php-pecl-bcompiler-1.0.2/bcompiler_zend.c:1187:5: error: 'zend_class_entry' has no member named 'builtin_functions'
  • error 65
  • /tmp/B.df031185-3ec0-4917-99ce-0ce3740a8d2c/BUILD/php-pecl-bcompiler-1.0.2/bcompiler_zend.c:1189:6: error: 'zend_class_entry' has no member named 'builtin_functions'
  • error 66
  • /tmp/B.df031185-3ec0-4917-99ce-0ce3740a8d2c/BUILD/php-pecl-bcompiler-1.0.2/bcompiler_zend.c:1191:66: error: 'zend_class_entry' has no member named 'builtin_functions'
  • error 67
  • /tmp/B.df031185-3ec0-4917-99ce-0ce3740a8d2c/BUILD/php-pecl-bcompiler-1.0.2/bcompiler_zend.c:1240:6: error: 'zend_class_entry' has no member named 'filename'
  • error 68
  • /tmp/B.df031185-3ec0-4917-99ce-0ce3740a8d2c/BUILD/php-pecl-bcompiler-1.0.2/bcompiler_zend.c:1241:26: error: 'zend_class_entry' has no member named 'line_start'
  • error 69
  • /tmp/B.df031185-3ec0-4917-99ce-0ce3740a8d2c/BUILD/php-pecl-bcompiler-1.0.2/bcompiler_zend.c:1242:26: error: 'zend_class_entry' has no member named 'line_end'
  • error 70
  • /tmp/B.df031185-3ec0-4917-99ce-0ce3740a8d2c/BUILD/php-pecl-bcompiler-1.0.2/bcompiler_zend.c:1243:32: error: 'zend_class_entry' has no member named 'doc_comment'
  • error 71
  • Makefile:201: recipe for target 'php_bcompiler.lo' failed
  • error 72
  • /tmp/B.df031185-3ec0-4917-99ce-0ce3740a8d2c/BUILD/php-pecl-bcompiler-1.0.2/bcompiler_zend.c:1244:26: error: 'zend_class_entry' has no member named 'doc_comment_len'
  • error 73
  • /tmp/B.df031185-3ec0-4917-99ce-0ce3740a8d2c/BUILD/php-pecl-bcompiler-1.0.2/bcompiler_zend.c:1567:22: error: 'zend_op_array' has no member named 'size_literal'
  • error 74
  • /tmp/B.df031185-3ec0-4917-99ce-0ce3740a8d2c/BUILD/php-pecl-bcompiler-1.0.2/bcompiler_zend.c:1575:22: error: 'zend_op_array' has no member named 'size'
  • error 75
  • /tmp/B.df031185-3ec0-4917-99ce-0ce3740a8d2c/BUILD/php-pecl-bcompiler-1.0.2/bcompiler_zend.c:1598:22: error: 'zend_op_array' has no member named 'current_brk_cont'
  • error 76
  • /tmp/B.df031185-3ec0-4917-99ce-0ce3740a8d2c/BUILD/php-pecl-bcompiler-1.0.2/bcompiler_zend.c:1611:22: error: 'zend_op_array' has no member named 'return_reference'
  • error 77
  • /tmp/B.df031185-3ec0-4917-99ce-0ce3740a8d2c/BUILD/php-pecl-bcompiler-1.0.2/bcompiler_zend.c:1612:22: error: 'zend_op_array' has no member named 'done_pass_two'
  • error 78
  • /tmp/B.df031185-3ec0-4917-99ce-0ce3740a8d2c/BUILD/php-pecl-bcompiler-1.0.2/bcompiler_zend.c:1631:23: error: 'zend_op_array' has no member named 'pass_rest_by_reference'
  • error 79
  • /tmp/B.df031185-3ec0-4917-99ce-0ce3740a8d2c/BUILD/php-pecl-bcompiler-1.0.2/bcompiler_zend.c:1633:23: error: 'zend_op_array' has no member named 'backpatch_count'
  • error 80
  • /tmp/B.df031185-3ec0-4917-99ce-0ce3740a8d2c/BUILD/php-pecl-bcompiler-1.0.2/bcompiler_zend.c:1645:23: error: 'zend_op_array' has no member named 'size_var'
  • error 81
  • /tmp/B.df031185-3ec0-4917-99ce-0ce3740a8d2c/BUILD/php-pecl-bcompiler-1.0.2/bcompiler_zend.c:1709:25: error: 'zend_op_array' has no member named 'size_literal'
  • error 82
  • /tmp/B.df031185-3ec0-4917-99ce-0ce3740a8d2c/BUILD/php-pecl-bcompiler-1.0.2/bcompiler_zend.c:1725:25: error: 'zend_op_array' has no member named 'size'
  • error 83
  • /tmp/B.df031185-3ec0-4917-99ce-0ce3740a8d2c/BUILD/php-pecl-bcompiler-1.0.2/bcompiler_zend.c:1739:25: error: 'zend_op_array' has no member named 'current_brk_cont'
  • error 84
  • /tmp/B.df031185-3ec0-4917-99ce-0ce3740a8d2c/BUILD/php-pecl-bcompiler-1.0.2/bcompiler_zend.c:1752:5: error: 'zend_op_array' has no member named 'start_op'
  • error 85
  • /tmp/B.df031185-3ec0-4917-99ce-0ce3740a8d2c/BUILD/php-pecl-bcompiler-1.0.2/bcompiler_zend.c:1754:25: error: 'zend_op_array' has no member named 'return_reference'
  • error 86
  • /tmp/B.df031185-3ec0-4917-99ce-0ce3740a8d2c/BUILD/php-pecl-bcompiler-1.0.2/bcompiler_zend.c:1755:25: error: 'zend_op_array' has no member named 'done_pass_two'
  • error 87
  • /tmp/B.df031185-3ec0-4917-99ce-0ce3740a8d2c/BUILD/php-pecl-bcompiler-1.0.2/bcompiler_zend.c:1801:26: error: 'zend_op_array' has no member named 'pass_rest_by_reference'
  • error 88
  • /tmp/B.df031185-3ec0-4917-99ce-0ce3740a8d2c/BUILD/php-pecl-bcompiler-1.0.2/bcompiler_zend.c:1802:26: error: 'zend_op_array' has no member named 'backpatch_count'
  • error 89
  • /tmp/B.df031185-3ec0-4917-99ce-0ce3740a8d2c/BUILD/php-pecl-bcompiler-1.0.2/bcompiler_zend.c:1814:26: error: 'zend_op_array' has no member named 'size_var'
  • error 90
  • /tmp/B.df031185-3ec0-4917-99ce-0ce3740a8d2c/BUILD/php-pecl-bcompiler-1.0.2/bcompiler_zend.c:1815:10: error: 'zend_op_array' has no member named 'size_var'
  • error 91
  • /tmp/B.df031185-3ec0-4917-99ce-0ce3740a8d2c/BUILD/php-pecl-bcompiler-1.0.2/bcompiler_zend.c:1816:27: error: 'zend_op_array' has no member named 'size_var'
  • error 92
  • Makefile:205: recipe for target 'bcompiler_zend.lo' failed
  • error 93
  • error: Bad exit status from /tmp/B.df031185-3ec0-4917-99ce-0ce3740a8d2c/BUILD/tmp/rpm-tmp.80385 (%build)
  • error 94
  • RPM build errors:
  • error 95
  • error: No files produced.

Content:

checking for system library directory... lib
checking if compiler supports -R... no
checking if compiler supports -Wl,-rpath,... yes
checking build system type... i686-pld-linux-gnu
checking host system type... i686-pld-linux-gnu
checking target system type... i686-pld-linux-gnu
checking for PHP prefix... /usr
checking for PHP includes... -I/usr/include/php -I/usr/include/php/main -I/usr/include/php/TSRM -I/usr/include/php/Zend -I/usr/include/php/ext -I/usr/include/php/ext/date/lib
checking for PHP extension directory... /usr/lib/php
checking for PHP installed headers prefix... /usr/include/php
checking if debug is enabled... no
checking if zts is enabled... no
checking for re2c... re2c
checking for re2c version... 0.13.5 (ok)
checking for gawk... gawk
checking whether to enable bcompiler support... yes, shared
checking whether to include debug code in bcompiler (default: no)... no
checking how to print strings... print -r
checking for a sed that does not truncate output... (cached) /bin/sed
checking for fgrep... /bin/grep -F
checking for ld used by i686-pld-linux-gcc... /usr/bin/ld
checking if the linker (/usr/bin/ld) is GNU ld... yes
checking for BSD- or MS-compatible name lister (nm)... /usr/bin/nm -B
checking the name lister (/usr/bin/nm -B) interface... BSD nm
checking whether ln -s works... yes
checking the maximum length of command line arguments... 1572864
checking whether the shell understands some XSI constructs... yes
checking whether the shell understands "+="... yes
checking how to convert i686-pld-linux-gnu file names to i686-pld-linux-gnu format... func_convert_file_noop
checking how to convert i686-pld-linux-gnu file names to toolchain format... func_convert_file_noop
checking for /usr/bin/ld option to reload object files... -r
checking for i686-pld-linux-objdump... no
checking for objdump... objdump
checking how to recognize dependent libraries... pass_all
checking for i686-pld-linux-dlltool... no
checking for dlltool... no
checking how to associate runtime and link libraries... print -r --
checking for i686-pld-linux-ar... no
checking for ar... ar
checking for archiver @FILE support... @
checking for i686-pld-linux-strip... no
checking for strip... strip
checking for i686-pld-linux-ranlib... no
checking for ranlib... ranlib
checking for mawk... (cached) gawk
checking command to parse /usr/bin/nm -B output from i686-pld-linux-gcc object... ok
checking for sysroot... no
checking for i686-pld-linux-mt... no
checking for mt... no
checking if : is a manifest tool... no
checking for ANSI C header files... yes
checking for sys/types.h... yes
checking for sys/stat.h... yes
checking for stdlib.h... yes
checking for string.h... yes
checking for memory.h... yes
checking for strings.h... yes
checking for inttypes.h... yes
checking for stdint.h... yes
checking for unistd.h... yes
checking for dlfcn.h... yes
checking for objdir... .libs
checking if i686-pld-linux-gcc supports -fno-rtti -fno-exceptions... no
checking for i686-pld-linux-gcc option to produce PIC... -fPIC -DPIC
checking if i686-pld-linux-gcc PIC flag -fPIC -DPIC works... yes
checking if i686-pld-linux-gcc static flag -static works... yes
checking if i686-pld-linux-gcc supports -c -o file.o... yes
checking if i686-pld-linux-gcc supports -c -o file.o... (cached) yes
checking whether the i686-pld-linux-gcc linker (/usr/bin/ld) supports shared libraries... yes
checking whether -lc should be explicitly linked in... no
checking dynamic linker characteristics... GNU/Linux ld.so
checking how to hardcode library paths into programs... immediate
checking whether stripping libraries is possible... yes
checking if libtool supports shared libraries... yes
checking whether to build shared libraries... yes
checking whether to build static libraries... no
configure: creating ./config.status
config.status: creating config.h
config.status: executing libtool commands
+ /usr/bin/make -j9
/bin/sh /tmp/B.df031185-3ec0-4917-99ce-0ce3740a8d2c/BUILD/php-pecl-bcompiler-1.0.2/libtool --mode=compile i686-pld-linux-gcc  -I. -I/tmp/B.df031185-3ec0-4917-99ce-0ce3740a8d2c/BUILD/php-pecl-bcompiler-1.0.2 -DPHP_ATOM_INC -I/tmp/B.df031185-3ec0-4917-99ce-0ce3740a8d2c/BUILD/php-pecl-bcompiler-1.0.2/include -I/tmp/B.df031185-3ec0-4917-99ce-0ce3740a8d2c/BUILD/php-pecl-bcompiler-1.0.2/main -I/tmp/B.df031185-3ec0-4917-99ce-0ce3740a8d2c/BUILD/php-pecl-bcompiler-1.0.2 -I/usr/include/php -I/usr/include/php/main -I/usr/include/php/TSRM -I/usr/include/php/Zend -I/usr/include/php/ext -I/usr/include/php/ext/date/lib  -DHAVE_CONFIG_H  -O2 -fwrapv -pipe -Wformat -Werror=format-security -gdwarf-4 -fno-debug-types-section -fvar-tracking-assignments -g2 -Wp,-D_FORTIFY_SOURCE=2 -fstack-protector --param=ssp-buffer-size=4 -fomit-frame-pointer -march=i686 -fasynchronous-unwind-tables -mtune=pentium4 -gdwarf-4 -fno-debug-types-section -fvar-tracking-assignments -g2   -c /tmp/B.df031185-3ec0-4917-99ce-0ce3740a8d2c/BUILD/php-pecl-bcompiler-1.0.2/php_bcompiler.c -o php_bcompiler.lo 
/bin/sh /tmp/B.df031185-3ec0-4917-99ce-0ce3740a8d2c/BUILD/php-pecl-bcompiler-1.0.2/libtool --mode=compile i686-pld-linux-gcc  -I. -I/tmp/B.df031185-3ec0-4917-99ce-0ce3740a8d2c/BUILD/php-pecl-bcompiler-1.0.2 -DPHP_ATOM_INC -I/tmp/B.df031185-3ec0-4917-99ce-0ce3740a8d2c/BUILD/php-pecl-bcompiler-1.0.2/include -I/tmp/B.df031185-3ec0-4917-99ce-0ce3740a8d2c/BUILD/php-pecl-bcompiler-1.0.2/main -I/tmp/B.df031185-3ec0-4917-99ce-0ce3740a8d2c/BUILD/php-pecl-bcompiler-1.0.2 -I/usr/include/php -I/usr/include/php/main -I/usr/include/php/TSRM -I/usr/include/php/Zend -I/usr/include/php/ext -I/usr/include/php/ext/date/lib  -DHAVE_CONFIG_H  -O2 -fwrapv -pipe -Wformat -Werror=format-security -gdwarf-4 -fno-debug-types-section -fvar-tracking-assignments -g2 -Wp,-D_FORTIFY_SOURCE=2 -fstack-protector --param=ssp-buffer-size=4 -fomit-frame-pointer -march=i686 -fasynchronous-unwind-tables -mtune=pentium4 -gdwarf-4 -fno-debug-types-section -fvar-tracking-assignments -g2   -c /tmp/B.df031185-3ec0-4917-99ce-0ce3740a8d2c/BUILD/php-pecl-bcompiler-1.0.2/bcompiler.c -o bcompiler.lo 
/bin/sh /tmp/B.df031185-3ec0-4917-99ce-0ce3740a8d2c/BUILD/php-pecl-bcompiler-1.0.2/libtool --mode=compile i686-pld-linux-gcc  -I. -I/tmp/B.df031185-3ec0-4917-99ce-0ce3740a8d2c/BUILD/php-pecl-bcompiler-1.0.2 -DPHP_ATOM_INC -I/tmp/B.df031185-3ec0-4917-99ce-0ce3740a8d2c/BUILD/php-pecl-bcompiler-1.0.2/include -I/tmp/B.df031185-3ec0-4917-99ce-0ce3740a8d2c/BUILD/php-pecl-bcompiler-1.0.2/main -I/tmp/B.df031185-3ec0-4917-99ce-0ce3740a8d2c/BUILD/php-pecl-bcompiler-1.0.2 -I/usr/include/php -I/usr/include/php/main -I/usr/include/php/TSRM -I/usr/include/php/Zend -I/usr/include/php/ext -I/usr/include/php/ext/date/lib  -DHAVE_CONFIG_H  -O2 -fwrapv -pipe -Wformat -Werror=format-security -gdwarf-4 -fno-debug-types-section -fvar-tracking-assignments -g2 -Wp,-D_FORTIFY_SOURCE=2 -fstack-protector --param=ssp-buffer-size=4 -fomit-frame-pointer -march=i686 -fasynchronous-unwind-tables -mtune=pentium4 -gdwarf-4 -fno-debug-types-section -fvar-tracking-assignments -g2   -c /tmp/B.df031185-3ec0-4917-99ce-0ce3740a8d2c/BUILD/php-pecl-bcompiler-1.0.2/bcompiler_zend.c -o bcompiler_zend.lo 
libtool: compile:  i686-pld-linux-gcc -I. -I/tmp/B.df031185-3ec0-4917-99ce-0ce3740a8d2c/BUILD/php-pecl-bcompiler-1.0.2 -DPHP_ATOM_INC -I/tmp/B.df031185-3ec0-4917-99ce-0ce3740a8d2c/BUILD/php-pecl-bcompiler-1.0.2/include -I/tmp/B.df031185-3ec0-4917-99ce-0ce3740a8d2c/BUILD/php-pecl-bcompiler-1.0.2/main -I/tmp/B.df031185-3ec0-4917-99ce-0ce3740a8d2c/BUILD/php-pecl-bcompiler-1.0.2 -I/usr/include/php -I/usr/include/php/main -I/usr/include/php/TSRM -I/usr/include/php/Zend -I/usr/include/php/ext -I/usr/include/php/ext/date/lib -DHAVE_CONFIG_H -O2 -fwrapv -pipe -Wformat -Werror=format-security -gdwarf-4 -fno-debug-types-section -fvar-tracking-assignments -g2 -Wp,-D_FORTIFY_SOURCE=2 -fstack-protector --param=ssp-buffer-size=4 -fomit-frame-pointer -march=i686 -fasynchronous-unwind-tables -mtune=pentium4 -gdwarf-4 -fno-debug-types-section -fvar-tracking-assignments -g2 -c /tmp/B.df031185-3ec0-4917-99ce-0ce3740a8d2c/BUILD/php-pecl-bcompiler-1.0.2/bcompiler_zend.c  -fPIC -DPIC -o .libs/bcompiler_zend.o
libtool: compile:  i686-pld-linux-gcc -I. -I/tmp/B.df031185-3ec0-4917-99ce-0ce3740a8d2c/BUILD/php-pecl-bcompiler-1.0.2 -DPHP_ATOM_INC -I/tmp/B.df031185-3ec0-4917-99ce-0ce3740a8d2c/BUILD/php-pecl-bcompiler-1.0.2/include -I/tmp/B.df031185-3ec0-4917-99ce-0ce3740a8d2c/BUILD/php-pecl-bcompiler-1.0.2/main -I/tmp/B.df031185-3ec0-4917-99ce-0ce3740a8d2c/BUILD/php-pecl-bcompiler-1.0.2 -I/usr/include/php -I/usr/include/php/main -I/usr/include/php/TSRM -I/usr/include/php/Zend -I/usr/include/php/ext -I/usr/include/php/ext/date/lib -DHAVE_CONFIG_H -O2 -fwrapv -pipe -Wformat -Werror=format-security -gdwarf-4 -fno-debug-types-section -fvar-tracking-assignments -g2 -Wp,-D_FORTIFY_SOURCE=2 -fstack-protector --param=ssp-buffer-size=4 -fomit-frame-pointer -march=i686 -fasynchronous-unwind-tables -mtune=pentium4 -gdwarf-4 -fno-debug-types-section -fvar-tracking-assignments -g2 -c /tmp/B.df031185-3ec0-4917-99ce-0ce3740a8d2c/BUILD/php-pecl-bcompiler-1.0.2/bcompiler.c  -fPIC -DPIC -o .libs/bcompiler.o
libtool: compile:  i686-pld-linux-gcc -I. -I/tmp/B.df031185-3ec0-4917-99ce-0ce3740a8d2c/BUILD/php-pecl-bcompiler-1.0.2 -DPHP_ATOM_INC -I/tmp/B.df031185-3ec0-4917-99ce-0ce3740a8d2c/BUILD/php-pecl-bcompiler-1.0.2/include -I/tmp/B.df031185-3ec0-4917-99ce-0ce3740a8d2c/BUILD/php-pecl-bcompiler-1.0.2/main -I/tmp/B.df031185-3ec0-4917-99ce-0ce3740a8d2c/BUILD/php-pecl-bcompiler-1.0.2 -I/usr/include/php -I/usr/include/php/main -I/usr/include/php/TSRM -I/usr/include/php/Zend -I/usr/include/php/ext -I/usr/include/php/ext/date/lib -DHAVE_CONFIG_H -O2 -fwrapv -pipe -Wformat -Werror=format-security -gdwarf-4 -fno-debug-types-section -fvar-tracking-assignments -g2 -Wp,-D_FORTIFY_SOURCE=2 -fstack-protector --param=ssp-buffer-size=4 -fomit-frame-pointer -march=i686 -fasynchronous-unwind-tables -mtune=pentium4 -gdwarf-4 -fno-debug-types-section -fvar-tracking-assignments -g2 -c /tmp/B.df031185-3ec0-4917-99ce-0ce3740a8d2c/BUILD/php-pecl-bcompiler-1.0.2/php_bcompiler.c  -fPIC -DPIC -o .libs/php_bcompiler.o
/tmp/B.df031185-3ec0-4917-99ce-0ce3740a8d2c/BUILD/php-pecl-bcompiler-1.0.2/bcompiler.c: In function 'bcompiler_compile_file':
/tmp/B.df031185-3ec0-4917-99ce-0ce3740a8d2c/BUILD/php-pecl-bcompiler-1.0.2/bcompiler.c:217:13: warning: assignment discards 'const' qualifier from pointer target type [enabled by default]
    filename = file_handle->filename;
             ^
/tmp/B.df031185-3ec0-4917-99ce-0ce3740a8d2c/BUILD/php-pecl-bcompiler-1.0.2/bcompiler_zend.c: In function 'apc_serialize_hashtable':
/tmp/B.df031185-3ec0-4917-99ce-0ce3740a8d2c/BUILD/php-pecl-bcompiler-1.0.2/bcompiler_zend.c:188:3: warning: passing argument 1 of 'apc_serialize_zstring' discards 'const' qualifier from pointer target type [enabled by default]
   apc_serialize_zstring(p->arKey, p->nKeyLength TSRMLS_CC);
   ^
In file included from /tmp/B.df031185-3ec0-4917-99ce-0ce3740a8d2c/BUILD/php-pecl-bcompiler-1.0.2/bcompiler_zend.c:23:0:
/tmp/B.df031185-3ec0-4917-99ce-0ce3740a8d2c/BUILD/php-pecl-bcompiler-1.0.2/php_bcompiler.h:298:6: note: expected 'char *' but argument is of type 'const char *'
 void apc_serialize_zstring(char* string, int len TSRMLS_DC);
      ^
/tmp/B.df031185-3ec0-4917-99ce-0ce3740a8d2c/BUILD/php-pecl-bcompiler-1.0.2/bcompiler_zend.c: In function 'apc_serialize_zvalue_value':
/tmp/B.df031185-3ec0-4917-99ce-0ce3740a8d2c/BUILD/php-pecl-bcompiler-1.0.2/bcompiler_zend.c:475:7: error: 'IS_CLASS' undeclared (first use in this function)
  case IS_CLASS:
       ^
/tmp/B.df031185-3ec0-4917-99ce-0ce3740a8d2c/BUILD/php-pecl-bcompiler-1.0.2/bcompiler_zend.c:475:7: note: each undeclared identifier is reported only once for each function it appears in
/tmp/B.df031185-3ec0-4917-99ce-0ce3740a8d2c/BUILD/php-pecl-bcompiler-1.0.2/bcompiler_zend.c:476:7: error: 'IS_SCALAR' undeclared (first use in this function)
  case IS_SCALAR:
       ^
/tmp/B.df031185-3ec0-4917-99ce-0ce3740a8d2c/BUILD/php-pecl-bcompiler-1.0.2/bcompiler_zend.c:477:7: error: 'IS_NUMERIC' undeclared (first use in this function)
  case IS_NUMERIC:
       ^
/tmp/B.df031185-3ec0-4917-99ce-0ce3740a8d2c/BUILD/php-pecl-bcompiler-1.0.2/bcompiler_zend.c: In function 'apc_deserialize_zvalue_value':
/tmp/B.df031185-3ec0-4917-99ce-0ce3740a8d2c/BUILD/php-pecl-bcompiler-1.0.2/bcompiler_zend.c:555:7: error: 'IS_CLASS' undeclared (first use in this function)
  case IS_CLASS:
       ^
/tmp/B.df031185-3ec0-4917-99ce-0ce3740a8d2c/BUILD/php-pecl-bcompiler-1.0.2/bcompiler_zend.c:556:7: error: 'IS_SCALAR' undeclared (first use in this function)
  case IS_SCALAR:
       ^
/tmp/B.df031185-3ec0-4917-99ce-0ce3740a8d2c/BUILD/php-pecl-bcompiler-1.0.2/bcompiler_zend.c:557:7: error: 'IS_NUMERIC' undeclared (first use in this function)
  case IS_NUMERIC:
       ^
/tmp/B.df031185-3ec0-4917-99ce-0ce3740a8d2c/BUILD/php-pecl-bcompiler-1.0.2/php_bcompiler.c: In function '_bcompiler_write_functions_from_file':
/tmp/B.df031185-3ec0-4917-99ce-0ce3740a8d2c/BUILD/php-pecl-bcompiler-1.0.2/php_bcompiler.c:468:6: warning: passing argument 1 of 'apc_serialize_zstring' discards 'const' qualifier from pointer target type [enabled by default]
      apc_serialize_zstring(pos->arKey, pos->nKeyLength TSRMLS_CC);
      ^
In file included from /tmp/B.df031185-3ec0-4917-99ce-0ce3740a8d2c/BUILD/php-pecl-bcompiler-1.0.2/php_bcompiler.c:22:0:
/tmp/B.df031185-3ec0-4917-99ce-0ce3740a8d2c/BUILD/php-pecl-bcompiler-1.0.2/php_bcompiler.h:298:6: note: expected 'char *' but argument is of type 'const char *'
 void apc_serialize_zstring(char* string, int len TSRMLS_DC);
      ^
/tmp/B.df031185-3ec0-4917-99ce-0ce3740a8d2c/BUILD/php-pecl-bcompiler-1.0.2/php_bcompiler.c: In function 'zif_bcompiler_write_file':
In file included from /tmp/B.df031185-3ec0-4917-99ce-0ce3740a8d2c/BUILD/php-pecl-bcompiler-1.0.2/bcompiler_zend.c:23:0:
/tmp/B.df031185-3ec0-4917-99ce-0ce3740a8d2c/BUILD/php-pecl-bcompiler-1.0.2/bcompiler_zend.c: In function 'apc_serialize_arg_info':
/tmp/B.df031185-3ec0-4917-99ce-0ce3740a8d2c/BUILD/php-pecl-bcompiler-1.0.2/php_bcompiler.c:574:10: error: 'zend_class_entry' has no member named 'filename'
    if (zc->filename && strcmp(zc->filename, real_path) == 0)
          ^
In file included from /usr/include/string.h:635:0,
                 from /usr/include/php/main/../main/php_config.h:2416,
                 from /usr/include/php/Zend/zend_config.h:1,
                 from /usr/include/php/Zend/zend.h:51,
                 from /usr/include/php/main/php.h:34,
                 from /tmp/B.df031185-3ec0-4917-99ce-0ce3740a8d2c/BUILD/php-pecl-bcompiler-1.0.2/php_bcompiler.h:31,
                 from /tmp/B.df031185-3ec0-4917-99ce-0ce3740a8d2c/BUILD/php-pecl-bcompiler-1.0.2/php_bcompiler.c:22:
/tmp/B.df031185-3ec0-4917-99ce-0ce3740a8d2c/BUILD/php-pecl-bcompiler-1.0.2/php_bcompiler.c:574:33: error: 'zend_class_entry' has no member named 'filename'
    if (zc->filename && strcmp(zc->filename, real_path) == 0)
                                 ^
/tmp/B.df031185-3ec0-4917-99ce-0ce3740a8d2c/BUILD/php-pecl-bcompiler-1.0.2/bcompiler_zend.c:639:27: error: 'zend_arg_info' has no member named 'return_reference'
  SERIALIZE_SCALAR(arg_info->return_reference , zend_bool);
                           ^
/tmp/B.df031185-3ec0-4917-99ce-0ce3740a8d2c/BUILD/php-pecl-bcompiler-1.0.2/php_bcompiler.h:223:32: note: in definition of macro 'SERIALIZE_SCALAR'
   *((type*)BCOMPILERG(_buf)) = x;                        \
                                ^
/tmp/B.df031185-3ec0-4917-99ce-0ce3740a8d2c/BUILD/php-pecl-bcompiler-1.0.2/php_bcompiler.c:574:33: error: 'zend_class_entry' has no member named 'filename'
    if (zc->filename && strcmp(zc->filename, real_path) == 0)
                                 ^
/tmp/B.df031185-3ec0-4917-99ce-0ce3740a8d2c/BUILD/php-pecl-bcompiler-1.0.2/php_bcompiler.c:574:33: error: 'zend_class_entry' has no member named 'filename'
    if (zc->filename && strcmp(zc->filename, real_path) == 0)
                                 ^
/tmp/B.df031185-3ec0-4917-99ce-0ce3740a8d2c/BUILD/php-pecl-bcompiler-1.0.2/bcompiler_zend.c:640:27: error: 'zend_arg_info' has no member named 'required_num_args'
  SERIALIZE_SCALAR(arg_info->required_num_args, int);
                           ^
/tmp/B.df031185-3ec0-4917-99ce-0ce3740a8d2c/BUILD/php-pecl-bcompiler-1.0.2/php_bcompiler.h:223:32: note: in definition of macro 'SERIALIZE_SCALAR'
   *((type*)BCOMPILERG(_buf)) = x;                        \
                                ^
/tmp/B.df031185-3ec0-4917-99ce-0ce3740a8d2c/BUILD/php-pecl-bcompiler-1.0.2/php_bcompiler.c:574:33: error: 'zend_class_entry' has no member named 'filename'
    if (zc->filename && strcmp(zc->filename, real_path) == 0)
                                 ^
/tmp/B.df031185-3ec0-4917-99ce-0ce3740a8d2c/BUILD/php-pecl-bcompiler-1.0.2/php_bcompiler.c:574:33: error: 'zend_class_entry' has no member named 'filename'
    if (zc->filename && strcmp(zc->filename, real_path) == 0)
                                 ^
/tmp/B.df031185-3ec0-4917-99ce-0ce3740a8d2c/BUILD/php-pecl-bcompiler-1.0.2/php_bcompiler.c:574:33: error: 'zend_class_entry' has no member named 'filename'
    if (zc->filename && strcmp(zc->filename, real_path) == 0)
                                 ^
/tmp/B.df031185-3ec0-4917-99ce-0ce3740a8d2c/BUILD/php-pecl-bcompiler-1.0.2/php_bcompiler.c:574:33: error: 'zend_class_entry' has no member named 'filename'
    if (zc->filename && strcmp(zc->filename, real_path) == 0)
                                 ^
/tmp/B.df031185-3ec0-4917-99ce-0ce3740a8d2c/BUILD/php-pecl-bcompiler-1.0.2/php_bcompiler.c:574:33: error: 'zend_class_entry' has no member named 'filename'
    if (zc->filename && strcmp(zc->filename, real_path) == 0)
                                 ^
/tmp/B.df031185-3ec0-4917-99ce-0ce3740a8d2c/BUILD/php-pecl-bcompiler-1.0.2/php_bcompiler.c:574:33: error: 'zend_class_entry' has no member named 'filename'
    if (zc->filename && strcmp(zc->filename, real_path) == 0)
                                 ^
/tmp/B.df031185-3ec0-4917-99ce-0ce3740a8d2c/BUILD/php-pecl-bcompiler-1.0.2/php_bcompiler.c:574:33: error: 'zend_class_entry' has no member named 'filename'
    if (zc->filename && strcmp(zc->filename, real_path) == 0)
                                 ^
/tmp/B.df031185-3ec0-4917-99ce-0ce3740a8d2c/BUILD/php-pecl-bcompiler-1.0.2/php_bcompiler.c:574:33: error: 'zend_class_entry' has no member named 'filename'
    if (zc->filename && strcmp(zc->filename, real_path) == 0)
                                 ^
/tmp/B.df031185-3ec0-4917-99ce-0ce3740a8d2c/BUILD/php-pecl-bcompiler-1.0.2/php_bcompiler.c:574:33: error: 'zend_class_entry' has no member named 'filename'
    if (zc->filename && strcmp(zc->filename, real_path) == 0)
                                 ^
/tmp/B.df031185-3ec0-4917-99ce-0ce3740a8d2c/BUILD/php-pecl-bcompiler-1.0.2/php_bcompiler.c:574:33: error: 'zend_class_entry' has no member named 'filename'
    if (zc->filename && strcmp(zc->filename, real_path) == 0)
                                 ^
/tmp/B.df031185-3ec0-4917-99ce-0ce3740a8d2c/BUILD/php-pecl-bcompiler-1.0.2/php_bcompiler.c:574:33: error: 'zend_class_entry' has no member named 'filename'
    if (zc->filename && strcmp(zc->filename, real_path) == 0)
                                 ^
/tmp/B.df031185-3ec0-4917-99ce-0ce3740a8d2c/BUILD/php-pecl-bcompiler-1.0.2/php_bcompiler.c:574:33: error: 'zend_class_entry' has no member named 'filename'
    if (zc->filename && strcmp(zc->filename, real_path) == 0)
                                 ^
/tmp/B.df031185-3ec0-4917-99ce-0ce3740a8d2c/BUILD/php-pecl-bcompiler-1.0.2/php_bcompiler.c:574:33: error: 'zend_class_entry' has no member named 'filename'
    if (zc->filename && strcmp(zc->filename, real_path) == 0)
                                 ^
/tmp/B.df031185-3ec0-4917-99ce-0ce3740a8d2c/BUILD/php-pecl-bcompiler-1.0.2/php_bcompiler.c:574:33: error: 'zend_class_entry' has no member named 'filename'
    if (zc->filename && strcmp(zc->filename, real_path) == 0)
                                 ^
/tmp/B.df031185-3ec0-4917-99ce-0ce3740a8d2c/BUILD/php-pecl-bcompiler-1.0.2/php_bcompiler.c:574:33: error: 'zend_class_entry' has no member named 'filename'
    if (zc->filename && strcmp(zc->filename, real_path) == 0)
                                 ^
/tmp/B.df031185-3ec0-4917-99ce-0ce3740a8d2c/BUILD/php-pecl-bcompiler-1.0.2/php_bcompiler.c:574:33: error: 'zend_class_entry' has no member named 'filename'
    if (zc->filename && strcmp(zc->filename, real_path) == 0)
                                 ^
/tmp/B.df031185-3ec0-4917-99ce-0ce3740a8d2c/BUILD/php-pecl-bcompiler-1.0.2/php_bcompiler.c:574:33: error: 'zend_class_entry' has no member named 'filename'
    if (zc->filename && strcmp(zc->filename, real_path) == 0)
                                 ^
/tmp/B.df031185-3ec0-4917-99ce-0ce3740a8d2c/BUILD/php-pecl-bcompiler-1.0.2/php_bcompiler.c:581:5: warning: passing argument 4 of 'apc_serialize_zend_class_entry' discards 'const' qualifier from pointer target type [enabled by default]
     apc_serialize_zend_class_entry(zc, NULL, 0, pos->arKey, pos->nKeyLength TSRMLS_CC);
     ^
In file included from /tmp/B.df031185-3ec0-4917-99ce-0ce3740a8d2c/BUILD/php-pecl-bcompiler-1.0.2/php_bcompiler.c:22:0:
/tmp/B.df031185-3ec0-4917-99ce-0ce3740a8d2c/BUILD/php-pecl-bcompiler-1.0.2/php_bcompiler.h:305:6: note: expected 'char *' but argument is of type 'const char *'
 void apc_serialize_zend_class_entry(zend_class_entry* zce , char* force_parent_name, int force_parent_len, char* force_key, int force_key_len TSRMLS_DC);
      ^
/tmp/B.df031185-3ec0-4917-99ce-0ce3740a8d2c/BUILD/php-pecl-bcompiler-1.0.2/bcompiler_zend.c: In function 'apc_create_arg_info':
/tmp/B.df031185-3ec0-4917-99ce-0ce3740a8d2c/BUILD/php-pecl-bcompiler-1.0.2/bcompiler_zend.c:670:30: error: 'zend_arg_info' has no member named 'return_reference'
  DESERIALIZE_SCALAR(&arg_info->return_reference, zend_bool);
                              ^
/tmp/B.df031185-3ec0-4917-99ce-0ce3740a8d2c/BUILD/php-pecl-bcompiler-1.0.2/php_bcompiler.h:239:4: note: in definition of macro 'DESERIALIZE_SCALAR_X'
  *(xp) = *((type*) BCOMPILERG(_buf));                                 \
    ^
/tmp/B.df031185-3ec0-4917-99ce-0ce3740a8d2c/BUILD/php-pecl-bcompiler-1.0.2/bcompiler_zend.c:670:2: note: in expansion of macro 'DESERIALIZE_SCALAR'
  DESERIALIZE_SCALAR(&arg_info->return_reference, zend_bool);
  ^
/tmp/B.df031185-3ec0-4917-99ce-0ce3740a8d2c/BUILD/php-pecl-bcompiler-1.0.2/bcompiler_zend.c:671:30: error: 'zend_arg_info' has no member named 'required_num_args'
  DESERIALIZE_SCALAR(&arg_info->required_num_args, int);
                              ^
/tmp/B.df031185-3ec0-4917-99ce-0ce3740a8d2c/BUILD/php-pecl-bcompiler-1.0.2/php_bcompiler.h:239:4: note: in definition of macro 'DESERIALIZE_SCALAR_X'
  *(xp) = *((type*) BCOMPILERG(_buf));                                 \
    ^
/tmp/B.df031185-3ec0-4917-99ce-0ce3740a8d2c/BUILD/php-pecl-bcompiler-1.0.2/bcompiler_zend.c:671:2: note: in expansion of macro 'DESERIALIZE_SCALAR'
  DESERIALIZE_SCALAR(&arg_info->required_num_args, int);
  ^
/tmp/B.df031185-3ec0-4917-99ce-0ce3740a8d2c/BUILD/php-pecl-bcompiler-1.0.2/bcompiler_zend.c: In function 'apc_serialize_zend_property_info':
/tmp/B.df031185-3ec0-4917-99ce-0ce3740a8d2c/BUILD/php-pecl-bcompiler-1.0.2/bcompiler_zend.c:777:2: warning: passing argument 1 of 'apc_serialize_zstring' discards 'const' qualifier from pointer target type [enabled by default]
  apc_serialize_zstring(zpr->name, zpr->name_length TSRMLS_CC);
  ^
In file included from /tmp/B.df031185-3ec0-4917-99ce-0ce3740a8d2c/BUILD/php-pecl-bcompiler-1.0.2/bcompiler_zend.c:23:0:
/tmp/B.df031185-3ec0-4917-99ce-0ce3740a8d2c/BUILD/php-pecl-bcompiler-1.0.2/php_bcompiler.h:298:6: note: expected 'char *' but argument is of type 'const char *'
 void apc_serialize_zstring(char* string, int len TSRMLS_DC);
      ^
/tmp/B.df031185-3ec0-4917-99ce-0ce3740a8d2c/BUILD/php-pecl-bcompiler-1.0.2/php_bcompiler.c:635:10: error: 'zend_class_entry' has no member named 'filename'
    if (zc->filename && strcmp(zc->filename, real_path) == 0)
          ^
/tmp/B.df031185-3ec0-4917-99ce-0ce3740a8d2c/BUILD/php-pecl-bcompiler-1.0.2/bcompiler_zend.c: In function 'apc_serialize_zend_class_entry':
In file included from /usr/include/string.h:635:0,
                 from /usr/include/php/main/../main/php_config.h:2416,
                 from /usr/include/php/Zend/zend_config.h:1,
                 from /usr/include/php/Zend/zend.h:51,
                 from /usr/include/php/main/php.h:34,
                 from /tmp/B.df031185-3ec0-4917-99ce-0ce3740a8d2c/BUILD/php-pecl-bcompiler-1.0.2/php_bcompiler.h:31,
                 from /tmp/B.df031185-3ec0-4917-99ce-0ce3740a8d2c/BUILD/php-pecl-bcompiler-1.0.2/php_bcompiler.c:22:
/tmp/B.df031185-3ec0-4917-99ce-0ce3740a8d2c/BUILD/php-pecl-bcompiler-1.0.2/php_bcompiler.c:635:33: error: 'zend_class_entry' has no member named 'filename'
    if (zc->filename && strcmp(zc->filename, real_path) == 0)
                                 ^
/tmp/B.df031185-3ec0-4917-99ce-0ce3740a8d2c/BUILD/php-pecl-bcompiler-1.0.2/bcompiler_zend.c:858:2: warning: passing argument 1 of 'apc_serialize_zstring' discards 'const' qualifier from pointer target type [enabled by default]
  apc_serialize_zstring(zce->name, zce->name_length TSRMLS_CC);
  ^
/tmp/B.df031185-3ec0-4917-99ce-0ce3740a8d2c/BUILD/php-pecl-bcompiler-1.0.2/php_bcompiler.c:635:33: error: 'zend_class_entry' has no member named 'filename'
    if (zc->filename && strcmp(zc->filename, real_path) == 0)
                                 ^
In file included from /tmp/B.df031185-3ec0-4917-99ce-0ce3740a8d2c/BUILD/php-pecl-bcompiler-1.0.2/bcompiler_zend.c:23:0:
/tmp/B.df031185-3ec0-4917-99ce-0ce3740a8d2c/BUILD/php-pecl-bcompiler-1.0.2/php_bcompiler.h:298:6: note: expected 'char *' but argument is of type 'const char *'
 void apc_serialize_zstring(char* string, int len TSRMLS_DC);
      ^
/tmp/B.df031185-3ec0-4917-99ce-0ce3740a8d2c/BUILD/php-pecl-bcompiler-1.0.2/php_bcompiler.c:635:33: error: 'zend_class_entry' has no member named 'filename'
    if (zc->filename && strcmp(zc->filename, real_path) == 0)
                                 ^
/tmp/B.df031185-3ec0-4917-99ce-0ce3740a8d2c/BUILD/php-pecl-bcompiler-1.0.2/php_bcompiler.c:635:33: error: 'zend_class_entry' has no member named 'filename'
    if (zc->filename && strcmp(zc->filename, real_path) == 0)
                                 ^
/tmp/B.df031185-3ec0-4917-99ce-0ce3740a8d2c/BUILD/php-pecl-bcompiler-1.0.2/bcompiler_zend.c:872:3: warning: passing argument 1 of 'apc_serialize_zstring' discards 'const' qualifier from pointer target type [enabled by default]
   apc_serialize_zstring(zce->parent->name, zce->parent->name_length TSRMLS_CC);
   ^
In file included from /tmp/B.df031185-3ec0-4917-99ce-0ce3740a8d2c/BUILD/php-pecl-bcompiler-1.0.2/bcompiler_zend.c:23:0:
/tmp/B.df031185-3ec0-4917-99ce-0ce3740a8d2c/BUILD/php-pecl-bcompiler-1.0.2/php_bcompiler.h:298:6: note: expected 'char *' but argument is of type 'const char *'
 void apc_serialize_zstring(char* string, int len TSRMLS_DC);
      ^
/tmp/B.df031185-3ec0-4917-99ce-0ce3740a8d2c/BUILD/php-pecl-bcompiler-1.0.2/php_bcompiler.c:635:33: error: 'zend_class_entry' has no member named 'filename'
    if (zc->filename && strcmp(zc->filename, real_path) == 0)
                                 ^
/tmp/B.df031185-3ec0-4917-99ce-0ce3740a8d2c/BUILD/php-pecl-bcompiler-1.0.2/php_bcompiler.c:635:33: error: 'zend_class_entry' has no member named 'filename'
    if (zc->filename && strcmp(zc->filename, real_path) == 0)
                                 ^
/tmp/B.df031185-3ec0-4917-99ce-0ce3740a8d2c/BUILD/php-pecl-bcompiler-1.0.2/php_bcompiler.c:635:33: error: 'zend_class_entry' has no member named 'filename'
    if (zc->filename && strcmp(zc->filename, real_path) == 0)
                                 ^
/tmp/B.df031185-3ec0-4917-99ce-0ce3740a8d2c/BUILD/php-pecl-bcompiler-1.0.2/php_bcompiler.c:635:33: error: 'zend_class_entry' has no member named 'filename'
    if (zc->filename && strcmp(zc->filename, real_path) == 0)
                                 ^
/tmp/B.df031185-3ec0-4917-99ce-0ce3740a8d2c/BUILD/php-pecl-bcompiler-1.0.2/bcompiler_zend.c:886:22: error: 'zend_class_entry' has no member named 'constants_updated'
  SERIALIZE_SCALAR(zce->constants_updated, zend_bool);
                      ^
/tmp/B.df031185-3ec0-4917-99ce-0ce3740a8d2c/BUILD/php-pecl-bcompiler-1.0.2/php_bcompiler.h:223:32: note: in definition of macro 'SERIALIZE_SCALAR'
   *((type*)BCOMPILERG(_buf)) = x;                        \
                                ^
/tmp/B.df031185-3ec0-4917-99ce-0ce3740a8d2c/BUILD/php-pecl-bcompiler-1.0.2/php_bcompiler.c:635:33: error: 'zend_class_entry' has no member named 'filename'
    if (zc->filename && strcmp(zc->filename, real_path) == 0)
                                 ^
/tmp/B.df031185-3ec0-4917-99ce-0ce3740a8d2c/BUILD/php-pecl-bcompiler-1.0.2/php_bcompiler.c:635:33: error: 'zend_class_entry' has no member named 'filename'
    if (zc->filename && strcmp(zc->filename, real_path) == 0)
                                 ^
/tmp/B.df031185-3ec0-4917-99ce-0ce3740a8d2c/BUILD/php-pecl-bcompiler-1.0.2/bcompiler_zend.c:933:45: error: 'zend_class_entry' has no member named 'builtin_functions'
  if (zce->type == ZEND_INTERNAL_CLASS && zce->builtin_functions) { 
                                             ^
/tmp/B.df031185-3ec0-4917-99ce-0ce3740a8d2c/BUILD/php-pecl-bcompiler-1.0.2/php_bcompiler.c:635:33: error: 'zend_class_entry' has no member named 'filename'
    if (zc->filename && strcmp(zc->filename, real_path) == 0)
                                 ^
/tmp/B.df031185-3ec0-4917-99ce-0ce3740a8d2c/BUILD/php-pecl-bcompiler-1.0.2/php_bcompiler.c:635:33: error: 'zend_class_entry' has no member named 'filename'
    if (zc->filename && strcmp(zc->filename, real_path) == 0)
                                 ^
/tmp/B.df031185-3ec0-4917-99ce-0ce3740a8d2c/BUILD/php-pecl-bcompiler-1.0.2/bcompiler_zend.c:934:39: error: 'zend_class_entry' has no member named 'builtin_functions'
   for (zfe = (zend_function_entry*)zce->builtin_functions; zfe->fname != NULL; zfe++) {
                                       ^
/tmp/B.df031185-3ec0-4917-99ce-0ce3740a8d2c/BUILD/php-pecl-bcompiler-1.0.2/php_bcompiler.c:635:33: error: 'zend_class_entry' has no member named 'filename'
    if (zc->filename && strcmp(zc->filename, real_path) == 0)
                                 ^
/tmp/B.df031185-3ec0-4917-99ce-0ce3740a8d2c/BUILD/php-pecl-bcompiler-1.0.2/php_bcompiler.c:635:33: error: 'zend_class_entry' has no member named 'filename'
    if (zc->filename && strcmp(zc->filename, real_path) == 0)
                                 ^
/tmp/B.df031185-3ec0-4917-99ce-0ce3740a8d2c/BUILD/php-pecl-bcompiler-1.0.2/bcompiler_zend.c:941:64: error: 'zend_class_entry' has no member named 'builtin_functions'
   apc_serialize_zend_function_entry((zend_function_entry *)&zce->builtin_functions[i] TSRMLS_CC);
                                                                ^
/tmp/B.df031185-3ec0-4917-99ce-0ce3740a8d2c/BUILD/php-pecl-bcompiler-1.0.2/php_bcompiler.c:635:33: error: 'zend_class_entry' has no member named 'filename'
    if (zc->filename && strcmp(zc->filename, real_path) == 0)
                                 ^
/tmp/B.df031185-3ec0-4917-99ce-0ce3740a8d2c/BUILD/php-pecl-bcompiler-1.0.2/php_bcompiler.c:635:33: error: 'zend_class_entry' has no member named 'filename'
    if (zc->filename && strcmp(zc->filename, real_path) == 0)
                                 ^
/tmp/B.df031185-3ec0-4917-99ce-0ce3740a8d2c/BUILD/php-pecl-bcompiler-1.0.2/php_bcompiler.c:635:33: error: 'zend_class_entry' has no member named 'filename'
    if (zc->filename && strcmp(zc->filename, real_path) == 0)
                                 ^
/tmp/B.df031185-3ec0-4917-99ce-0ce3740a8d2c/BUILD/php-pecl-bcompiler-1.0.2/php_bcompiler.c:635:33: error: 'zend_class_entry' has no member named 'filename'
    if (zc->filename && strcmp(zc->filename, real_path) == 0)
                                 ^
/tmp/B.df031185-3ec0-4917-99ce-0ce3740a8d2c/BUILD/php-pecl-bcompiler-1.0.2/php_bcompiler.c:635:33: error: 'zend_class_entry' has no member named 'filename'
    if (zc->filename && strcmp(zc->filename, real_path) == 0)
                                 ^
/tmp/B.df031185-3ec0-4917-99ce-0ce3740a8d2c/BUILD/php-pecl-bcompiler-1.0.2/php_bcompiler.c:635:33: error: 'zend_class_entry' has no member named 'filename'
    if (zc->filename && strcmp(zc->filename, real_path) == 0)
                                 ^
/tmp/B.df031185-3ec0-4917-99ce-0ce3740a8d2c/BUILD/php-pecl-bcompiler-1.0.2/bcompiler_zend.c:967:5: warning: passing argument 1 of 'apc_serialize_zstring' discards 'const' qualifier from pointer target type [enabled by default]
     apc_serialize_zstring(zce->interfaces[i]->name, zce->interfaces[i]->name_length TSRMLS_CC);
     ^
In file included from /tmp/B.df031185-3ec0-4917-99ce-0ce3740a8d2c/BUILD/php-pecl-bcompiler-1.0.2/bcompiler_zend.c:23:0:
/tmp/B.df031185-3ec0-4917-99ce-0ce3740a8d2c/BUILD/php-pecl-bcompiler-1.0.2/php_bcompiler.h:298:6: note: expected 'char *' but argument is of type 'const char *'
 void apc_serialize_zstring(char* string, int len TSRMLS_DC);
      ^
/tmp/B.df031185-3ec0-4917-99ce-0ce3740a8d2c/BUILD/php-pecl-bcompiler-1.0.2/bcompiler_zend.c:977:46: error: 'zend_class_entry' has no member named 'filename'
   char* fname = bcompiler_handle_filename(zce->filename TSRMLS_CC);
                                              ^
In file included from /tmp/B.df031185-3ec0-4917-99ce-0ce3740a8d2c/BUILD/php-pecl-bcompiler-1.0.2/bcompiler_zend.c:23:0:
/tmp/B.df031185-3ec0-4917-99ce-0ce3740a8d2c/BUILD/php-pecl-bcompiler-1.0.2/bcompiler_zend.c:979:23: error: 'zend_class_entry' has no member named 'line_start'
   SERIALIZE_SCALAR(zce->line_start, int);
                       ^
/tmp/B.df031185-3ec0-4917-99ce-0ce3740a8d2c/BUILD/php-pecl-bcompiler-1.0.2/php_bcompiler.h:223:32: note: in definition of macro 'SERIALIZE_SCALAR'
   *((type*)BCOMPILERG(_buf)) = x;                        \
                                ^
/tmp/B.df031185-3ec0-4917-99ce-0ce3740a8d2c/BUILD/php-pecl-bcompiler-1.0.2/bcompiler_zend.c:980:23: error: 'zend_class_entry' has no member named 'line_end'
   SERIALIZE_SCALAR(zce->line_end, int);
                       ^
/tmp/B.df031185-3ec0-4917-99ce-0ce3740a8d2c/BUILD/php-pecl-bcompiler-1.0.2/php_bcompiler.h:223:32: note: in definition of macro 'SERIALIZE_SCALAR'
   *((type*)BCOMPILERG(_buf)) = x;                        \
                                ^
/tmp/B.df031185-3ec0-4917-99ce-0ce3740a8d2c/BUILD/php-pecl-bcompiler-1.0.2/bcompiler_zend.c:981:28: error: 'zend_class_entry' has no member named 'doc_comment'
   apc_serialize_zstring(zce->doc_comment, zce->doc_comment_len TSRMLS_CC);
                            ^
/tmp/B.df031185-3ec0-4917-99ce-0ce3740a8d2c/BUILD/php-pecl-bcompiler-1.0.2/bcompiler_zend.c:981:46: error: 'zend_class_entry' has no member named 'doc_comment_len'
   apc_serialize_zstring(zce->doc_comment, zce->doc_comment_len TSRMLS_CC);
                                              ^
In file included from /tmp/B.df031185-3ec0-4917-99ce-0ce3740a8d2c/BUILD/php-pecl-bcompiler-1.0.2/bcompiler_zend.c:23:0:
/tmp/B.df031185-3ec0-4917-99ce-0ce3740a8d2c/BUILD/php-pecl-bcompiler-1.0.2/bcompiler_zend.c:982:23: error: 'zend_class_entry' has no member named 'doc_comment_len'
   SERIALIZE_SCALAR(zce->doc_comment_len, int);
                       ^
/tmp/B.df031185-3ec0-4917-99ce-0ce3740a8d2c/BUILD/php-pecl-bcompiler-1.0.2/php_bcompiler.h:223:32: note: in definition of macro 'SERIALIZE_SCALAR'
   *((type*)BCOMPILERG(_buf)) = x;                        \
                                ^
/tmp/B.df031185-3ec0-4917-99ce-0ce3740a8d2c/BUILD/php-pecl-bcompiler-1.0.2/bcompiler_zend.c: In function 'apc_deserialize_zend_class_entry':
/tmp/B.df031185-3ec0-4917-99ce-0ce3740a8d2c/BUILD/php-pecl-bcompiler-1.0.2/bcompiler_zend.c:1092:25: error: 'zend_class_entry' has no member named 'constants_updated'
  DESERIALIZE_SCALAR(&zce->constants_updated, zend_bool);
                         ^
/tmp/B.df031185-3ec0-4917-99ce-0ce3740a8d2c/BUILD/php-pecl-bcompiler-1.0.2/php_bcompiler.h:239:4: note: in definition of macro 'DESERIALIZE_SCALAR_X'
  *(xp) = *((type*) BCOMPILERG(_buf));                                 \
    ^
/tmp/B.df031185-3ec0-4917-99ce-0ce3740a8d2c/BUILD/php-pecl-bcompiler-1.0.2/bcompiler_zend.c:1092:2: note: in expansion of macro 'DESERIALIZE_SCALAR'
  DESERIALIZE_SCALAR(&zce->constants_updated, zend_bool);
  ^
/tmp/B.df031185-3ec0-4917-99ce-0ce3740a8d2c/BUILD/php-pecl-bcompiler-1.0.2/bcompiler_zend.c:1187:5: error: 'zend_class_entry' has no member named 'builtin_functions'
  zce->builtin_functions = NULL;
     ^
/tmp/B.df031185-3ec0-4917-99ce-0ce3740a8d2c/BUILD/php-pecl-bcompiler-1.0.2/bcompiler_zend.c:1189:6: error: 'zend_class_entry' has no member named 'builtin_functions'
   zce->builtin_functions = (zend_function_entry*) ecalloc(count+1, sizeof(zend_function_entry));
      ^
/tmp/B.df031185-3ec0-4917-99ce-0ce3740a8d2c/BUILD/php-pecl-bcompiler-1.0.2/bcompiler_zend.c:1191:66: error: 'zend_class_entry' has no member named 'builtin_functions'
    apc_deserialize_zend_function_entry((zend_function_entry*)&zce->builtin_functions[i] TSRMLS_CC);
                                                                  ^
/tmp/B.df031185-3ec0-4917-99ce-0ce3740a8d2c/BUILD/php-pecl-bcompiler-1.0.2/bcompiler_zend.c:1240:6: error: 'zend_class_entry' has no member named 'filename'
   zce->filename = fname ? fname : estrdup(BCOMPILERG(current_filename));
      ^
In file included from /tmp/B.df031185-3ec0-4917-99ce-0ce3740a8d2c/BUILD/php-pecl-bcompiler-1.0.2/bcompiler_zend.c:23:0:
/tmp/B.df031185-3ec0-4917-99ce-0ce3740a8d2c/BUILD/php-pecl-bcompiler-1.0.2/bcompiler_zend.c:1241:26: error: 'zend_class_entry' has no member named 'line_start'
   DESERIALIZE_SCALAR(&zce->line_start, int);
                          ^
/tmp/B.df031185-3ec0-4917-99ce-0ce3740a8d2c/BUILD/php-pecl-bcompiler-1.0.2/php_bcompiler.h:239:4: note: in definition of macro 'DESERIALIZE_SCALAR_X'
  *(xp) = *((type*) BCOMPILERG(_buf));                                 \
    ^
/tmp/B.df031185-3ec0-4917-99ce-0ce3740a8d2c/BUILD/php-pecl-bcompiler-1.0.2/bcompiler_zend.c:1241:3: note: in expansion of macro 'DESERIALIZE_SCALAR'
   DESERIALIZE_SCALAR(&zce->line_start, int);
   ^
/tmp/B.df031185-3ec0-4917-99ce-0ce3740a8d2c/BUILD/php-pecl-bcompiler-1.0.2/bcompiler_zend.c:1242:26: error: 'zend_class_entry' has no member named 'line_end'
   DESERIALIZE_SCALAR(&zce->line_end, int);
                          ^
/tmp/B.df031185-3ec0-4917-99ce-0ce3740a8d2c/BUILD/php-pecl-bcompiler-1.0.2/php_bcompiler.h:239:4: note: in definition of macro 'DESERIALIZE_SCALAR_X'
  *(xp) = *((type*) BCOMPILERG(_buf));                                 \
    ^
/tmp/B.df031185-3ec0-4917-99ce-0ce3740a8d2c/BUILD/php-pecl-bcompiler-1.0.2/bcompiler_zend.c:1242:3: note: in expansion of macro 'DESERIALIZE_SCALAR'
   DESERIALIZE_SCALAR(&zce->line_end, int);
   ^
In file included from /tmp/B.df031185-3ec0-4917-99ce-0ce3740a8d2c/BUILD/php-pecl-bcompiler-1.0.2/bcompiler_zend.c:23:0:
/tmp/B.df031185-3ec0-4917-99ce-0ce3740a8d2c/BUILD/php-pecl-bcompiler-1.0.2/bcompiler_zend.c:1243:32: error: 'zend_class_entry' has no member named 'doc_comment'
   apc_create_string_u(ZS2SP(zce->doc_comment), -1 TSRMLS_CC);
                                ^
/tmp/B.df031185-3ec0-4917-99ce-0ce3740a8d2c/BUILD/php-pecl-bcompiler-1.0.2/php_bcompiler.h:126:32: note: in definition of macro 'ZS2SP'
 # define ZS2SP(zstr) ((char**)&zstr)
                                ^
Makefile:201: recipe for target 'php_bcompiler.lo' failed
make: *** [php_bcompiler.lo] Error 1
make: *** Waiting for unfinished jobs....
In file included from /tmp/B.df031185-3ec0-4917-99ce-0ce3740a8d2c/BUILD/php-pecl-bcompiler-1.0.2/bcompiler_zend.c:23:0:
/tmp/B.df031185-3ec0-4917-99ce-0ce3740a8d2c/BUILD/php-pecl-bcompiler-1.0.2/bcompiler_zend.c:1244:26: error: 'zend_class_entry' has no member named 'doc_comment_len'
   DESERIALIZE_SCALAR(&zce->doc_comment_len, int);
                          ^
/tmp/B.df031185-3ec0-4917-99ce-0ce3740a8d2c/BUILD/php-pecl-bcompiler-1.0.2/php_bcompiler.h:239:4: note: in definition of macro 'DESERIALIZE_SCALAR_X'
  *(xp) = *((type*) BCOMPILERG(_buf));                                 \
    ^
/tmp/B.df031185-3ec0-4917-99ce-0ce3740a8d2c/BUILD/php-pecl-bcompiler-1.0.2/bcompiler_zend.c:1244:3: note: in expansion of macro 'DESERIALIZE_SCALAR'
   DESERIALIZE_SCALAR(&zce->doc_comment_len, int);
   ^
/tmp/B.df031185-3ec0-4917-99ce-0ce3740a8d2c/BUILD/php-pecl-bcompiler-1.0.2/bcompiler_zend.c: In function 'apc_serialize_zend_op_array':
/tmp/B.df031185-3ec0-4917-99ce-0ce3740a8d2c/BUILD/php-pecl-bcompiler-1.0.2/bcompiler_zend.c:1562:2: warning: passing argument 1 of 'apc_serialize_string' discards 'const' qualifier from pointer target type [enabled by default]
  apc_serialize_string(zoa->function_name TSRMLS_CC);
  ^
In file included from /tmp/B.df031185-3ec0-4917-99ce-0ce3740a8d2c/BUILD/php-pecl-bcompiler-1.0.2/bcompiler_zend.c:23:0:
/tmp/B.df031185-3ec0-4917-99ce-0ce3740a8d2c/BUILD/php-pecl-bcompiler-1.0.2/php_bcompiler.h:297:6: note: expected 'char *' but argument is of type 'const char *'
 void apc_serialize_string(char* string TSRMLS_DC);
      ^
/tmp/B.df031185-3ec0-4917-99ce-0ce3740a8d2c/BUILD/php-pecl-bcompiler-1.0.2/bcompiler_zend.c:1567:22: error: 'zend_op_array' has no member named 'size_literal'
  SERIALIZE_SCALAR(zoa->size_literal, zend_uint);
                      ^
/tmp/B.df031185-3ec0-4917-99ce-0ce3740a8d2c/BUILD/php-pecl-bcompiler-1.0.2/php_bcompiler.h:223:32: note: in definition of macro 'SERIALIZE_SCALAR'
   *((type*)BCOMPILERG(_buf)) = x;                        \
                                ^
/tmp/B.df031185-3ec0-4917-99ce-0ce3740a8d2c/BUILD/php-pecl-bcompiler-1.0.2/bcompiler_zend.c:1575:22: error: 'zend_op_array' has no member named 'size'
  SERIALIZE_SCALAR(zoa->size, zend_uint);
                      ^
/tmp/B.df031185-3ec0-4917-99ce-0ce3740a8d2c/BUILD/php-pecl-bcompiler-1.0.2/php_bcompiler.h:223:32: note: in definition of macro 'SERIALIZE_SCALAR'
   *((type*)BCOMPILERG(_buf)) = x;                        \
                                ^
/tmp/B.df031185-3ec0-4917-99ce-0ce3740a8d2c/BUILD/php-pecl-bcompiler-1.0.2/bcompiler_zend.c:1598:22: error: 'zend_op_array' has no member named 'current_brk_cont'
  SERIALIZE_SCALAR(zoa->current_brk_cont, zend_uint);
                      ^
/tmp/B.df031185-3ec0-4917-99ce-0ce3740a8d2c/BUILD/php-pecl-bcompiler-1.0.2/php_bcompiler.h:223:32: note: in definition of macro 'SERIALIZE_SCALAR'
   *((type*)BCOMPILERG(_buf)) = x;                        \
                                ^
/tmp/B.df031185-3ec0-4917-99ce-0ce3740a8d2c/BUILD/php-pecl-bcompiler-1.0.2/bcompiler_zend.c:1611:22: error: 'zend_op_array' has no member named 'return_reference'
  SERIALIZE_SCALAR(zoa->return_reference, zend_bool);
                      ^
/tmp/B.df031185-3ec0-4917-99ce-0ce3740a8d2c/BUILD/php-pecl-bcompiler-1.0.2/php_bcompiler.h:223:32: note: in definition of macro 'SERIALIZE_SCALAR'
   *((type*)BCOMPILERG(_buf)) = x;                        \
                                ^
/tmp/B.df031185-3ec0-4917-99ce-0ce3740a8d2c/BUILD/php-pecl-bcompiler-1.0.2/bcompiler_zend.c:1612:22: error: 'zend_op_array' has no member named 'done_pass_two'
  SERIALIZE_SCALAR(zoa->done_pass_two, zend_bool);
                      ^
/tmp/B.df031185-3ec0-4917-99ce-0ce3740a8d2c/BUILD/php-pecl-bcompiler-1.0.2/php_bcompiler.h:223:32: note: in definition of macro 'SERIALIZE_SCALAR'
   *((type*)BCOMPILERG(_buf)) = x;                        \
                                ^
/tmp/B.df031185-3ec0-4917-99ce-0ce3740a8d2c/BUILD/php-pecl-bcompiler-1.0.2/bcompiler_zend.c:1613:2: warning: passing argument 1 of 'bcompiler_handle_filename' discards 'const' qualifier from pointer target type [enabled by default]
  fname = bcompiler_handle_filename(zoa->filename TSRMLS_CC);
  ^
In file included from /tmp/B.df031185-3ec0-4917-99ce-0ce3740a8d2c/BUILD/php-pecl-bcompiler-1.0.2/bcompiler_zend.c:23:0:
/tmp/B.df031185-3ec0-4917-99ce-0ce3740a8d2c/BUILD/php-pecl-bcompiler-1.0.2/php_bcompiler.h:296:7: note: expected 'char *' but argument is of type 'const char *'
 char *bcompiler_handle_filename(char *filename TSRMLS_DC);
       ^
/tmp/B.df031185-3ec0-4917-99ce-0ce3740a8d2c/BUILD/php-pecl-bcompiler-1.0.2/bcompiler_zend.c:1627:3: warning: passing argument 1 of 'apc_serialize_string' discards 'const' qualifier from pointer target type [enabled by default]
   apc_serialize_string(zoa->scope ? zoa->scope->name : NULL TSRMLS_CC);
   ^
In file included from /tmp/B.df031185-3ec0-4917-99ce-0ce3740a8d2c/BUILD/php-pecl-bcompiler-1.0.2/bcompiler_zend.c:23:0:
/tmp/B.df031185-3ec0-4917-99ce-0ce3740a8d2c/BUILD/php-pecl-bcompiler-1.0.2/php_bcompiler.h:297:6: note: expected 'char *' but argument is of type 'const char *'
 void apc_serialize_string(char* string TSRMLS_DC);
      ^
/tmp/B.df031185-3ec0-4917-99ce-0ce3740a8d2c/BUILD/php-pecl-bcompiler-1.0.2/bcompiler_zend.c:1631:23: error: 'zend_op_array' has no member named 'pass_rest_by_reference'
   SERIALIZE_SCALAR(zoa->pass_rest_by_reference, zend_bool);
                       ^
/tmp/B.df031185-3ec0-4917-99ce-0ce3740a8d2c/BUILD/php-pecl-bcompiler-1.0.2/php_bcompiler.h:223:32: note: in definition of macro 'SERIALIZE_SCALAR'
   *((type*)BCOMPILERG(_buf)) = x;                        \
                                ^
/tmp/B.df031185-3ec0-4917-99ce-0ce3740a8d2c/BUILD/php-pecl-bcompiler-1.0.2/bcompiler_zend.c:1633:23: error: 'zend_op_array' has no member named 'backpatch_count'
   SERIALIZE_SCALAR(zoa->backpatch_count, int);
                       ^
/tmp/B.df031185-3ec0-4917-99ce-0ce3740a8d2c/BUILD/php-pecl-bcompiler-1.0.2/php_bcompiler.h:223:32: note: in definition of macro 'SERIALIZE_SCALAR'
   *((type*)BCOMPILERG(_buf)) = x;                        \
                                ^
/tmp/B.df031185-3ec0-4917-99ce-0ce3740a8d2c/BUILD/php-pecl-bcompiler-1.0.2/bcompiler_zend.c:1645:23: error: 'zend_op_array' has no member named 'size_var'
   SERIALIZE_SCALAR(zoa->size_var, int);
                       ^
/tmp/B.df031185-3ec0-4917-99ce-0ce3740a8d2c/BUILD/php-pecl-bcompiler-1.0.2/php_bcompiler.h:223:32: note: in definition of macro 'SERIALIZE_SCALAR'
   *((type*)BCOMPILERG(_buf)) = x;                        \
                                ^
/tmp/B.df031185-3ec0-4917-99ce-0ce3740a8d2c/BUILD/php-pecl-bcompiler-1.0.2/bcompiler_zend.c:1680:3: warning: passing argument 1 of 'apc_serialize_zstring' discards 'const' qualifier from pointer target type [enabled by default]
   apc_serialize_zstring(zoa->doc_comment, zoa->doc_comment_len TSRMLS_CC);
   ^
In file included from /tmp/B.df031185-3ec0-4917-99ce-0ce3740a8d2c/BUILD/php-pecl-bcompiler-1.0.2/bcompiler_zend.c:23:0:
/tmp/B.df031185-3ec0-4917-99ce-0ce3740a8d2c/BUILD/php-pecl-bcompiler-1.0.2/php_bcompiler.h:298:6: note: expected 'char *' but argument is of type 'const char *'
 void apc_serialize_zstring(char* string, int len TSRMLS_DC);
      ^
/tmp/B.df031185-3ec0-4917-99ce-0ce3740a8d2c/BUILD/php-pecl-bcompiler-1.0.2/bcompiler_zend.c: In function 'apc_deserialize_zend_op_array':
/tmp/B.df031185-3ec0-4917-99ce-0ce3740a8d2c/BUILD/php-pecl-bcompiler-1.0.2/bcompiler_zend.c:1709:25: error: 'zend_op_array' has no member named 'size_literal'
  DESERIALIZE_SCALAR(&zoa->size_literal, zend_uint);
                         ^
/tmp/B.df031185-3ec0-4917-99ce-0ce3740a8d2c/BUILD/php-pecl-bcompiler-1.0.2/php_bcompiler.h:239:4: note: in definition of macro 'DESERIALIZE_SCALAR_X'
  *(xp) = *((type*) BCOMPILERG(_buf));                                 \
    ^
/tmp/B.df031185-3ec0-4917-99ce-0ce3740a8d2c/BUILD/php-pecl-bcompiler-1.0.2/bcompiler_zend.c:1709:2: note: in expansion of macro 'DESERIALIZE_SCALAR'
  DESERIALIZE_SCALAR(&zoa->size_literal, zend_uint);
  ^
/tmp/B.df031185-3ec0-4917-99ce-0ce3740a8d2c/BUILD/php-pecl-bcompiler-1.0.2/bcompiler_zend.c:1725:25: error: 'zend_op_array' has no member named 'size'
  DESERIALIZE_SCALAR(&zoa->size, zend_uint);
                         ^
/tmp/B.df031185-3ec0-4917-99ce-0ce3740a8d2c/BUILD/php-pecl-bcompiler-1.0.2/php_bcompiler.h:239:4: note: in definition of macro 'DESERIALIZE_SCALAR_X'
  *(xp) = *((type*) BCOMPILERG(_buf));                                 \
    ^
/tmp/B.df031185-3ec0-4917-99ce-0ce3740a8d2c/BUILD/php-pecl-bcompiler-1.0.2/bcompiler_zend.c:1725:2: note: in expansion of macro 'DESERIALIZE_SCALAR'
  DESERIALIZE_SCALAR(&zoa->size, zend_uint);
  ^
/tmp/B.df031185-3ec0-4917-99ce-0ce3740a8d2c/BUILD/php-pecl-bcompiler-1.0.2/bcompiler_zend.c:1739:25: error: 'zend_op_array' has no member named 'current_brk_cont'
  DESERIALIZE_SCALAR(&zoa->current_brk_cont, zend_uint);
                         ^
/tmp/B.df031185-3ec0-4917-99ce-0ce3740a8d2c/BUILD/php-pecl-bcompiler-1.0.2/php_bcompiler.h:239:4: note: in definition of macro 'DESERIALIZE_SCALAR_X'
  *(xp) = *((type*) BCOMPILERG(_buf));                                 \
    ^
/tmp/B.df031185-3ec0-4917-99ce-0ce3740a8d2c/BUILD/php-pecl-bcompiler-1.0.2/bcompiler_zend.c:1739:2: note: in expansion of macro 'DESERIALIZE_SCALAR'
  DESERIALIZE_SCALAR(&zoa->current_brk_cont, zend_uint);
  ^
/tmp/B.df031185-3ec0-4917-99ce-0ce3740a8d2c/BUILD/php-pecl-bcompiler-1.0.2/bcompiler_zend.c:1752:5: error: 'zend_op_array' has no member named 'start_op'
  zoa->start_op = NULL;
     ^
In file included from /tmp/B.df031185-3ec0-4917-99ce-0ce3740a8d2c/BUILD/php-pecl-bcompiler-1.0.2/bcompiler_zend.c:23:0:
/tmp/B.df031185-3ec0-4917-99ce-0ce3740a8d2c/BUILD/php-pecl-bcompiler-1.0.2/bcompiler_zend.c:1754:25: error: 'zend_op_array' has no member named 'return_reference'
  DESERIALIZE_SCALAR(&zoa->return_reference, zend_bool);
                         ^
/tmp/B.df031185-3ec0-4917-99ce-0ce3740a8d2c/BUILD/php-pecl-bcompiler-1.0.2/php_bcompiler.h:239:4: note: in definition of macro 'DESERIALIZE_SCALAR_X'
  *(xp) = *((type*) BCOMPILERG(_buf));                                 \
    ^
/tmp/B.df031185-3ec0-4917-99ce-0ce3740a8d2c/BUILD/php-pecl-bcompiler-1.0.2/bcompiler_zend.c:1754:2: note: in expansion of macro 'DESERIALIZE_SCALAR'
  DESERIALIZE_SCALAR(&zoa->return_reference, zend_bool);
  ^
/tmp/B.df031185-3ec0-4917-99ce-0ce3740a8d2c/BUILD/php-pecl-bcompiler-1.0.2/bcompiler_zend.c:1755:25: error: 'zend_op_array' has no member named 'done_pass_two'
  DESERIALIZE_SCALAR(&zoa->done_pass_two, zend_bool);
                         ^
/tmp/B.df031185-3ec0-4917-99ce-0ce3740a8d2c/BUILD/php-pecl-bcompiler-1.0.2/php_bcompiler.h:239:4: note: in definition of macro 'DESERIALIZE_SCALAR_X'
  *(xp) = *((type*) BCOMPILERG(_buf));                                 \
    ^
/tmp/B.df031185-3ec0-4917-99ce-0ce3740a8d2c/BUILD/php-pecl-bcompiler-1.0.2/bcompiler_zend.c:1755:2: note: in expansion of macro 'DESERIALIZE_SCALAR'
  DESERIALIZE_SCALAR(&zoa->done_pass_two, zend_bool);
  ^
/tmp/B.df031185-3ec0-4917-99ce-0ce3740a8d2c/BUILD/php-pecl-bcompiler-1.0.2/bcompiler_zend.c:1801:26: error: 'zend_op_array' has no member named 'pass_rest_by_reference'
   DESERIALIZE_SCALAR(&zoa->pass_rest_by_reference, zend_bool);
                          ^
/tmp/B.df031185-3ec0-4917-99ce-0ce3740a8d2c/BUILD/php-pecl-bcompiler-1.0.2/php_bcompiler.h:239:4: note: in definition of macro 'DESERIALIZE_SCALAR_X'
  *(xp) = *((type*) BCOMPILERG(_buf));                                 \
    ^
/tmp/B.df031185-3ec0-4917-99ce-0ce3740a8d2c/BUILD/php-pecl-bcompiler-1.0.2/bcompiler_zend.c:1801:3: note: in expansion of macro 'DESERIALIZE_SCALAR'
   DESERIALIZE_SCALAR(&zoa->pass_rest_by_reference, zend_bool);
   ^
/tmp/B.df031185-3ec0-4917-99ce-0ce3740a8d2c/BUILD/php-pecl-bcompiler-1.0.2/bcompiler_zend.c:1802:26: error: 'zend_op_array' has no member named 'backpatch_count'
   DESERIALIZE_SCALAR(&zoa->backpatch_count, int);
                          ^
/tmp/B.df031185-3ec0-4917-99ce-0ce3740a8d2c/BUILD/php-pecl-bcompiler-1.0.2/php_bcompiler.h:239:4: note: in definition of macro 'DESERIALIZE_SCALAR_X'
  *(xp) = *((type*) BCOMPILERG(_buf));                                 \
    ^
/tmp/B.df031185-3ec0-4917-99ce-0ce3740a8d2c/BUILD/php-pecl-bcompiler-1.0.2/bcompiler_zend.c:1802:3: note: in expansion of macro 'DESERIALIZE_SCALAR'
   DESERIALIZE_SCALAR(&zoa->backpatch_count, int);
   ^
/tmp/B.df031185-3ec0-4917-99ce-0ce3740a8d2c/BUILD/php-pecl-bcompiler-1.0.2/bcompiler_zend.c:1814:26: error: 'zend_op_array' has no member named 'size_var'
   DESERIALIZE_SCALAR(&zoa->size_var, int);
                          ^
/tmp/B.df031185-3ec0-4917-99ce-0ce3740a8d2c/BUILD/php-pecl-bcompiler-1.0.2/php_bcompiler.h:239:4: note: in definition of macro 'DESERIALIZE_SCALAR_X'
  *(xp) = *((type*) BCOMPILERG(_buf));                                 \
    ^
/tmp/B.df031185-3ec0-4917-99ce-0ce3740a8d2c/BUILD/php-pecl-bcompiler-1.0.2/bcompiler_zend.c:1814:3: note: in expansion of macro 'DESERIALIZE_SCALAR'
   DESERIALIZE_SCALAR(&zoa->size_var, int);
   ^
/tmp/B.df031185-3ec0-4917-99ce-0ce3740a8d2c/BUILD/php-pecl-bcompiler-1.0.2/bcompiler_zend.c:1815:10: error: 'zend_op_array' has no member named 'size_var'
   if (zoa->size_var > 0) {
          ^
In file included from /usr/include/php/Zend/zend.h:252:0,
                 from /usr/include/php/main/php.h:34,
                 from /tmp/B.df031185-3ec0-4917-99ce-0ce3740a8d2c/BUILD/php-pecl-bcompiler-1.0.2/php_bcompiler.h:31,
                 from /tmp/B.df031185-3ec0-4917-99ce-0ce3740a8d2c/BUILD/php-pecl-bcompiler-1.0.2/bcompiler_zend.c:23:
/tmp/B.df031185-3ec0-4917-99ce-0ce3740a8d2c/BUILD/php-pecl-bcompiler-1.0.2/bcompiler_zend.c:1816:27: error: 'zend_op_array' has no member named 'size_var'
    zoa->vars = ecalloc(zoa->size_var, sizeof(zoa->vars[0]));
                           ^
/usr/include/php/Zend/zend_alloc.h:73:43: note: in definition of macro 'ecalloc'
 #define ecalloc(nmemb, size)    _ecalloc((nmemb), (size) ZEND_FILE_LINE_CC ZEND_FILE_LINE_EMPTY_CC)
                                           ^
Makefile:205: recipe for target 'bcompiler_zend.lo' failed
make: *** [bcompiler_zend.lo] Error 1
error: Bad exit status from /tmp/B.df031185-3ec0-4917-99ce-0ce3740a8d2c/BUILD/tmp/rpm-tmp.80385 (%build)


RPM build errors:
    Bad exit status from /tmp/B.df031185-3ec0-4917-99ce-0ce3740a8d2c/BUILD/tmp/rpm-tmp.80385 (%build)
ended at: Mon Apr 28 14:13:47 2014, done in 0:00:06.549749
error: No files produced.
+ chmod -R u+rwX /tmp/B.df031185-3ec0-4917-99ce-0ce3740a8d2c/BUILD
+ rm -rf /tmp/B.df031185-3ec0-4917-99ce-0ce3740a8d2c/tmp /tmp/B.df031185-3ec0-4917-99ce-0ce3740a8d2c/BUILD
+ rm -rf /tmp/B.df031185-3ec0-4917-99ce-0ce3740a8d2c
Begin-PLD-Builder-Info
Build-Time: user:7.39s sys:0.53s real:12.01s (faults io:0 non-io:738097)

End-PLD-Builder-Info
[Back to list of logs] [View rpm -qa of builder]