FailedOk

th/SRPMS[OK]
th/x32[OK]
th/i686[OK]
th/x86_64[OK]

ac/SRPMS[OK]
ac/i386[OK]
ac/i586[OK]
ac/i686[OK]
ac/alpha[OK]
ac/amd64[OK]
ac/athlon[OK]
ac/ppc[OK]
ac/sparc[OK]
ac/sparc64[OK]

Advanced Search
main()
Powered by PLD Linux
(c) 2002-2021 PLD Team
$Revision: 1.37 $
Powered by vim.
Your IP: 54.227.97.219

php-pecl-crack a370d466-09aa-42f8-9483-2b4804246e9b

Status:Failed
Source URL:https://buildlogs.pld-linux.org/pld/th/i686/FAIL/php-pecl-crack,a370d466-09aa-42f8-9483-2b4804246e9b.bz2
text/plain URL:View!
full text:View!
rpm -qa of builder:View!
Date:2014/04/28 14:14:05
Runtime:0:00:07.136224

Toc:

  • error 1
  • /tmp/B.029b0d9f-a53a-4212-94a5-415765a82dd1/BUILD/php-pecl-crack-0.4/crack.c:41:1: error: unknown type name 'function_entry'
  • error 2
  • /usr/include/php/main/php_globals.h:32:29: error: 'struct _php_core_globals' has no member named 'safe_mode'
  • error 3
  • /tmp/B.029b0d9f-a53a-4212-94a5-415765a82dd1/BUILD/php-pecl-crack-0.4/crack.c:109:36: error: 'CHECKUID_CHECK_FILE_AND_DIR' undeclared (first use in this function)
  • error 4
  • Makefile:201: recipe for target 'crack.lo' failed
  • error 5
  • error: Bad exit status from /tmp/B.029b0d9f-a53a-4212-94a5-415765a82dd1/BUILD/tmp/rpm-tmp.40146 (%build)
  • error 6
  • RPM build errors:
  • error 7
  • error: No files produced.

Content:

checking whether the C compiler works... yes
checking for C compiler default output file name... a.out
checking for suffix of executables... 
checking whether we are cross compiling... no
checking for suffix of object files... o
checking whether we are using the GNU C compiler... yes
checking whether i686-pld-linux-gcc accepts -g... yes
checking for i686-pld-linux-gcc option to accept ISO C89... none needed
checking how to run the C preprocessor... i686-pld-linux-gcc -E
checking for icc... no
checking for suncc... no
checking whether i686-pld-linux-gcc and cc understand -c and -o together... yes
checking for system library directory... lib
checking if compiler supports -R... no
checking if compiler supports -Wl,-rpath,... yes
checking build system type... i686-pld-linux-gnu
checking host system type... i686-pld-linux-gnu
checking target system type... i686-pld-linux-gnu
checking for PHP prefix... /usr
checking for PHP includes... -I/usr/include/php -I/usr/include/php/main -I/usr/include/php/TSRM -I/usr/include/php/Zend -I/usr/include/php/ext -I/usr/include/php/ext/date/lib
checking for PHP extension directory... /usr/lib/php
checking for PHP installed headers prefix... /usr/include/php
checking if debug is enabled... no
checking if zts is enabled... no
checking for re2c... re2c
checking for re2c version... 0.13.5 (ok)
checking for gawk... gawk
checking for cracklib support... yes, shared
checking how to print strings... print -r
checking for a sed that does not truncate output... (cached) /bin/sed
checking for fgrep... /bin/grep -F
checking for ld used by i686-pld-linux-gcc... /usr/bin/ld
checking if the linker (/usr/bin/ld) is GNU ld... yes
checking for BSD- or MS-compatible name lister (nm)... /usr/bin/nm -B
checking the name lister (/usr/bin/nm -B) interface... BSD nm
checking whether ln -s works... yes
checking the maximum length of command line arguments... 1572864
checking whether the shell understands some XSI constructs... yes
checking whether the shell understands "+="... yes
checking how to convert i686-pld-linux-gnu file names to i686-pld-linux-gnu format... func_convert_file_noop
checking how to convert i686-pld-linux-gnu file names to toolchain format... func_convert_file_noop
checking for /usr/bin/ld option to reload object files... -r
checking for i686-pld-linux-objdump... no
checking for objdump... objdump
checking how to recognize dependent libraries... pass_all
checking for i686-pld-linux-dlltool... no
checking for dlltool... no
checking how to associate runtime and link libraries... print -r --
checking for i686-pld-linux-ar... no
checking for ar... ar
checking for archiver @FILE support... @
checking for i686-pld-linux-strip... no
checking for strip... strip
checking for i686-pld-linux-ranlib... no
checking for ranlib... ranlib
checking for mawk... (cached) gawk
checking command to parse /usr/bin/nm -B output from i686-pld-linux-gcc object... ok
checking for sysroot... no
checking for i686-pld-linux-mt... no
checking for mt... no
checking if : is a manifest tool... no
checking for ANSI C header files... yes
checking for sys/types.h... yes
checking for sys/stat.h... yes
checking for stdlib.h... yes
checking for string.h... yes
checking for memory.h... yes
checking for strings.h... yes
checking for inttypes.h... yes
checking for stdint.h... yes
checking for unistd.h... yes
checking for dlfcn.h... yes
checking for objdir... .libs
checking if i686-pld-linux-gcc supports -fno-rtti -fno-exceptions... no
checking for i686-pld-linux-gcc option to produce PIC... -fPIC -DPIC
checking if i686-pld-linux-gcc PIC flag -fPIC -DPIC works... yes
checking if i686-pld-linux-gcc static flag -static works... yes
checking if i686-pld-linux-gcc supports -c -o file.o... yes
checking if i686-pld-linux-gcc supports -c -o file.o... (cached) yes
checking whether the i686-pld-linux-gcc linker (/usr/bin/ld) supports shared libraries... yes
checking whether -lc should be explicitly linked in... no
checking dynamic linker characteristics... GNU/Linux ld.so
checking how to hardcode library paths into programs... immediate
checking whether stripping libraries is possible... yes
checking if libtool supports shared libraries... yes
checking whether to build shared libraries... yes
checking whether to build static libraries... no
configure: creating ./config.status
config.status: creating config.h
config.status: executing libtool commands
+ /usr/bin/make -j9
/bin/sh /tmp/B.029b0d9f-a53a-4212-94a5-415765a82dd1/BUILD/php-pecl-crack-0.4/libtool --mode=compile i686-pld-linux-gcc -I/tmp/B.029b0d9f-a53a-4212-94a5-415765a82dd1/BUILD/php-pecl-crack-0.4/libcrack/include -I. -I/tmp/B.029b0d9f-a53a-4212-94a5-415765a82dd1/BUILD/php-pecl-crack-0.4 -DPHP_ATOM_INC -I/tmp/B.029b0d9f-a53a-4212-94a5-415765a82dd1/BUILD/php-pecl-crack-0.4/include -I/tmp/B.029b0d9f-a53a-4212-94a5-415765a82dd1/BUILD/php-pecl-crack-0.4/main -I/tmp/B.029b0d9f-a53a-4212-94a5-415765a82dd1/BUILD/php-pecl-crack-0.4 -I/usr/include/php -I/usr/include/php/main -I/usr/include/php/TSRM -I/usr/include/php/Zend -I/usr/include/php/ext -I/usr/include/php/ext/date/lib  -DHAVE_CONFIG_H  -O2 -fwrapv -pipe -Wformat -Werror=format-security -gdwarf-4 -fno-debug-types-section -fvar-tracking-assignments -g2 -Wp,-D_FORTIFY_SOURCE=2 -fstack-protector --param=ssp-buffer-size=4 -fomit-frame-pointer -march=i686 -fasynchronous-unwind-tables -mtune=pentium4 -gdwarf-4 -fno-debug-types-section -fvar-tracking-assignments -g2   -c /tmp/B.029b0d9f-a53a-4212-94a5-415765a82dd1/BUILD/php-pecl-crack-0.4/crack.c -o crack.lo 
/bin/sh /tmp/B.029b0d9f-a53a-4212-94a5-415765a82dd1/BUILD/php-pecl-crack-0.4/libtool --mode=compile i686-pld-linux-gcc -I/tmp/B.029b0d9f-a53a-4212-94a5-415765a82dd1/BUILD/php-pecl-crack-0.4/libcrack/include -I. -I/tmp/B.029b0d9f-a53a-4212-94a5-415765a82dd1/BUILD/php-pecl-crack-0.4 -DPHP_ATOM_INC -I/tmp/B.029b0d9f-a53a-4212-94a5-415765a82dd1/BUILD/php-pecl-crack-0.4/include -I/tmp/B.029b0d9f-a53a-4212-94a5-415765a82dd1/BUILD/php-pecl-crack-0.4/main -I/tmp/B.029b0d9f-a53a-4212-94a5-415765a82dd1/BUILD/php-pecl-crack-0.4 -I/usr/include/php -I/usr/include/php/main -I/usr/include/php/TSRM -I/usr/include/php/Zend -I/usr/include/php/ext -I/usr/include/php/ext/date/lib  -DHAVE_CONFIG_H  -O2 -fwrapv -pipe -Wformat -Werror=format-security -gdwarf-4 -fno-debug-types-section -fvar-tracking-assignments -g2 -Wp,-D_FORTIFY_SOURCE=2 -fstack-protector --param=ssp-buffer-size=4 -fomit-frame-pointer -march=i686 -fasynchronous-unwind-tables -mtune=pentium4 -gdwarf-4 -fno-debug-types-section -fvar-tracking-assignments -g2   -c /tmp/B.029b0d9f-a53a-4212-94a5-415765a82dd1/BUILD/php-pecl-crack-0.4/libcrack/src/fascist.c -o libcrack/src/fascist.lo 
/bin/sh /tmp/B.029b0d9f-a53a-4212-94a5-415765a82dd1/BUILD/php-pecl-crack-0.4/libtool --mode=compile i686-pld-linux-gcc -I/tmp/B.029b0d9f-a53a-4212-94a5-415765a82dd1/BUILD/php-pecl-crack-0.4/libcrack/include -I. -I/tmp/B.029b0d9f-a53a-4212-94a5-415765a82dd1/BUILD/php-pecl-crack-0.4 -DPHP_ATOM_INC -I/tmp/B.029b0d9f-a53a-4212-94a5-415765a82dd1/BUILD/php-pecl-crack-0.4/include -I/tmp/B.029b0d9f-a53a-4212-94a5-415765a82dd1/BUILD/php-pecl-crack-0.4/main -I/tmp/B.029b0d9f-a53a-4212-94a5-415765a82dd1/BUILD/php-pecl-crack-0.4 -I/usr/include/php -I/usr/include/php/main -I/usr/include/php/TSRM -I/usr/include/php/Zend -I/usr/include/php/ext -I/usr/include/php/ext/date/lib  -DHAVE_CONFIG_H  -O2 -fwrapv -pipe -Wformat -Werror=format-security -gdwarf-4 -fno-debug-types-section -fvar-tracking-assignments -g2 -Wp,-D_FORTIFY_SOURCE=2 -fstack-protector --param=ssp-buffer-size=4 -fomit-frame-pointer -march=i686 -fasynchronous-unwind-tables -mtune=pentium4 -gdwarf-4 -fno-debug-types-section -fvar-tracking-assignments -g2   -c /tmp/B.029b0d9f-a53a-4212-94a5-415765a82dd1/BUILD/php-pecl-crack-0.4/libcrack/src/packlib.c -o libcrack/src/packlib.lo 
/bin/sh /tmp/B.029b0d9f-a53a-4212-94a5-415765a82dd1/BUILD/php-pecl-crack-0.4/libtool --mode=compile i686-pld-linux-gcc -I/tmp/B.029b0d9f-a53a-4212-94a5-415765a82dd1/BUILD/php-pecl-crack-0.4/libcrack/include -I. -I/tmp/B.029b0d9f-a53a-4212-94a5-415765a82dd1/BUILD/php-pecl-crack-0.4 -DPHP_ATOM_INC -I/tmp/B.029b0d9f-a53a-4212-94a5-415765a82dd1/BUILD/php-pecl-crack-0.4/include -I/tmp/B.029b0d9f-a53a-4212-94a5-415765a82dd1/BUILD/php-pecl-crack-0.4/main -I/tmp/B.029b0d9f-a53a-4212-94a5-415765a82dd1/BUILD/php-pecl-crack-0.4 -I/usr/include/php -I/usr/include/php/main -I/usr/include/php/TSRM -I/usr/include/php/Zend -I/usr/include/php/ext -I/usr/include/php/ext/date/lib  -DHAVE_CONFIG_H  -O2 -fwrapv -pipe -Wformat -Werror=format-security -gdwarf-4 -fno-debug-types-section -fvar-tracking-assignments -g2 -Wp,-D_FORTIFY_SOURCE=2 -fstack-protector --param=ssp-buffer-size=4 -fomit-frame-pointer -march=i686 -fasynchronous-unwind-tables -mtune=pentium4 -gdwarf-4 -fno-debug-types-section -fvar-tracking-assignments -g2   -c /tmp/B.029b0d9f-a53a-4212-94a5-415765a82dd1/BUILD/php-pecl-crack-0.4/libcrack/src/rules.c -o libcrack/src/rules.lo 
libtool: compile:  i686-pld-linux-gcc -I/tmp/B.029b0d9f-a53a-4212-94a5-415765a82dd1/BUILD/php-pecl-crack-0.4/libcrack/include -I. -I/tmp/B.029b0d9f-a53a-4212-94a5-415765a82dd1/BUILD/php-pecl-crack-0.4 -DPHP_ATOM_INC -I/tmp/B.029b0d9f-a53a-4212-94a5-415765a82dd1/BUILD/php-pecl-crack-0.4/include -I/tmp/B.029b0d9f-a53a-4212-94a5-415765a82dd1/BUILD/php-pecl-crack-0.4/main -I/tmp/B.029b0d9f-a53a-4212-94a5-415765a82dd1/BUILD/php-pecl-crack-0.4 -I/usr/include/php -I/usr/include/php/main -I/usr/include/php/TSRM -I/usr/include/php/Zend -I/usr/include/php/ext -I/usr/include/php/ext/date/lib -DHAVE_CONFIG_H -O2 -fwrapv -pipe -Wformat -Werror=format-security -gdwarf-4 -fno-debug-types-section -fvar-tracking-assignments -g2 -Wp,-D_FORTIFY_SOURCE=2 -fstack-protector --param=ssp-buffer-size=4 -fomit-frame-pointer -march=i686 -fasynchronous-unwind-tables -mtune=pentium4 -gdwarf-4 -fno-debug-types-section -fvar-tracking-assignments -g2 -c /tmp/B.029b0d9f-a53a-4212-94a5-415765a82dd1/BUILD/php-pecl-crack-0.4/crack.c  -fPIC -DPIC -o .libs/crack.o
libtool: compile:  i686-pld-linux-gcc -I/tmp/B.029b0d9f-a53a-4212-94a5-415765a82dd1/BUILD/php-pecl-crack-0.4/libcrack/include -I. -I/tmp/B.029b0d9f-a53a-4212-94a5-415765a82dd1/BUILD/php-pecl-crack-0.4 -DPHP_ATOM_INC -I/tmp/B.029b0d9f-a53a-4212-94a5-415765a82dd1/BUILD/php-pecl-crack-0.4/include -I/tmp/B.029b0d9f-a53a-4212-94a5-415765a82dd1/BUILD/php-pecl-crack-0.4/main -I/tmp/B.029b0d9f-a53a-4212-94a5-415765a82dd1/BUILD/php-pecl-crack-0.4 -I/usr/include/php -I/usr/include/php/main -I/usr/include/php/TSRM -I/usr/include/php/Zend -I/usr/include/php/ext -I/usr/include/php/ext/date/lib -DHAVE_CONFIG_H -O2 -fwrapv -pipe -Wformat -Werror=format-security -gdwarf-4 -fno-debug-types-section -fvar-tracking-assignments -g2 -Wp,-D_FORTIFY_SOURCE=2 -fstack-protector --param=ssp-buffer-size=4 -fomit-frame-pointer -march=i686 -fasynchronous-unwind-tables -mtune=pentium4 -gdwarf-4 -fno-debug-types-section -fvar-tracking-assignments -g2 -c /tmp/B.029b0d9f-a53a-4212-94a5-415765a82dd1/BUILD/php-pecl-crack-0.4/libcrack/src/packlib.c  -fPIC -DPIC -o libcrack/src/.libs/packlib.o
libtool: compile:  i686-pld-linux-gcc -I/tmp/B.029b0d9f-a53a-4212-94a5-415765a82dd1/BUILD/php-pecl-crack-0.4/libcrack/include -I. -I/tmp/B.029b0d9f-a53a-4212-94a5-415765a82dd1/BUILD/php-pecl-crack-0.4 -DPHP_ATOM_INC -I/tmp/B.029b0d9f-a53a-4212-94a5-415765a82dd1/BUILD/php-pecl-crack-0.4/include -I/tmp/B.029b0d9f-a53a-4212-94a5-415765a82dd1/BUILD/php-pecl-crack-0.4/main -I/tmp/B.029b0d9f-a53a-4212-94a5-415765a82dd1/BUILD/php-pecl-crack-0.4 -I/usr/include/php -I/usr/include/php/main -I/usr/include/php/TSRM -I/usr/include/php/Zend -I/usr/include/php/ext -I/usr/include/php/ext/date/lib -DHAVE_CONFIG_H -O2 -fwrapv -pipe -Wformat -Werror=format-security -gdwarf-4 -fno-debug-types-section -fvar-tracking-assignments -g2 -Wp,-D_FORTIFY_SOURCE=2 -fstack-protector --param=ssp-buffer-size=4 -fomit-frame-pointer -march=i686 -fasynchronous-unwind-tables -mtune=pentium4 -gdwarf-4 -fno-debug-types-section -fvar-tracking-assignments -g2 -c /tmp/B.029b0d9f-a53a-4212-94a5-415765a82dd1/BUILD/php-pecl-crack-0.4/libcrack/src/fascist.c  -fPIC -DPIC -o libcrack/src/.libs/fascist.o
libtool: compile:  i686-pld-linux-gcc -I/tmp/B.029b0d9f-a53a-4212-94a5-415765a82dd1/BUILD/php-pecl-crack-0.4/libcrack/include -I. -I/tmp/B.029b0d9f-a53a-4212-94a5-415765a82dd1/BUILD/php-pecl-crack-0.4 -DPHP_ATOM_INC -I/tmp/B.029b0d9f-a53a-4212-94a5-415765a82dd1/BUILD/php-pecl-crack-0.4/include -I/tmp/B.029b0d9f-a53a-4212-94a5-415765a82dd1/BUILD/php-pecl-crack-0.4/main -I/tmp/B.029b0d9f-a53a-4212-94a5-415765a82dd1/BUILD/php-pecl-crack-0.4 -I/usr/include/php -I/usr/include/php/main -I/usr/include/php/TSRM -I/usr/include/php/Zend -I/usr/include/php/ext -I/usr/include/php/ext/date/lib -DHAVE_CONFIG_H -O2 -fwrapv -pipe -Wformat -Werror=format-security -gdwarf-4 -fno-debug-types-section -fvar-tracking-assignments -g2 -Wp,-D_FORTIFY_SOURCE=2 -fstack-protector --param=ssp-buffer-size=4 -fomit-frame-pointer -march=i686 -fasynchronous-unwind-tables -mtune=pentium4 -gdwarf-4 -fno-debug-types-section -fvar-tracking-assignments -g2 -c /tmp/B.029b0d9f-a53a-4212-94a5-415765a82dd1/BUILD/php-pecl-crack-0.4/libcrack/src/rules.c  -fPIC -DPIC -o libcrack/src/.libs/rules.o
/tmp/B.029b0d9f-a53a-4212-94a5-415765a82dd1/BUILD/php-pecl-crack-0.4/crack.c:41:1: error: unknown type name 'function_entry'
 function_entry crack_functions[] = {
 ^
/tmp/B.029b0d9f-a53a-4212-94a5-415765a82dd1/BUILD/php-pecl-crack-0.4/crack.c:42:2: warning: braces around scalar initializer [enabled by default]
  PHP_FE(crack_opendict,   NULL)
  ^
/tmp/B.029b0d9f-a53a-4212-94a5-415765a82dd1/BUILD/php-pecl-crack-0.4/crack.c:42:2: warning: (near initialization for 'crack_functions[0]') [enabled by default]
/tmp/B.029b0d9f-a53a-4212-94a5-415765a82dd1/BUILD/php-pecl-crack-0.4/crack.c:42:2: warning: initialization makes integer from pointer without a cast [enabled by default]
/tmp/B.029b0d9f-a53a-4212-94a5-415765a82dd1/BUILD/php-pecl-crack-0.4/crack.c:42:2: warning: (near initialization for 'crack_functions[0]') [enabled by default]
/tmp/B.029b0d9f-a53a-4212-94a5-415765a82dd1/BUILD/php-pecl-crack-0.4/crack.c:42:2: warning: excess elements in scalar initializer [enabled by default]
/tmp/B.029b0d9f-a53a-4212-94a5-415765a82dd1/BUILD/php-pecl-crack-0.4/crack.c:42:2: warning: (near initialization for 'crack_functions[0]') [enabled by default]
/tmp/B.029b0d9f-a53a-4212-94a5-415765a82dd1/BUILD/php-pecl-crack-0.4/crack.c:42:2: warning: excess elements in scalar initializer [enabled by default]
/tmp/B.029b0d9f-a53a-4212-94a5-415765a82dd1/BUILD/php-pecl-crack-0.4/crack.c:42:2: warning: (near initialization for 'crack_functions[0]') [enabled by default]
In file included from /usr/include/php/main/php.h:38:0,
                 from /tmp/B.029b0d9f-a53a-4212-94a5-415765a82dd1/BUILD/php-pecl-crack-0.4/crack.c:25:
/usr/include/php/Zend/zend_API.h:71:129: warning: excess elements in scalar initializer [enabled by default]
 #define ZEND_FENTRY(zend_name, name, arg_info, flags) { #zend_name, name, arg_info, (zend_uint) (sizeof(arg_info)/sizeof(struct _zend_arg_info)-1), flags },
                                                                                                                                 ^
/usr/include/php/Zend/zend_API.h:77:38: note: in expansion of macro 'ZEND_FENTRY'
 #define ZEND_FE(name, arg_info)      ZEND_FENTRY(name, ZEND_FN(name), arg_info, 0)
                                      ^
/usr/include/php/main/php.h:349:18: note: in expansion of macro 'ZEND_FE'
 #define PHP_FE   ZEND_FE
                  ^
/tmp/B.029b0d9f-a53a-4212-94a5-415765a82dd1/BUILD/php-pecl-crack-0.4/crack.c:42:2: note: in expansion of macro 'PHP_FE'
  PHP_FE(crack_opendict,   NULL)
  ^
/usr/include/php/Zend/zend_API.h:71:129: warning: (near initialization for 'crack_functions[0]') [enabled by default]
 #define ZEND_FENTRY(zend_name, name, arg_info, flags) { #zend_name, name, arg_info, (zend_uint) (sizeof(arg_info)/sizeof(struct _zend_arg_info)-1), flags },
                                                                                                                                 ^
/usr/include/php/Zend/zend_API.h:77:38: note: in expansion of macro 'ZEND_FENTRY'
 #define ZEND_FE(name, arg_info)      ZEND_FENTRY(name, ZEND_FN(name), arg_info, 0)
                                      ^
/usr/include/php/main/php.h:349:18: note: in expansion of macro 'ZEND_FE'
 #define PHP_FE   ZEND_FE
                  ^
/tmp/B.029b0d9f-a53a-4212-94a5-415765a82dd1/BUILD/php-pecl-crack-0.4/crack.c:42:2: note: in expansion of macro 'PHP_FE'
  PHP_FE(crack_opendict,   NULL)
  ^
/usr/include/php/Zend/zend_API.h:71:129: warning: excess elements in scalar initializer [enabled by default]
 #define ZEND_FENTRY(zend_name, name, arg_info, flags) { #zend_name, name, arg_info, (zend_uint) (sizeof(arg_info)/sizeof(struct _zend_arg_info)-1), flags },
                                                                                                                                 ^
/usr/include/php/Zend/zend_API.h:77:38: note: in expansion of macro 'ZEND_FENTRY'
 #define ZEND_FE(name, arg_info)      ZEND_FENTRY(name, ZEND_FN(name), arg_info, 0)
                                      ^
/usr/include/php/main/php.h:349:18: note: in expansion of macro 'ZEND_FE'
 #define PHP_FE   ZEND_FE
                  ^
/tmp/B.029b0d9f-a53a-4212-94a5-415765a82dd1/BUILD/php-pecl-crack-0.4/crack.c:42:2: note: in expansion of macro 'PHP_FE'
  PHP_FE(crack_opendict,   NULL)
  ^
/usr/include/php/Zend/zend_API.h:71:129: warning: (near initialization for 'crack_functions[0]') [enabled by default]
 #define ZEND_FENTRY(zend_name, name, arg_info, flags) { #zend_name, name, arg_info, (zend_uint) (sizeof(arg_info)/sizeof(struct _zend_arg_info)-1), flags },
                                                                                                                                 ^
/usr/include/php/Zend/zend_API.h:77:38: note: in expansion of macro 'ZEND_FENTRY'
 #define ZEND_FE(name, arg_info)      ZEND_FENTRY(name, ZEND_FN(name), arg_info, 0)
                                      ^
/usr/include/php/main/php.h:349:18: note: in expansion of macro 'ZEND_FE'
 #define PHP_FE   ZEND_FE
                  ^
/tmp/B.029b0d9f-a53a-4212-94a5-415765a82dd1/BUILD/php-pecl-crack-0.4/crack.c:42:2: note: in expansion of macro 'PHP_FE'
  PHP_FE(crack_opendict,   NULL)
  ^
/tmp/B.029b0d9f-a53a-4212-94a5-415765a82dd1/BUILD/php-pecl-crack-0.4/crack.c:43:2: warning: braces around scalar initializer [enabled by default]
  PHP_FE(crack_closedict,   NULL)
  ^
/tmp/B.029b0d9f-a53a-4212-94a5-415765a82dd1/BUILD/php-pecl-crack-0.4/crack.c:43:2: warning: (near initialization for 'crack_functions[1]') [enabled by default]
/tmp/B.029b0d9f-a53a-4212-94a5-415765a82dd1/BUILD/php-pecl-crack-0.4/crack.c:43:2: warning: initialization makes integer from pointer without a cast [enabled by default]
/tmp/B.029b0d9f-a53a-4212-94a5-415765a82dd1/BUILD/php-pecl-crack-0.4/crack.c:43:2: warning: (near initialization for 'crack_functions[1]') [enabled by default]
/tmp/B.029b0d9f-a53a-4212-94a5-415765a82dd1/BUILD/php-pecl-crack-0.4/crack.c:43:2: warning: excess elements in scalar initializer [enabled by default]
/tmp/B.029b0d9f-a53a-4212-94a5-415765a82dd1/BUILD/php-pecl-crack-0.4/crack.c:43:2: warning: (near initialization for 'crack_functions[1]') [enabled by default]
/tmp/B.029b0d9f-a53a-4212-94a5-415765a82dd1/BUILD/php-pecl-crack-0.4/crack.c:43:2: warning: excess elements in scalar initializer [enabled by default]
/tmp/B.029b0d9f-a53a-4212-94a5-415765a82dd1/BUILD/php-pecl-crack-0.4/crack.c:43:2: warning: (near initialization for 'crack_functions[1]') [enabled by default]
In file included from /usr/include/php/main/php.h:38:0,
                 from /tmp/B.029b0d9f-a53a-4212-94a5-415765a82dd1/BUILD/php-pecl-crack-0.4/crack.c:25:
/usr/include/php/Zend/zend_API.h:71:129: warning: excess elements in scalar initializer [enabled by default]
 #define ZEND_FENTRY(zend_name, name, arg_info, flags) { #zend_name, name, arg_info, (zend_uint) (sizeof(arg_info)/sizeof(struct _zend_arg_info)-1), flags },
                                                                                                                                 ^
/usr/include/php/Zend/zend_API.h:77:38: note: in expansion of macro 'ZEND_FENTRY'
 #define ZEND_FE(name, arg_info)      ZEND_FENTRY(name, ZEND_FN(name), arg_info, 0)
                                      ^
/usr/include/php/main/php.h:349:18: note: in expansion of macro 'ZEND_FE'
 #define PHP_FE   ZEND_FE
                  ^
/tmp/B.029b0d9f-a53a-4212-94a5-415765a82dd1/BUILD/php-pecl-crack-0.4/crack.c:43:2: note: in expansion of macro 'PHP_FE'
  PHP_FE(crack_closedict,   NULL)
  ^
/usr/include/php/Zend/zend_API.h:71:129: warning: (near initialization for 'crack_functions[1]') [enabled by default]
 #define ZEND_FENTRY(zend_name, name, arg_info, flags) { #zend_name, name, arg_info, (zend_uint) (sizeof(arg_info)/sizeof(struct _zend_arg_info)-1), flags },
                                                                                                                                 ^
/usr/include/php/Zend/zend_API.h:77:38: note: in expansion of macro 'ZEND_FENTRY'
 #define ZEND_FE(name, arg_info)      ZEND_FENTRY(name, ZEND_FN(name), arg_info, 0)
                                      ^
/usr/include/php/main/php.h:349:18: note: in expansion of macro 'ZEND_FE'
 #define PHP_FE   ZEND_FE
                  ^
/tmp/B.029b0d9f-a53a-4212-94a5-415765a82dd1/BUILD/php-pecl-crack-0.4/crack.c:43:2: note: in expansion of macro 'PHP_FE'
  PHP_FE(crack_closedict,   NULL)
  ^
/usr/include/php/Zend/zend_API.h:71:129: warning: excess elements in scalar initializer [enabled by default]
 #define ZEND_FENTRY(zend_name, name, arg_info, flags) { #zend_name, name, arg_info, (zend_uint) (sizeof(arg_info)/sizeof(struct _zend_arg_info)-1), flags },
                                                                                                                                 ^
/usr/include/php/Zend/zend_API.h:77:38: note: in expansion of macro 'ZEND_FENTRY'
 #define ZEND_FE(name, arg_info)      ZEND_FENTRY(name, ZEND_FN(name), arg_info, 0)
                                      ^
/usr/include/php/main/php.h:349:18: note: in expansion of macro 'ZEND_FE'
 #define PHP_FE   ZEND_FE
                  ^
/tmp/B.029b0d9f-a53a-4212-94a5-415765a82dd1/BUILD/php-pecl-crack-0.4/crack.c:43:2: note: in expansion of macro 'PHP_FE'
  PHP_FE(crack_closedict,   NULL)
  ^
/usr/include/php/Zend/zend_API.h:71:129: warning: (near initialization for 'crack_functions[1]') [enabled by default]
 #define ZEND_FENTRY(zend_name, name, arg_info, flags) { #zend_name, name, arg_info, (zend_uint) (sizeof(arg_info)/sizeof(struct _zend_arg_info)-1), flags },
                                                                                                                                 ^
/usr/include/php/Zend/zend_API.h:77:38: note: in expansion of macro 'ZEND_FENTRY'
 #define ZEND_FE(name, arg_info)      ZEND_FENTRY(name, ZEND_FN(name), arg_info, 0)
                                      ^
/usr/include/php/main/php.h:349:18: note: in expansion of macro 'ZEND_FE'
 #define PHP_FE   ZEND_FE
                  ^
/tmp/B.029b0d9f-a53a-4212-94a5-415765a82dd1/BUILD/php-pecl-crack-0.4/crack.c:43:2: note: in expansion of macro 'PHP_FE'
  PHP_FE(crack_closedict,   NULL)
  ^
/tmp/B.029b0d9f-a53a-4212-94a5-415765a82dd1/BUILD/php-pecl-crack-0.4/crack.c:44:2: warning: braces around scalar initializer [enabled by default]
  PHP_FE(crack_check,    NULL)
  ^
/tmp/B.029b0d9f-a53a-4212-94a5-415765a82dd1/BUILD/php-pecl-crack-0.4/crack.c:44:2: warning: (near initialization for 'crack_functions[2]') [enabled by default]
/tmp/B.029b0d9f-a53a-4212-94a5-415765a82dd1/BUILD/php-pecl-crack-0.4/crack.c:44:2: warning: initialization makes integer from pointer without a cast [enabled by default]
/tmp/B.029b0d9f-a53a-4212-94a5-415765a82dd1/BUILD/php-pecl-crack-0.4/crack.c:44:2: warning: (near initialization for 'crack_functions[2]') [enabled by default]
/tmp/B.029b0d9f-a53a-4212-94a5-415765a82dd1/BUILD/php-pecl-crack-0.4/crack.c:44:2: warning: excess elements in scalar initializer [enabled by default]
/tmp/B.029b0d9f-a53a-4212-94a5-415765a82dd1/BUILD/php-pecl-crack-0.4/crack.c:44:2: warning: (near initialization for 'crack_functions[2]') [enabled by default]
/tmp/B.029b0d9f-a53a-4212-94a5-415765a82dd1/BUILD/php-pecl-crack-0.4/crack.c:44:2: warning: excess elements in scalar initializer [enabled by default]
/tmp/B.029b0d9f-a53a-4212-94a5-415765a82dd1/BUILD/php-pecl-crack-0.4/crack.c:44:2: warning: (near initialization for 'crack_functions[2]') [enabled by default]
In file included from /usr/include/php/main/php.h:38:0,
                 from /tmp/B.029b0d9f-a53a-4212-94a5-415765a82dd1/BUILD/php-pecl-crack-0.4/crack.c:25:
/usr/include/php/Zend/zend_API.h:71:129: warning: excess elements in scalar initializer [enabled by default]
 #define ZEND_FENTRY(zend_name, name, arg_info, flags) { #zend_name, name, arg_info, (zend_uint) (sizeof(arg_info)/sizeof(struct _zend_arg_info)-1), flags },
                                                                                                                                 ^
/usr/include/php/Zend/zend_API.h:77:38: note: in expansion of macro 'ZEND_FENTRY'
 #define ZEND_FE(name, arg_info)      ZEND_FENTRY(name, ZEND_FN(name), arg_info, 0)
                                      ^
/usr/include/php/main/php.h:349:18: note: in expansion of macro 'ZEND_FE'
 #define PHP_FE   ZEND_FE
                  ^
/tmp/B.029b0d9f-a53a-4212-94a5-415765a82dd1/BUILD/php-pecl-crack-0.4/crack.c:44:2: note: in expansion of macro 'PHP_FE'
  PHP_FE(crack_check,    NULL)
  ^
/usr/include/php/Zend/zend_API.h:71:129: warning: (near initialization for 'crack_functions[2]') [enabled by default]
 #define ZEND_FENTRY(zend_name, name, arg_info, flags) { #zend_name, name, arg_info, (zend_uint) (sizeof(arg_info)/sizeof(struct _zend_arg_info)-1), flags },
                                                                                                                                 ^
/usr/include/php/Zend/zend_API.h:77:38: note: in expansion of macro 'ZEND_FENTRY'
 #define ZEND_FE(name, arg_info)      ZEND_FENTRY(name, ZEND_FN(name), arg_info, 0)
                                      ^
/usr/include/php/main/php.h:349:18: note: in expansion of macro 'ZEND_FE'
 #define PHP_FE   ZEND_FE
                  ^
/tmp/B.029b0d9f-a53a-4212-94a5-415765a82dd1/BUILD/php-pecl-crack-0.4/crack.c:44:2: note: in expansion of macro 'PHP_FE'
  PHP_FE(crack_check,    NULL)
  ^
/usr/include/php/Zend/zend_API.h:71:129: warning: excess elements in scalar initializer [enabled by default]
 #define ZEND_FENTRY(zend_name, name, arg_info, flags) { #zend_name, name, arg_info, (zend_uint) (sizeof(arg_info)/sizeof(struct _zend_arg_info)-1), flags },
                                                                                                                                 ^
/usr/include/php/Zend/zend_API.h:77:38: note: in expansion of macro 'ZEND_FENTRY'
 #define ZEND_FE(name, arg_info)      ZEND_FENTRY(name, ZEND_FN(name), arg_info, 0)
                                      ^
/usr/include/php/main/php.h:349:18: note: in expansion of macro 'ZEND_FE'
 #define PHP_FE   ZEND_FE
                  ^
/tmp/B.029b0d9f-a53a-4212-94a5-415765a82dd1/BUILD/php-pecl-crack-0.4/crack.c:44:2: note: in expansion of macro 'PHP_FE'
  PHP_FE(crack_check,    NULL)
  ^
/usr/include/php/Zend/zend_API.h:71:129: warning: (near initialization for 'crack_functions[2]') [enabled by default]
 #define ZEND_FENTRY(zend_name, name, arg_info, flags) { #zend_name, name, arg_info, (zend_uint) (sizeof(arg_info)/sizeof(struct _zend_arg_info)-1), flags },
                                                                                                                                 ^
/usr/include/php/Zend/zend_API.h:77:38: note: in expansion of macro 'ZEND_FENTRY'
 #define ZEND_FE(name, arg_info)      ZEND_FENTRY(name, ZEND_FN(name), arg_info, 0)
                                      ^
/usr/include/php/main/php.h:349:18: note: in expansion of macro 'ZEND_FE'
 #define PHP_FE   ZEND_FE
                  ^
/tmp/B.029b0d9f-a53a-4212-94a5-415765a82dd1/BUILD/php-pecl-crack-0.4/crack.c:44:2: note: in expansion of macro 'PHP_FE'
  PHP_FE(crack_check,    NULL)
  ^
/tmp/B.029b0d9f-a53a-4212-94a5-415765a82dd1/BUILD/php-pecl-crack-0.4/crack.c:45:2: warning: braces around scalar initializer [enabled by default]
  PHP_FE(crack_getlastmessage, NULL)
  ^
/tmp/B.029b0d9f-a53a-4212-94a5-415765a82dd1/BUILD/php-pecl-crack-0.4/crack.c:45:2: warning: (near initialization for 'crack_functions[3]') [enabled by default]
/tmp/B.029b0d9f-a53a-4212-94a5-415765a82dd1/BUILD/php-pecl-crack-0.4/crack.c:45:2: warning: initialization makes integer from pointer without a cast [enabled by default]
/tmp/B.029b0d9f-a53a-4212-94a5-415765a82dd1/BUILD/php-pecl-crack-0.4/crack.c:45:2: warning: (near initialization for 'crack_functions[3]') [enabled by default]
/tmp/B.029b0d9f-a53a-4212-94a5-415765a82dd1/BUILD/php-pecl-crack-0.4/crack.c:45:2: warning: excess elements in scalar initializer [enabled by default]
/tmp/B.029b0d9f-a53a-4212-94a5-415765a82dd1/BUILD/php-pecl-crack-0.4/crack.c:45:2: warning: (near initialization for 'crack_functions[3]') [enabled by default]
/tmp/B.029b0d9f-a53a-4212-94a5-415765a82dd1/BUILD/php-pecl-crack-0.4/crack.c:45:2: warning: excess elements in scalar initializer [enabled by default]
/tmp/B.029b0d9f-a53a-4212-94a5-415765a82dd1/BUILD/php-pecl-crack-0.4/crack.c:45:2: warning: (near initialization for 'crack_functions[3]') [enabled by default]
In file included from /usr/include/php/main/php.h:38:0,
                 from /tmp/B.029b0d9f-a53a-4212-94a5-415765a82dd1/BUILD/php-pecl-crack-0.4/crack.c:25:
/usr/include/php/Zend/zend_API.h:71:129: warning: excess elements in scalar initializer [enabled by default]
 #define ZEND_FENTRY(zend_name, name, arg_info, flags) { #zend_name, name, arg_info, (zend_uint) (sizeof(arg_info)/sizeof(struct _zend_arg_info)-1), flags },
                                                                                                                                 ^
/usr/include/php/Zend/zend_API.h:77:38: note: in expansion of macro 'ZEND_FENTRY'
 #define ZEND_FE(name, arg_info)      ZEND_FENTRY(name, ZEND_FN(name), arg_info, 0)
                                      ^
/usr/include/php/main/php.h:349:18: note: in expansion of macro 'ZEND_FE'
 #define PHP_FE   ZEND_FE
                  ^
/tmp/B.029b0d9f-a53a-4212-94a5-415765a82dd1/BUILD/php-pecl-crack-0.4/crack.c:45:2: note: in expansion of macro 'PHP_FE'
  PHP_FE(crack_getlastmessage, NULL)
  ^
/usr/include/php/Zend/zend_API.h:71:129: warning: (near initialization for 'crack_functions[3]') [enabled by default]
 #define ZEND_FENTRY(zend_name, name, arg_info, flags) { #zend_name, name, arg_info, (zend_uint) (sizeof(arg_info)/sizeof(struct _zend_arg_info)-1), flags },
                                                                                                                                 ^
/usr/include/php/Zend/zend_API.h:77:38: note: in expansion of macro 'ZEND_FENTRY'
 #define ZEND_FE(name, arg_info)      ZEND_FENTRY(name, ZEND_FN(name), arg_info, 0)
                                      ^
/usr/include/php/main/php.h:349:18: note: in expansion of macro 'ZEND_FE'
 #define PHP_FE   ZEND_FE
                  ^
/tmp/B.029b0d9f-a53a-4212-94a5-415765a82dd1/BUILD/php-pecl-crack-0.4/crack.c:45:2: note: in expansion of macro 'PHP_FE'
  PHP_FE(crack_getlastmessage, NULL)
  ^
/usr/include/php/Zend/zend_API.h:71:129: warning: excess elements in scalar initializer [enabled by default]
 #define ZEND_FENTRY(zend_name, name, arg_info, flags) { #zend_name, name, arg_info, (zend_uint) (sizeof(arg_info)/sizeof(struct _zend_arg_info)-1), flags },
                                                                                                                                 ^
/usr/include/php/Zend/zend_API.h:77:38: note: in expansion of macro 'ZEND_FENTRY'
 #define ZEND_FE(name, arg_info)      ZEND_FENTRY(name, ZEND_FN(name), arg_info, 0)
                                      ^
/usr/include/php/main/php.h:349:18: note: in expansion of macro 'ZEND_FE'
 #define PHP_FE   ZEND_FE
                  ^
/tmp/B.029b0d9f-a53a-4212-94a5-415765a82dd1/BUILD/php-pecl-crack-0.4/crack.c:45:2: note: in expansion of macro 'PHP_FE'
  PHP_FE(crack_getlastmessage, NULL)
  ^
/usr/include/php/Zend/zend_API.h:71:129: warning: (near initialization for 'crack_functions[3]') [enabled by default]
 #define ZEND_FENTRY(zend_name, name, arg_info, flags) { #zend_name, name, arg_info, (zend_uint) (sizeof(arg_info)/sizeof(struct _zend_arg_info)-1), flags },
                                                                                                                                 ^
/usr/include/php/Zend/zend_API.h:77:38: note: in expansion of macro 'ZEND_FENTRY'
 #define ZEND_FE(name, arg_info)      ZEND_FENTRY(name, ZEND_FN(name), arg_info, 0)
                                      ^
/usr/include/php/main/php.h:349:18: note: in expansion of macro 'ZEND_FE'
 #define PHP_FE   ZEND_FE
                  ^
/tmp/B.029b0d9f-a53a-4212-94a5-415765a82dd1/BUILD/php-pecl-crack-0.4/crack.c:45:2: note: in expansion of macro 'PHP_FE'
  PHP_FE(crack_getlastmessage, NULL)
  ^
/tmp/B.029b0d9f-a53a-4212-94a5-415765a82dd1/BUILD/php-pecl-crack-0.4/crack.c:46:2: warning: braces around scalar initializer [enabled by default]
  {NULL, NULL, NULL}
  ^
/tmp/B.029b0d9f-a53a-4212-94a5-415765a82dd1/BUILD/php-pecl-crack-0.4/crack.c:46:2: warning: (near initialization for 'crack_functions[4]') [enabled by default]
/tmp/B.029b0d9f-a53a-4212-94a5-415765a82dd1/BUILD/php-pecl-crack-0.4/crack.c:46:2: warning: initialization makes integer from pointer without a cast [enabled by default]
/tmp/B.029b0d9f-a53a-4212-94a5-415765a82dd1/BUILD/php-pecl-crack-0.4/crack.c:46:2: warning: (near initialization for 'crack_functions[4]') [enabled by default]
/tmp/B.029b0d9f-a53a-4212-94a5-415765a82dd1/BUILD/php-pecl-crack-0.4/crack.c:46:2: warning: excess elements in scalar initializer [enabled by default]
/tmp/B.029b0d9f-a53a-4212-94a5-415765a82dd1/BUILD/php-pecl-crack-0.4/crack.c:46:2: warning: (near initialization for 'crack_functions[4]') [enabled by default]
/tmp/B.029b0d9f-a53a-4212-94a5-415765a82dd1/BUILD/php-pecl-crack-0.4/crack.c:46:2: warning: excess elements in scalar initializer [enabled by default]
/tmp/B.029b0d9f-a53a-4212-94a5-415765a82dd1/BUILD/php-pecl-crack-0.4/crack.c:46:2: warning: (near initialization for 'crack_functions[4]') [enabled by default]
/tmp/B.029b0d9f-a53a-4212-94a5-415765a82dd1/BUILD/php-pecl-crack-0.4/crack.c:57:2: warning: initialization from incompatible pointer type [enabled by default]
  crack_functions,
  ^
/tmp/B.029b0d9f-a53a-4212-94a5-415765a82dd1/BUILD/php-pecl-crack-0.4/crack.c:57:2: warning: (near initialization for 'crack_module_entry.functions') [enabled by default]
In file included from /usr/include/php/main/fopen_wrappers.h:25:0,
                 from /usr/include/php/main/php.h:397,
                 from /tmp/B.029b0d9f-a53a-4212-94a5-415765a82dd1/BUILD/php-pecl-crack-0.4/crack.c:25:
/tmp/B.029b0d9f-a53a-4212-94a5-415765a82dd1/BUILD/php-pecl-crack-0.4/crack.c: In function 'php_crack_checkpath':
/usr/include/php/main/php_globals.h:32:29: error: 'struct _php_core_globals' has no member named 'safe_mode'
 # define PG(v) (core_globals.v)
                             ^
/tmp/B.029b0d9f-a53a-4212-94a5-415765a82dd1/BUILD/php-pecl-crack-0.4/crack.c:99:6: note: in expansion of macro 'PG'
  if (PG(safe_mode)) {
      ^
/tmp/B.029b0d9f-a53a-4212-94a5-415765a82dd1/BUILD/php-pecl-crack-0.4/crack.c:109:36: error: 'CHECKUID_CHECK_FILE_AND_DIR' undeclared (first use in this function)
   if (!php_checkuid(filename, "r", CHECKUID_CHECK_FILE_AND_DIR)) {
                                    ^
/tmp/B.029b0d9f-a53a-4212-94a5-415765a82dd1/BUILD/php-pecl-crack-0.4/crack.c:109:36: note: each undeclared identifier is reported only once for each function it appears in
Makefile:201: recipe for target 'crack.lo' failed
make: *** [crack.lo] Error 1
make: *** Waiting for unfinished jobs....
error: Bad exit status from /tmp/B.029b0d9f-a53a-4212-94a5-415765a82dd1/BUILD/tmp/rpm-tmp.40146 (%build)


RPM build errors:
    Bad exit status from /tmp/B.029b0d9f-a53a-4212-94a5-415765a82dd1/BUILD/tmp/rpm-tmp.40146 (%build)
ended at: Mon Apr 28 14:14:05 2014, done in 0:00:07.136224
error: No files produced.
+ chmod -R u+rwX /tmp/B.029b0d9f-a53a-4212-94a5-415765a82dd1/BUILD
+ rm -rf /tmp/B.029b0d9f-a53a-4212-94a5-415765a82dd1/tmp /tmp/B.029b0d9f-a53a-4212-94a5-415765a82dd1/BUILD
+ rm -rf /tmp/B.029b0d9f-a53a-4212-94a5-415765a82dd1
Begin-PLD-Builder-Info
Build-Time: user:11.72s sys:0.62s real:17.06s (faults io:0 non-io:751278)

End-PLD-Builder-Info
[Back to list of logs] [View rpm -qa of builder]