FailedOk

th/SRPMS[OK]
th/x32[OK]
th/i686[OK]
th/x86_64[OK]

ac/SRPMS[OK]
ac/i386[OK]
ac/i586[OK]
ac/i686[OK]
ac/alpha[OK]
ac/amd64[OK]
ac/athlon[OK]
ac/ppc[OK]
ac/sparc[OK]
ac/sparc64[OK]

Advanced Search
main()
Powered by PLD Linux
(c) 2002-2018 PLD Team
$Revision: 1.37 $
Powered by vim.
Your IP: 54.234.0.2

php-pecl-libsodium 74aa649a-e0e1-46f6-8859-81054bbb6877

Status:Failed
Source URL:ftp://buildlogs.pld-linux.org/th/i686/FAIL/php-pecl-libsodium,74aa649a-e0e1-46f6-8859-81054bbb6877.bz2
text/plain URL:View!
full text:View!
rpm -qa of builder:View!
Date:2017/12/27 00:20:28
Runtime:0:00:05.353276

Toc:

  • error 1
  • rpm: error: Failed build dependencies:
  • error 2
  • rpm: error: Failed build dependencies:
  • prep
  • Executing(%prep): /bin/sh -e /tmp/B.dmv_Wh/BUILD/tmp/rpm-tmp.31162
  • build
  • Executing(%build): /bin/sh -e /tmp/B.dmv_Wh/BUILD/tmp/rpm-tmp.31162
  • error 3
  • error: Bad exit status from /tmp/B.dmv_Wh/BUILD/tmp/rpm-tmp.31162 (%build)
  • error 4
  • RPM build errors:
  • error 5
  • error: No files produced.

Content:

checking if we should skip the build
started at: Wed Dec 27 00:19:59 2017
fetching https://srcbuilder.pld-linux.org/th//srpms/74aa649a-e0e1-46f6-8859-81054bbb6877/php71-pecl-libsodium-1.0.7-1.src.rpm
fetched 182478 bytes, 218.1 K/s
installing srpm: php71-pecl-libsodium-1.0.7-1.src.rpm
+ install -d /tmp/B.dmv_Wh/BUILD /tmp/B.dmv_Wh/RPMS
+ LC_ALL=en_US.UTF-8
+ rpm -qp --changelog php71-pecl-libsodium-1.0.7-1.src.rpm
* Tue Dec 26 2017 PLD Linux Team <feedback@pld-linux.org>
- For complete changelog see: http://git.pld-linux.org/?p=packages/php-pecl-libsodium.git;a=log;h=auto/th/php-pecl-libsodium-1.0.7-1
* Tue Dec 26 2017 Jakub Bogusz <qboosh@pld-linux.org> abeee5f
- updated to 1.0.7, pl + rpm -Uhv --nodeps --define '_topdir /tmp/B.dmv_Wh' --define '_specdir %{_topdir}' --define '_sourcedir %{_specdir}' --define '_rpmdir %{_topdir}/RPMS' --define '_builddir %{_topdir}/BUILD' --define 'php_suffix 71' php71-pecl-libsodium-1.0.7-1.src.rpm Preparing... ################################################## php71-pecl-libsodium ################################################## + rm -f php71-pecl-libsodium-1.0.7-1.src.rpm + install -m 700 -d /tmp/B.dmv_Wh/BUILD/tmp + TMPDIR=/tmp/B.dmv_Wh/BUILD/tmp + exec nice -n 0 rpmbuild -bp --short-circuit --nodeps --define '_topdir /tmp/B.dmv_Wh' --define '_specdir %{_topdir}' --define '_sourcedir %{_specdir}' --define '_rpmdir %{_topdir}/RPMS' --define '_builddir %{_topdir}/BUILD' --target i686-pld-linux --define 'php_suffix 71' --define 'prep exit 0' /tmp/B.dmv_Wh/php-pecl-libsodium.spec sh: php-config: not found Building target platforms: i686-pld-linux checking BuildConflict-ing packages no BuildConflicts found checking BR rpm: sh: php-config: not found rpm: error: Failed build dependencies: rpm: php71-devel >= 4:5.3 is needed by php71-pecl-libsodium-1.0.7-1.src rpm: php71-cli is needed by php71-pecl-libsodium-1.0.7-1.src rpm: php71-json is needed by php71-pecl-libsodium-1.0.7-1.src rpm: Building target platforms: i686-pld-linux updating poldek cache... ready is up to date Retrieving th::packages.ndir.md... th is up to date Retrieving th::packages.ndir.md... th is up to date Retrieving th-ready::packages.ndir.md... th-ready is up to date Retrieving th-ready::packages.ndir.md... th-ready is up to date Retrieving th-test::packages.ndir.md... th-test is up to date Retrieving th-test::packages.ndir.md... th-test is up to date checking conflicting packages in BRed packages poldek: Loading [pndir]ready... poldek: Loading [pndir]th-test... poldek: Loading [pndir]th-test... poldek: Loading [pndir]th-ready... poldek: Loading [pndir]th-ready... poldek: Loading [pndir]th... poldek: Loading [pndir]th... poldek: 30978 packages read poldek: Removed 4284 duplicate packages from available set poldek: Processing dependencies... poldek: php71-cli-7.1.12-3.i686 marks php71-common-7.1.12-3.i686 (cap /etc/php71) poldek: There are 4 packages to install (1 marked by dependencies): poldek: I php71-cli-7.1.12-3.i686 php71-devel-7.1.12-3.i686 poldek: I php71-json-7.1.12-3.i686 poldek: D php71-common-7.1.12-3.i686 poldek: This operation will use 7.9MB of disk space. poldek: Need to get 1.6MB of archives (1.6MB to download). poldek: poldek: Retrieving [1/4] th-test::php71-common-7.1.12-3.i686.rpm... poldek: ..............................done poldek: Retrieving [2/4] th-test::php71-cli-7.1.12-3.i686.rpm... poldek: ..............................done poldek: Retrieving [3/4] th-test::php71-devel-7.1.12-3.i686.rpm... poldek: ..............................done poldek: Retrieving [4/4] th-test::php71-json-7.1.12-3.i686.rpm... poldek: ..............................done poldek: Executing pm-command.sh --upgrade -vh --test --root / --define _check_dirname_deps 1... poldek: Preparing... ################################################## no conflicts found checking BR rpm: sh: php-config: not found rpm: error: Failed build dependencies: rpm: php71-devel >= 4:5.3 is needed by php71-pecl-libsodium-1.0.7-1.src rpm: php71-cli is needed by php71-pecl-libsodium-1.0.7-1.src rpm: php71-json is needed by php71-pecl-libsodium-1.0.7-1.src rpm: Building target platforms: i686-pld-linux installing BR: php71\-json php71\-devel php71\-cli + poldek --noask --caplookup -Q -v '--ignore=hhvm-*' '--ignore=php4-*' '--ignore=php52-*' '--ignore=php53-*' '--ignore=php54-*' '--ignore=php55-*' '--ignore=php56-*' '--ignore=php70-*' --upgrade php71-json php71-devel php71-cli Loading [pndir]ready... Loading [pndir]th-test... Loading [pndir]th-test... Loading [pndir]th-ready... Loading [pndir]th-ready... Loading [pndir]th... Loading [pndir]th... 30978 packages read Removed 4284 duplicate packages from available set Processing dependencies... php71-cli-7.1.12-3.i686 marks php71-common-7.1.12-3.i686 (cap /etc/php71) There are 4 packages to install (1 marked by dependencies): I php71-cli-7.1.12-3.i686 php71-devel-7.1.12-3.i686 I php71-json-7.1.12-3.i686 D php71-common-7.1.12-3.i686 This operation will use 7.9MB of disk space. Need to get 1.6MB of archives. Executing pm-command.sh --upgrade -vh --root / --define _check_dirname_deps 1... Preparing... ################################################## php71-common ################################################## php71-cli ################################################## php71-devel ################################################## php71-json ################################################## building RPM using: set -ex; : build-id: 74aa649a-e0e1-46f6-8859-81054bbb6877; TMPDIR=/tmp/B.dmv_Wh/BUILD/tmp exec nice -n 0 rpmbuild -bb --define '_smp_mflags -j9' --define '_make_opts -Otarget' --define '_pld_builder 1' --define '_topdir /tmp/B.dmv_Wh' --define '_specdir %{_topdir}' --define '_sourcedir %{_specdir}' --define '_rpmdir %{_topdir}/RPMS' --define '_builddir %{_topdir}/BUILD' --target i686-pld-linux --define 'php_suffix 71' /tmp/B.dmv_Wh/php-pecl-libsodium.spec + : build-id: 74aa649a-e0e1-46f6-8859-81054bbb6877 + TMPDIR=/tmp/B.dmv_Wh/BUILD/tmp + exec nice -n 0 rpmbuild -bb --define '_smp_mflags -j9' --define '_make_opts -Otarget' --define '_pld_builder 1' --define '_topdir /tmp/B.dmv_Wh' --define '_specdir %{_topdir}' --define '_sourcedir %{_specdir}' --define '_rpmdir %{_topdir}/RPMS' --define '_builddir %{_topdir}/BUILD' --target i686-pld-linux --define 'php_suffix 71' /tmp/B.dmv_Wh/php-pecl-libsodium.spec Building target platforms: i686-pld-linux Executing(%prep): /bin/sh -e /tmp/B.dmv_Wh/BUILD/tmp/rpm-tmp.31162 + umask 022 + cd /tmp/B.dmv_Wh/BUILD + cd /tmp/B.dmv_Wh/BUILD + rm -rf php71-pecl-libsodium-1.0.7 + /bin/mkdir -p php71-pecl-libsodium-1.0.7 + cd php71-pecl-libsodium-1.0.7 + /usr/bin/gzip -dc /tmp/B.dmv_Wh/libsodium-1.0.7.tgz + /bin/tar -xf - + STATUS=0 + '[' 0 -ne 0 ']' + /bin/id -u + '[' 1001 '=' 0 ']' + /bin/id -u + '[' 1001 '=' 0 ']' + /bin/chmod -Rf a+rX,u+w,g-w,o-w . + /bin/mv libsodium-1.0.7/LICENSE libsodium-1.0.7/README.md libsodium-1.0.7/acinclude.m4 libsodium-1.0.7/aclocal.m4 libsodium-1.0.7/build libsodium-1.0.7/compat.h libsodium-1.0.7/config.h libsodium-1.0.7/config.m4 libsodium-1.0.7/config.w32 libsodium-1.0.7/libsodium.c libsodium-1.0.7/php_libsodium.h libsodium-1.0.7/tests . + exit 0 Executing(%build): /bin/sh -e /tmp/B.dmv_Wh/BUILD/tmp/rpm-tmp.31162 TMP=/home/users/builder/tmp HOME=/home/users/builder PATH=/home/users/builder/GNUstep/Tools:/usr/local/bin:/usr/bin:/bin:/home/users/builder/bin TMPDIR=/tmp/B.dmv_Wh/BUILD/tmp + umask 022 + cd /tmp/B.dmv_Wh/BUILD + cd php71-pecl-libsodium-1.0.7 + sed -n '/#define PHP_LIBSODIUM_VERSION/{s/.* "//;s/".*$//;p}' php_libsodium.h + extver=1.0.7 + test x1.0.7 '!=' x1.0.7 + phpize Configuring for: PHP Api Version: 20160303 Zend Module Api No: 20160303 Zend Extension Api No: 320160303 + ./configure 'LDFLAGS=-Wl,--as-needed -Wl,--no-copy-dt-needed-entries -Wl,-z,relro -Wl,-z,combreloc ' 'CFLAGS=-O2 -fwrapv -pipe -Wformat -Werror=format-security -gdwarf-4 -fno-debug-types-section -fvar-tracking-assignments -g2 -Wp,-D_FORTIFY_SOURCE=2 -fstack-protector-strong --param=ssp-buffer-size=4 -fomit-frame-pointer -march=i686 -fasynchronous-unwind-tables -mtune=pentium4 -gdwarf-4 -fno-debug-types-section -fvar-tracking-assignments -g2 ' 'CXXFLAGS=-O2 -fwrapv -pipe -Wformat -Werror=format-security -gdwarf-4 -fno-debug-types-section -fvar-tracking-assignments -g2 -Wp,-D_FORTIFY_SOURCE=2 -fstack-protector-strong --param=ssp-buffer-size=4 -fomit-frame-pointer -march=i686 -fasynchronous-unwind-tables -mtune=pentium4 -gdwarf-4 -fno-debug-types-section -fvar-tracking-assignments -g2 ' 'FFLAGS=-O2 -fwrapv -pipe -Wformat -Werror=format-security -gdwarf-4 -fno-debug-types-section -fvar-tracking-assignments -g2 -Wp,-D_FORTIFY_SOURCE=2 -fstack-protector-strong --param=ssp-buffer-size=4 -fomit-frame-pointer -march=i686 -fasynchronous-unwind-tables -mtune=pentium4 -gdwarf-4 -fno-debug-types-section -fvar-tracking-assignments -g2 ' 'FCFLAGS=-O2 -fwrapv -pipe -Wformat -Werror=format-security -gdwarf-4 -fno-debug-types-section -fvar-tracking-assignments -g2 -Wp,-D_FORTIFY_SOURCE=2 -fstack-protector-strong --param=ssp-buffer-size=4 -fomit-frame-pointer -march=i686 -fasynchronous-unwind-tables -mtune=pentium4 -gdwarf-4 -fno-debug-types-section -fvar-tracking-assignments -g2 ' 'CPPFLAGS=' 'CC=i686-pld-linux-gcc' 'CXX=i686-pld-linux-g++' '--host=i686-pld-linux' '--build=i686-pld-linux' '--prefix=/usr' '--exec-prefix=/usr' '--bindir=/usr/bin' '--sbindir=/usr/sbin' '--sysconfdir=/etc' '--datadir=/usr/share' '--includedir=/usr/include' '--libdir=/usr/lib' '--libexecdir=/usr/libexec' '--localstatedir=/var' '--sharedstatedir=/var/lib' '--mandir=/usr/share/man' '--infodir=/usr/share/info' '--x-libraries=/usr/lib' checking for grep that handles long lines and -e... /bin/grep checking for egrep... /bin/grep -E checking for a sed that does not truncate output... /bin/sed checking for i686-pld-linux-cc... i686-pld-linux-gcc checking whether the C compiler works... yes checking for C compiler default output file name... a.out checking for suffix of executables... checking whether we are cross compiling... no checking for suffix of object files... o checking whether we are using the GNU C compiler... yes checking whether i686-pld-linux-gcc accepts -g... yes checking for i686-pld-linux-gcc option to accept ISO C89... none needed checking how to run the C preprocessor... i686-pld-linux-gcc -E checking for icc... no checking for suncc... no checking whether i686-pld-linux-gcc and cc understand -c and -o together... yes checking for system library directory... lib checking if compiler supports -R... no checking if compiler supports -Wl,-rpath,... yes checking build system type... i686-pld-linux-gnu checking host system type... i686-pld-linux-gnu checking target system type... i686-pld-linux-gnu checking for PHP prefix... /usr checking for PHP includes... -I/usr/include/php -I/usr/include/php/main -I/usr/include/php/TSRM -I/usr/include/php/Zend -I/usr/include/php/ext -I/usr/include/php/ext/date/lib checking for PHP extension directory... /usr/lib/php71 checking for PHP installed headers prefix... /usr/include/php checking if debug is enabled... no checking if zts is enabled... no checking for re2c... re2c checking for re2c version... 0.13.5 (ok) checking for gawk... gawk checking for libsodium support... yes, shared checking for libsodium files in default path... found in /usr checking for sodium_add in -lsodium... yes checking for crypto_aead_aes256gcm_encrypt in -lsodium... yes checking how to print strings... print -r checking for a sed that does not truncate output... (cached) /bin/sed checking for fgrep... /bin/grep -F checking for ld used by i686-pld-linux-gcc... /usr/bin/ld checking if the linker (/usr/bin/ld) is GNU ld... yes checking for BSD- or MS-compatible name lister (nm)... /usr/bin/nm -B checking the name lister (/usr/bin/nm -B) interface... BSD nm checking whether ln -s works... yes checking the maximum length of command line arguments... 1572864 checking how to convert i686-pld-linux-gnu file names to i686-pld-linux-gnu format... func_convert_file_noop checking how to convert i686-pld-linux-gnu file names to toolchain format... func_convert_file_noop checking for /usr/bin/ld option to reload object files... -r checking for i686-pld-linux-objdump... no checking for objdump... objdump checking how to recognize dependent libraries... pass_all checking for i686-pld-linux-dlltool... no checking for dlltool... no checking how to associate runtime and link libraries... print -r -- checking for i686-pld-linux-ar... no checking for ar... ar checking for archiver @FILE support... @ checking for i686-pld-linux-strip... no checking for strip... strip checking for i686-pld-linux-ranlib... no checking for ranlib... ranlib checking for mawk... (cached) gawk checking command to parse /usr/bin/nm -B output from i686-pld-linux-gcc object... ok checking for sysroot... no checking for a working dd... /bin/dd checking how to truncate binary pipes... /bin/dd bs=4096 count=1 checking for i686-pld-linux-mt... no checking for mt... no checking if : is a manifest tool... no checking for ANSI C header files... yes checking for sys/types.h... yes checking for sys/stat.h... yes checking for stdlib.h... yes checking for string.h... yes checking for memory.h... yes checking for strings.h... yes checking for inttypes.h... yes checking for stdint.h... yes checking for unistd.h... yes checking for dlfcn.h... yes checking for objdir... .libs checking if i686-pld-linux-gcc supports -fno-rtti -fno-exceptions... no checking for i686-pld-linux-gcc option to produce PIC... -fPIC -DPIC checking if i686-pld-linux-gcc PIC flag -fPIC -DPIC works... yes checking if i686-pld-linux-gcc static flag -static works... yes checking if i686-pld-linux-gcc supports -c -o file.o... yes checking if i686-pld-linux-gcc supports -c -o file.o... (cached) yes checking whether the i686-pld-linux-gcc linker (/usr/bin/ld) supports shared libraries... yes checking whether -lc should be explicitly linked in... no checking dynamic linker characteristics... GNU/Linux ld.so checking how to hardcode library paths into programs... immediate checking whether stripping libraries is possible... yes checking if libtool supports shared libraries... yes checking whether to build shared libraries... yes checking whether to build static libraries... no configure: creating ./config.status config.status: creating config.h config.status: executing libtool commands + /usr/bin/make -Otarget -j9 /bin/sh /tmp/B.dmv_Wh/BUILD/php71-pecl-libsodium-1.0.7/libtool --mode=compile i686-pld-linux-gcc -I. -I/tmp/B.dmv_Wh/BUILD/php71-pecl-libsodium-1.0.7 -DPHP_ATOM_INC -I/tmp/B.dmv_Wh/BUILD/php71-pecl-libsodium-1.0.7/include -I/tmp/B.dmv_Wh/BUILD/php71-pecl-libsodium-1.0.7/main -I/tmp/B.dmv_Wh/BUILD/php71-pecl-libsodium-1.0.7 -I/usr/include/php -I/usr/include/php/main -I/usr/include/php/TSRM -I/usr/include/php/Zend -I/usr/include/php/ext -I/usr/include/php/ext/date/lib -DHAVE_CONFIG_H -O2 -fwrapv -pipe -Wformat -Werror=format-security -gdwarf-4 -fno-debug-types-section -fvar-tracking-assignments -g2 -Wp,-D_FORTIFY_SOURCE=2 -fstack-protector-strong --param=ssp-buffer-size=4 -fomit-frame-pointer -march=i686 -fasynchronous-unwind-tables -mtune=pentium4 -gdwarf-4 -fno-debug-types-section -fvar-tracking-assignments -g2 -c /tmp/B.dmv_Wh/BUILD/php71-pecl-libsodium-1.0.7/libsodium.c -o libsodium.lo libtool: compile: i686-pld-linux-gcc -I. -I/tmp/B.dmv_Wh/BUILD/php71-pecl-libsodium-1.0.7 -DPHP_ATOM_INC -I/tmp/B.dmv_Wh/BUILD/php71-pecl-libsodium-1.0.7/include -I/tmp/B.dmv_Wh/BUILD/php71-pecl-libsodium-1.0.7/main -I/tmp/B.dmv_Wh/BUILD/php71-pecl-libsodium-1.0.7 -I/usr/include/php -I/usr/include/php/main -I/usr/include/php/TSRM -I/usr/include/php/Zend -I/usr/include/php/ext -I/usr/include/php/ext/date/lib -DHAVE_CONFIG_H -O2 -fwrapv -pipe -Wformat -Werror=format-security -gdwarf-4 -fno-debug-types-section -fvar-tracking-assignments -g2 -Wp,-D_FORTIFY_SOURCE=2 -fstack-protector-strong --param=ssp-buffer-size=4 -fomit-frame-pointer -march=i686 -fasynchronous-unwind-tables -mtune=pentium4 -gdwarf-4 -fno-debug-types-section -fvar-tracking-assignments -g2 -c /tmp/B.dmv_Wh/BUILD/php71-pecl-libsodium-1.0.7/libsodium.c -fPIC -DPIC -o .libs/libsodium.o /bin/sh /tmp/B.dmv_Wh/BUILD/php71-pecl-libsodium-1.0.7/libtool --mode=link i686-pld-linux-gcc -DPHP_ATOM_INC -I/tmp/B.dmv_Wh/BUILD/php71-pecl-libsodium-1.0.7/include -I/tmp/B.dmv_Wh/BUILD/php71-pecl-libsodium-1.0.7/main -I/tmp/B.dmv_Wh/BUILD/php71-pecl-libsodium-1.0.7 -I/usr/include/php -I/usr/include/php/main -I/usr/include/php/TSRM -I/usr/include/php/Zend -I/usr/include/php/ext -I/usr/include/php/ext/date/lib -DHAVE_CONFIG_H -O2 -fwrapv -pipe -Wformat -Werror=format-security -gdwarf-4 -fno-debug-types-section -fvar-tracking-assignments -g2 -Wp,-D_FORTIFY_SOURCE=2 -fstack-protector-strong --param=ssp-buffer-size=4 -fomit-frame-pointer -march=i686 -fasynchronous-unwind-tables -mtune=pentium4 -gdwarf-4 -fno-debug-types-section -fvar-tracking-assignments -g2 -Wl,--as-needed -Wl,--no-copy-dt-needed-entries -Wl,-z,relro -Wl,-z,combreloc -o libsodium.la -export-dynamic -avoid-version -prefer-pic -module -rpath /tmp/B.dmv_Wh/BUILD/php71-pecl-libsodium-1.0.7/modules libsodium.lo -lsodium libtool: link: i686-pld-linux-gcc -shared -fPIC -DPIC -O2 -gdwarf-4 -g2 -fstack-protector-strong -march=i686 -mtune=pentium4 -gdwarf-4 -g2 -Wl,--as-needed -Wl,--no-copy-dt-needed-entries -Wl,-z -Wl,relro -Wl,-z -Wl,combreloc .libs/libsodium.o -lsodium -Wl,-soname -Wl,libsodium.so -o .libs/libsodium.so libtool: link: ( cd ".libs" && rm -f "libsodium.la" && ln -s "../libsodium.la" "libsodium.la" ) /bin/sh /tmp/B.dmv_Wh/BUILD/php71-pecl-libsodium-1.0.7/libtool --mode=install cp ./libsodium.la /tmp/B.dmv_Wh/BUILD/php71-pecl-libsodium-1.0.7/modules libtool: install: cp ./.libs/libsodium.so /tmp/B.dmv_Wh/BUILD/php71-pecl-libsodium-1.0.7/modules/libsodium.so libtool: install: cp ./.libs/libsodium.lai /tmp/B.dmv_Wh/BUILD/php71-pecl-libsodium-1.0.7/modules/libsodium.la libtool: finish: PATH="/home/users/builder/GNUstep/Tools:/usr/local/bin:/usr/bin:/bin:/home/users/builder/bin:/sbin" ldconfig -n /tmp/B.dmv_Wh/BUILD/php71-pecl-libsodium-1.0.7/modules ---------------------------------------------------------------------- Libraries have been installed in: /tmp/B.dmv_Wh/BUILD/php71-pecl-libsodium-1.0.7/modules If you ever happen to want to link against installed libraries in a given directory, LIBDIR, you must either use libtool, and specify the full pathname of the library, or use the '-LLIBDIR' flag during linking and do at least one of the following: - add LIBDIR to the 'LD_LIBRARY_PATH' environment variable during execution - add LIBDIR to the 'LD_RUN_PATH' environment variable during linking - use the '-Wl,-rpath -Wl,LIBDIR' linker flag - have your system administrator add LIBDIR to '/etc/ld.so.conf' See any operating system documentation about shared libraries for more information, such as the ld(1) and ld.so(8) manual pages. ---------------------------------------------------------------------- Build complete. Don't forget to run 'make test'. + : Minimal load test + >modules.log + /usr/bin/php71 -n -d 'extension_dir=modules' -d 'extension=libsodium.so' -m + grep libsodium modules.log libsodium + : Upstream test suite + export 'NO_INTERACTION=1' 'REPORT_EXIT_STATUS=1' 'MALLOC_CHECK_=2' + /usr/bin/make -Otarget -j9 test 'PHP_EXECUTABLE=/usr/bin/php71' 'PHP_TEST_SHARED_SYSTEM_EXTENSIONS=json' Build complete. Don't forget to run 'make test'. PHP Warning: PHP Startup: Unable to load dynamic library '/usr/lib/php71/pcre.so' - /usr/lib/php71/pcre.so: cannot open shared object file: No such file or directory in Unknown on line 0 +-----------------------------------------------------------+ | ! ERROR ! | | The test-suite requires that you have pcre extension | | enabled. To enable this extension either compile your PHP | | with --with-pcre-regex or if you've compiled pcre as a | | shared module load it via php.ini. | +-----------------------------------------------------------+ make: *** [Makefile:151: test] Error 1 error: Bad exit status from /tmp/B.dmv_Wh/BUILD/tmp/rpm-tmp.31162 (%build) RPM build errors: Bad exit status from /tmp/B.dmv_Wh/BUILD/tmp/rpm-tmp.31162 (%build) ended at: Wed Dec 27 00:20:28 2017, done in 0:00:05.353276 error: No files produced. + chmod -R u+rwX /tmp/B.dmv_Wh/BUILD + rm -rf /tmp/B.dmv_Wh/tmp /tmp/B.dmv_Wh/BUILD + rm -rf /tmp/B.dmv_Wh Begin-PLD-Builder-Info Build-Time: user:11.55s sys:1.66s real:29.05s (faults io:0 non-io:709153) End-PLD-Builder-Info
[Back to list of logs] [View rpm -qa of builder]