FailedOk

th/SRPMS[OK]
th/x32[OK]
th/i686[OK]
th/x86_64[OK]

ac/SRPMS[OK]
ac/i386[OK]
ac/i586[OK]
ac/i686[OK]
ac/alpha[OK]
ac/amd64[OK]
ac/athlon[OK]
ac/ppc[OK]
ac/sparc[OK]
ac/sparc64[OK]

Advanced Search
main()
Powered by PLD Linux
(c) 2002-2021 PLD Team
$Revision: 1.37 $
Powered by NSA.
Your IP: 54.227.97.219

php-pecl-parsekit a370d466-09aa-42f8-9483-2b4804246e9b

Status:Failed
Source URL:https://buildlogs.pld-linux.org/pld/th/i686/FAIL/php-pecl-parsekit,a370d466-09aa-42f8-9483-2b4804246e9b.bz2
text/plain URL:View!
full text:View!
rpm -qa of builder:View!
Date:2014/04/28 14:15:57
Runtime:0:00:07.492204

Toc:

  • error 1
  • /tmp/B.f73e5564-3c09-42e6-a75b-fce158480d3d/BUILD/php-pecl-parsekit-1.3.0/parsekit.c:81:46: error: 'union <anonymous>' has no member named 'var'
  • error 2
  • /tmp/B.f73e5564-3c09-42e6-a75b-fce158480d3d/BUILD/php-pecl-parsekit-1.3.0/parsekit.c:82:68: error: 'union <anonymous>' has no member named 'var'
  • error 3
  • /tmp/B.f73e5564-3c09-42e6-a75b-fce158480d3d/BUILD/php-pecl-parsekit-1.3.0/parsekit.c:82:102: error: 'union <anonymous>' has no member named 'var'
  • error 4
  • /tmp/B.f73e5564-3c09-42e6-a75b-fce158480d3d/BUILD/php-pecl-parsekit-1.3.0/parsekit.c:88:70: error: 'union <anonymous>' has no member named 'var'
  • error 5
  • /tmp/B.f73e5564-3c09-42e6-a75b-fce158480d3d/BUILD/php-pecl-parsekit-1.3.0/parsekit.c:92:47: error: 'union <anonymous>' has no member named 'var'
  • error 6
  • /tmp/B.f73e5564-3c09-42e6-a75b-fce158480d3d/BUILD/php-pecl-parsekit-1.3.0/parsekit.c:117:36: error: 'union <anonymous>' has no member named 'var'
  • error 7
  • /tmp/B.f73e5564-3c09-42e6-a75b-fce158480d3d/BUILD/php-pecl-parsekit-1.3.0/parsekit.c:126:51: error: 'union <anonymous>' has no member named 'EA'
  • error 8
  • /tmp/B.f73e5564-3c09-42e6-a75b-fce158480d3d/BUILD/php-pecl-parsekit-1.3.0/parsekit.c:303:60: error: 'zend_op_array' has no member named 'pass_rest_by_reference'
  • error 9
  • /tmp/B.f73e5564-3c09-42e6-a75b-fce158480d3d/BUILD/php-pecl-parsekit-1.3.0/parsekit.c:377:54: error: 'zend_op_array' has no member named 'return_reference'
  • error 10
  • /tmp/B.f73e5564-3c09-42e6-a75b-fce158480d3d/BUILD/php-pecl-parsekit-1.3.0/parsekit.c:380:42: error: 'zend_op_array' has no member named 'size'
  • error 11
  • /tmp/B.f73e5564-3c09-42e6-a75b-fce158480d3d/BUILD/php-pecl-parsekit-1.3.0/parsekit.c:383:54: error: 'zend_op_array' has no member named 'current_brk_cont'
  • error 12
  • /tmp/B.f73e5564-3c09-42e6-a75b-fce158480d3d/BUILD/php-pecl-parsekit-1.3.0/parsekit.c:384:53: error: 'zend_op_array' has no member named 'backpatch_count'
  • error 13
  • /tmp/B.f73e5564-3c09-42e6-a75b-fce158480d3d/BUILD/php-pecl-parsekit-1.3.0/parsekit.c:385:51: error: 'zend_op_array' has no member named 'done_pass_two'
  • error 14
  • /tmp/B.f73e5564-3c09-42e6-a75b-fce158480d3d/BUILD/php-pecl-parsekit-1.3.0/parsekit.c:416:9: error: 'zend_op_array' has no member named 'start_op'
  • error 15
  • /tmp/B.f73e5564-3c09-42e6-a75b-fce158480d3d/BUILD/php-pecl-parsekit-1.3.0/parsekit.c:419:53: error: 'zend_op_array' has no member named 'start_op'
  • error 16
  • /tmp/B.f73e5564-3c09-42e6-a75b-fce158480d3d/BUILD/php-pecl-parsekit-1.3.0/parsekit.c:434:45: error: 'zend_op_array' has no member named 'size'
  • error 17
  • /tmp/B.f73e5564-3c09-42e6-a75b-fce158480d3d/BUILD/php-pecl-parsekit-1.3.0/parsekit.c:450:14: error: 'union <anonymous>' has no member named 'var'
  • error 18
  • /tmp/B.f73e5564-3c09-42e6-a75b-fce158480d3d/BUILD/php-pecl-parsekit-1.3.0/parsekit.c:452:15: error: 'union <anonymous>' has no member named 'jmp_addr'
  • error 19
  • /tmp/B.f73e5564-3c09-42e6-a75b-fce158480d3d/BUILD/php-pecl-parsekit-1.3.0/parsekit.c:453:12: error: 'union <anonymous>' has no member named 'jmp_addr'
  • error 20
  • /tmp/B.f73e5564-3c09-42e6-a75b-fce158480d3d/BUILD/php-pecl-parsekit-1.3.0/parsekit.c:453:71: error: 'zend_op_array' has no member named 'size'
  • error 21
  • /tmp/B.f73e5564-3c09-42e6-a75b-fce158480d3d/BUILD/php-pecl-parsekit-1.3.0/parsekit.c:455:37: error: 'union <anonymous>' has no member named 'jmp_addr'
  • error 22
  • /tmp/B.f73e5564-3c09-42e6-a75b-fce158480d3d/BUILD/php-pecl-parsekit-1.3.0/parsekit.c:460:38: error: 'union <anonymous>' has no member named 'var'
  • error 23
  • /tmp/B.f73e5564-3c09-42e6-a75b-fce158480d3d/BUILD/php-pecl-parsekit-1.3.0/parsekit.c:517:36: error: 'union <anonymous>' has no member named 'var'
  • error 24
  • /tmp/B.f73e5564-3c09-42e6-a75b-fce158480d3d/BUILD/php-pecl-parsekit-1.3.0/parsekit.c:531:46: error: 'zend_op_array' has no member named 'size'
  • error 25
  • /tmp/B.f73e5564-3c09-42e6-a75b-fce158480d3d/BUILD/php-pecl-parsekit-1.3.0/parsekit.c:636:54: error: 'zend_class_entry' has no member named 'constants_updated'
  • error 26
  • /tmp/B.f73e5564-3c09-42e6-a75b-fce158480d3d/BUILD/php-pecl-parsekit-1.3.0/parsekit.c:694:8: error: 'zend_class_entry' has no member named 'static_members'
  • error 27
  • /tmp/B.f73e5564-3c09-42e6-a75b-fce158480d3d/BUILD/php-pecl-parsekit-1.3.0/parsekit.c:694:53: error: 'zend_class_entry' has no member named 'static_members'
  • error 28
  • /tmp/B.f73e5564-3c09-42e6-a75b-fce158480d3d/BUILD/php-pecl-parsekit-1.3.0/parsekit.c:699:38: error: 'zend_class_entry' has no member named 'static_members'
  • error 29
  • /tmp/B.f73e5564-3c09-42e6-a75b-fce158480d3d/BUILD/php-pecl-parsekit-1.3.0/parsekit.c:727:47: error: 'zend_class_entry' has no member named 'filename'
  • error 30
  • /tmp/B.f73e5564-3c09-42e6-a75b-fce158480d3d/BUILD/php-pecl-parsekit-1.3.0/parsekit.c:728:47: error: 'zend_class_entry' has no member named 'line_start'
  • error 31
  • /tmp/B.f73e5564-3c09-42e6-a75b-fce158480d3d/BUILD/php-pecl-parsekit-1.3.0/parsekit.c:729:45: error: 'zend_class_entry' has no member named 'line_end'
  • error 32
  • /tmp/B.f73e5564-3c09-42e6-a75b-fce158480d3d/BUILD/php-pecl-parsekit-1.3.0/parsekit.c:730:8: error: 'zend_class_entry' has no member named 'doc_comment'
  • error 33
  • /tmp/B.f73e5564-3c09-42e6-a75b-fce158480d3d/BUILD/php-pecl-parsekit-1.3.0/parsekit.c:731:52: error: 'zend_class_entry' has no member named 'doc_comment'
  • error 34
  • /tmp/B.f73e5564-3c09-42e6-a75b-fce158480d3d/BUILD/php-pecl-parsekit-1.3.0/parsekit.c:731:69: error: 'zend_class_entry' has no member named 'doc_comment_len'
  • error 35
  • /tmp/B.f73e5564-3c09-42e6-a75b-fce158480d3d/BUILD/php-pecl-parsekit-1.3.0/parsekit.c:760:33: error: 'zend_class_entry' has no member named 'default_properties'
  • error 36
  • /tmp/B.f73e5564-3c09-42e6-a75b-fce158480d3d/BUILD/php-pecl-parsekit-1.3.0/parsekit.c:765:40: error: 'zend_class_entry' has no member named 'default_properties'
  • error 37
  • /tmp/B.f73e5564-3c09-42e6-a75b-fce158480d3d/BUILD/php-pecl-parsekit-1.3.0/parsekit.c:1134:1: error: unknown type name 'function_entry'
  • error 38
  • Makefile:201: recipe for target 'parsekit.lo' failed
  • error 39
  • error: Bad exit status from /tmp/B.f73e5564-3c09-42e6-a75b-fce158480d3d/BUILD/tmp/rpm-tmp.36705 (%build)
  • error 40
  • RPM build errors:
  • error 41
  • error: No files produced.

Content:

checking for egrep... /bin/grep -E
checking for a sed that does not truncate output... /bin/sed
checking for i686-pld-linux-cc... i686-pld-linux-gcc
checking whether the C compiler works... yes
checking for C compiler default output file name... a.out
checking for suffix of executables... 
checking whether we are cross compiling... no
checking for suffix of object files... o
checking whether we are using the GNU C compiler... yes
checking whether i686-pld-linux-gcc accepts -g... yes
checking for i686-pld-linux-gcc option to accept ISO C89... none needed
checking how to run the C preprocessor... i686-pld-linux-gcc -E
checking for icc... no
checking for suncc... no
checking whether i686-pld-linux-gcc and cc understand -c and -o together... yes
checking for system library directory... lib
checking if compiler supports -R... no
checking if compiler supports -Wl,-rpath,... yes
checking build system type... i686-pld-linux-gnu
checking host system type... i686-pld-linux-gnu
checking target system type... i686-pld-linux-gnu
checking for PHP prefix... /usr
checking for PHP includes... -I/usr/include/php -I/usr/include/php/main -I/usr/include/php/TSRM -I/usr/include/php/Zend -I/usr/include/php/ext -I/usr/include/php/ext/date/lib
checking for PHP extension directory... /usr/lib/php
checking for PHP installed headers prefix... /usr/include/php
checking if debug is enabled... no
checking if zts is enabled... no
checking for re2c... re2c
checking for re2c version... 0.13.5 (ok)
checking for gawk... gawk
checking whether to enable parsekit support... yes, shared
checking how to print strings... print -r
checking for a sed that does not truncate output... (cached) /bin/sed
checking for fgrep... /bin/grep -F
checking for ld used by i686-pld-linux-gcc... /usr/bin/ld
checking if the linker (/usr/bin/ld) is GNU ld... yes
checking for BSD- or MS-compatible name lister (nm)... /usr/bin/nm -B
checking the name lister (/usr/bin/nm -B) interface... BSD nm
checking whether ln -s works... yes
checking the maximum length of command line arguments... 1572864
checking whether the shell understands some XSI constructs... yes
checking whether the shell understands "+="... yes
checking how to convert i686-pld-linux-gnu file names to i686-pld-linux-gnu format... func_convert_file_noop
checking how to convert i686-pld-linux-gnu file names to toolchain format... func_convert_file_noop
checking for /usr/bin/ld option to reload object files... -r
checking for i686-pld-linux-objdump... no
checking for objdump... objdump
checking how to recognize dependent libraries... pass_all
checking for i686-pld-linux-dlltool... no
checking for dlltool... no
checking how to associate runtime and link libraries... print -r --
checking for i686-pld-linux-ar... no
checking for ar... ar
checking for archiver @FILE support... @
checking for i686-pld-linux-strip... no
checking for strip... strip
checking for i686-pld-linux-ranlib... no
checking for ranlib... ranlib
checking for mawk... (cached) gawk
checking command to parse /usr/bin/nm -B output from i686-pld-linux-gcc object... ok
checking for sysroot... no
checking for i686-pld-linux-mt... no
checking for mt... no
checking if : is a manifest tool... no
checking for ANSI C header files... yes
checking for sys/types.h... yes
checking for sys/stat.h... yes
checking for stdlib.h... yes
checking for string.h... yes
checking for memory.h... yes
checking for strings.h... yes
checking for inttypes.h... yes
checking for stdint.h... yes
checking for unistd.h... yes
checking for dlfcn.h... yes
checking for objdir... .libs
checking if i686-pld-linux-gcc supports -fno-rtti -fno-exceptions... no
checking for i686-pld-linux-gcc option to produce PIC... -fPIC -DPIC
checking if i686-pld-linux-gcc PIC flag -fPIC -DPIC works... yes
checking if i686-pld-linux-gcc static flag -static works... yes
checking if i686-pld-linux-gcc supports -c -o file.o... yes
checking if i686-pld-linux-gcc supports -c -o file.o... (cached) yes
checking whether the i686-pld-linux-gcc linker (/usr/bin/ld) supports shared libraries... yes
checking whether -lc should be explicitly linked in... no
checking dynamic linker characteristics... GNU/Linux ld.so
checking how to hardcode library paths into programs... immediate
checking whether stripping libraries is possible... yes
checking if libtool supports shared libraries... yes
checking whether to build shared libraries... yes
checking whether to build static libraries... no
configure: creating ./config.status
config.status: creating config.h
config.status: executing libtool commands
+ /usr/bin/make -j9
/bin/sh /tmp/B.f73e5564-3c09-42e6-a75b-fce158480d3d/BUILD/php-pecl-parsekit-1.3.0/libtool --mode=compile i686-pld-linux-gcc  -I. -I/tmp/B.f73e5564-3c09-42e6-a75b-fce158480d3d/BUILD/php-pecl-parsekit-1.3.0 -DPHP_ATOM_INC -I/tmp/B.f73e5564-3c09-42e6-a75b-fce158480d3d/BUILD/php-pecl-parsekit-1.3.0/include -I/tmp/B.f73e5564-3c09-42e6-a75b-fce158480d3d/BUILD/php-pecl-parsekit-1.3.0/main -I/tmp/B.f73e5564-3c09-42e6-a75b-fce158480d3d/BUILD/php-pecl-parsekit-1.3.0 -I/usr/include/php -I/usr/include/php/main -I/usr/include/php/TSRM -I/usr/include/php/Zend -I/usr/include/php/ext -I/usr/include/php/ext/date/lib  -DHAVE_CONFIG_H  -O2 -fwrapv -pipe -Wformat -Werror=format-security -gdwarf-4 -fno-debug-types-section -fvar-tracking-assignments -g2 -Wp,-D_FORTIFY_SOURCE=2 -fstack-protector --param=ssp-buffer-size=4 -fomit-frame-pointer -march=i686 -fasynchronous-unwind-tables -mtune=pentium4 -gdwarf-4 -fno-debug-types-section -fvar-tracking-assignments -g2   -c /tmp/B.f73e5564-3c09-42e6-a75b-fce158480d3d/BUILD/php-pecl-parsekit-1.3.0/parsekit.c -o parsekit.lo 
libtool: compile:  i686-pld-linux-gcc -I. -I/tmp/B.f73e5564-3c09-42e6-a75b-fce158480d3d/BUILD/php-pecl-parsekit-1.3.0 -DPHP_ATOM_INC -I/tmp/B.f73e5564-3c09-42e6-a75b-fce158480d3d/BUILD/php-pecl-parsekit-1.3.0/include -I/tmp/B.f73e5564-3c09-42e6-a75b-fce158480d3d/BUILD/php-pecl-parsekit-1.3.0/main -I/tmp/B.f73e5564-3c09-42e6-a75b-fce158480d3d/BUILD/php-pecl-parsekit-1.3.0 -I/usr/include/php -I/usr/include/php/main -I/usr/include/php/TSRM -I/usr/include/php/Zend -I/usr/include/php/ext -I/usr/include/php/ext/date/lib -DHAVE_CONFIG_H -O2 -fwrapv -pipe -Wformat -Werror=format-security -gdwarf-4 -fno-debug-types-section -fvar-tracking-assignments -g2 -Wp,-D_FORTIFY_SOURCE=2 -fstack-protector --param=ssp-buffer-size=4 -fomit-frame-pointer -march=i686 -fasynchronous-unwind-tables -mtune=pentium4 -gdwarf-4 -fno-debug-types-section -fvar-tracking-assignments -g2 -c /tmp/B.f73e5564-3c09-42e6-a75b-fce158480d3d/BUILD/php-pecl-parsekit-1.3.0/parsekit.c  -fPIC -DPIC -o .libs/parsekit.o
In file included from /usr/include/php/main/php.h:38:0,
                 from /tmp/B.f73e5564-3c09-42e6-a75b-fce158480d3d/BUILD/php-pecl-parsekit-1.3.0/parsekit.c:25:
/tmp/B.f73e5564-3c09-42e6-a75b-fce158480d3d/BUILD/php-pecl-parsekit-1.3.0/parsekit.c: In function 'php_parsekit_parse_node':
/tmp/B.f73e5564-3c09-42e6-a75b-fce158480d3d/BUILD/php-pecl-parsekit-1.3.0/parsekit.c:81:46: error: 'union <anonymous>' has no member named 'var'
   add_assoc_long(return_value, "var", node->u.var);
                                              ^
/usr/include/php/Zend/zend_API.h:385:92: note: in definition of macro 'add_assoc_long'
 #define add_assoc_long(__arg, __key, __n) add_assoc_long_ex(__arg, __key, strlen(__key)+1, __n)
                                                                                            ^
/tmp/B.f73e5564-3c09-42e6-a75b-fce158480d3d/BUILD/php-pecl-parsekit-1.3.0/parsekit.c:82:68: error: 'union <anonymous>' has no member named 'var'
   add_assoc_stringl(return_value, "varname", op_array->vars[node->u.var].name, op_array->vars[node->u.var].name_len, 1);
                                                                    ^
/usr/include/php/Zend/zend_API.h:391:123: note: in definition of macro 'add_assoc_stringl'
 #define add_assoc_stringl(__arg, __key, __str, __length, __duplicate) add_assoc_stringl_ex(__arg, __key, strlen(__key)+1, __str, __length, __duplicate)
                                                                                                                           ^
/tmp/B.f73e5564-3c09-42e6-a75b-fce158480d3d/BUILD/php-pecl-parsekit-1.3.0/parsekit.c:82:102: error: 'union <anonymous>' has no member named 'var'
   add_assoc_stringl(return_value, "varname", op_array->vars[node->u.var].name, op_array->vars[node->u.var].name_len, 1);
                                                                                                      ^
/usr/include/php/Zend/zend_API.h:391:130: note: in definition of macro 'add_assoc_stringl'
 #define add_assoc_stringl(__arg, __key, __str, __length, __duplicate) add_assoc_stringl_ex(__arg, __key, strlen(__key)+1, __str, __length, __duplicate)
                                                                                                                                  ^
/tmp/B.f73e5564-3c09-42e6-a75b-fce158480d3d/BUILD/php-pecl-parsekit-1.3.0/parsekit.c:88:70: error: 'union <anonymous>' has no member named 'var'
   snprintf(sop, (sizeof(void *) * 2) + 1, "%X", (unsigned int)node->u.var); 
                                                                      ^
In file included from /usr/include/php/main/php.h:38:0,
                 from /tmp/B.f73e5564-3c09-42e6-a75b-fce158480d3d/BUILD/php-pecl-parsekit-1.3.0/parsekit.c:25:
/tmp/B.f73e5564-3c09-42e6-a75b-fce158480d3d/BUILD/php-pecl-parsekit-1.3.0/parsekit.c:92:47: error: 'union <anonymous>' has no member named 'var'
    add_assoc_long(return_value, "var", node->u.var / sizeof(temp_variable));
                                               ^
/usr/include/php/Zend/zend_API.h:385:92: note: in definition of macro 'add_assoc_long'
 #define add_assoc_long(__arg, __key, __n) add_assoc_long_ex(__arg, __key, strlen(__key)+1, __n)
                                                                                            ^
/tmp/B.f73e5564-3c09-42e6-a75b-fce158480d3d/BUILD/php-pecl-parsekit-1.3.0/parsekit.c:117:36: error: 'union <anonymous>' has no member named 'var'
      ((unsigned int)((char*)node->u.var - (char*)op_array->opcodes))/sizeof(zend_op));
                                    ^
In file included from /usr/include/php/main/php.h:38:0,
                 from /tmp/B.f73e5564-3c09-42e6-a75b-fce158480d3d/BUILD/php-pecl-parsekit-1.3.0/parsekit.c:25:
/tmp/B.f73e5564-3c09-42e6-a75b-fce158480d3d/BUILD/php-pecl-parsekit-1.3.0/parsekit.c:126:51: error: 'union <anonymous>' has no member named 'EA'
    add_assoc_long(return_value, "EA.type", node->u.EA.type);
                                                   ^
/usr/include/php/Zend/zend_API.h:385:92: note: in definition of macro 'add_assoc_long'
 #define add_assoc_long(__arg, __key, __n) add_assoc_long_ex(__arg, __key, strlen(__key)+1, __n)
                                                                                            ^
/tmp/B.f73e5564-3c09-42e6-a75b-fce158480d3d/BUILD/php-pecl-parsekit-1.3.0/parsekit.c: In function 'php_parsekit_parse_op':
/tmp/B.f73e5564-3c09-42e6-a75b-fce158480d3d/BUILD/php-pecl-parsekit-1.3.0/parsekit.c:152:3: warning: passing argument 3 of 'php_parsekit_parse_node' from incompatible pointer type [enabled by default]
   php_parsekit_parse_node(result, op_array, &(op->result), flags & PHP_PARSEKIT_RESULT_USED, options TSRMLS_CC);
   ^
/tmp/B.f73e5564-3c09-42e6-a75b-fce158480d3d/BUILD/php-pecl-parsekit-1.3.0/parsekit.c:66:13: note: expected 'struct znode *' but argument is of type 'union znode_op *'
 static void php_parsekit_parse_node(zval *return_value, zend_op_array *op_array, znode *node, long flags, long options TSRMLS_DC)
             ^
/tmp/B.f73e5564-3c09-42e6-a75b-fce158480d3d/BUILD/php-pecl-parsekit-1.3.0/parsekit.c:161:3: warning: passing argument 3 of 'php_parsekit_parse_node' from incompatible pointer type [enabled by default]
   php_parsekit_parse_node(op1, op_array, &(op->op1), flags & PHP_PARSEKIT_OP1_USED, options TSRMLS_CC);
   ^
/tmp/B.f73e5564-3c09-42e6-a75b-fce158480d3d/BUILD/php-pecl-parsekit-1.3.0/parsekit.c:66:13: note: expected 'struct znode *' but argument is of type 'union znode_op *'
 static void php_parsekit_parse_node(zval *return_value, zend_op_array *op_array, znode *node, long flags, long options TSRMLS_DC)
             ^
/tmp/B.f73e5564-3c09-42e6-a75b-fce158480d3d/BUILD/php-pecl-parsekit-1.3.0/parsekit.c:170:3: warning: passing argument 3 of 'php_parsekit_parse_node' from incompatible pointer type [enabled by default]
   php_parsekit_parse_node(op2, op_array, &(op->op2), flags & PHP_PARSEKIT_OP2_USED, options TSRMLS_CC);
   ^
/tmp/B.f73e5564-3c09-42e6-a75b-fce158480d3d/BUILD/php-pecl-parsekit-1.3.0/parsekit.c:66:13: note: expected 'struct znode *' but argument is of type 'union znode_op *'
 static void php_parsekit_parse_node(zval *return_value, zend_op_array *op_array, znode *node, long flags, long options TSRMLS_DC)
             ^
/tmp/B.f73e5564-3c09-42e6-a75b-fce158480d3d/BUILD/php-pecl-parsekit-1.3.0/parsekit.c: In function 'php_parsekit_parse_arginfo':
/tmp/B.f73e5564-3c09-42e6-a75b-fce158480d3d/BUILD/php-pecl-parsekit-1.3.0/parsekit.c:200:3: warning: passing argument 4 of 'add_assoc_stringl_ex' discards 'const' qualifier from pointer target type [enabled by default]
   add_assoc_stringl(tmpzval, "name", arginfo[i].name, arginfo[i].name_len, 1);
   ^
In file included from /usr/include/php/main/php.h:38:0,
                 from /tmp/B.f73e5564-3c09-42e6-a75b-fce158480d3d/BUILD/php-pecl-parsekit-1.3.0/parsekit.c:25:
/usr/include/php/Zend/zend_API.h:382:14: note: expected 'char *' but argument is of type 'const char *'
 ZEND_API int add_assoc_stringl_ex(zval *arg, const char *key, uint key_len, char *str, uint length, int duplicate);
              ^
/tmp/B.f73e5564-3c09-42e6-a75b-fce158480d3d/BUILD/php-pecl-parsekit-1.3.0/parsekit.c:202:4: warning: passing argument 4 of 'add_assoc_stringl_ex' discards 'const' qualifier from pointer target type [enabled by default]
    add_assoc_stringl(tmpzval, "class_name", arginfo[i].class_name, arginfo[i].class_name_len, 1);
    ^
In file included from /usr/include/php/main/php.h:38:0,
                 from /tmp/B.f73e5564-3c09-42e6-a75b-fce158480d3d/BUILD/php-pecl-parsekit-1.3.0/parsekit.c:25:
/usr/include/php/Zend/zend_API.h:382:14: note: expected 'char *' but argument is of type 'const char *'
 ZEND_API int add_assoc_stringl_ex(zval *arg, const char *key, uint key_len, char *str, uint length, int duplicate);
              ^
/tmp/B.f73e5564-3c09-42e6-a75b-fce158480d3d/BUILD/php-pecl-parsekit-1.3.0/parsekit.c: In function 'php_parsekit_parse_op_array':
/tmp/B.f73e5564-3c09-42e6-a75b-fce158480d3d/BUILD/php-pecl-parsekit-1.3.0/parsekit.c:269:3: warning: passing argument 4 of 'add_assoc_string_ex' discards 'const' qualifier from pointer target type [enabled by default]
   add_assoc_string(return_value, "function_name", ops->function_name, 1);
   ^
In file included from /usr/include/php/main/php.h:38:0,
                 from /tmp/B.f73e5564-3c09-42e6-a75b-fce158480d3d/BUILD/php-pecl-parsekit-1.3.0/parsekit.c:25:
/usr/include/php/Zend/zend_API.h:381:14: note: expected 'char *' but argument is of type 'const char *'
 ZEND_API int add_assoc_string_ex(zval *arg, const char *key, uint key_len, char *str, int duplicate);
              ^
/tmp/B.f73e5564-3c09-42e6-a75b-fce158480d3d/BUILD/php-pecl-parsekit-1.3.0/parsekit.c:277:3: warning: passing argument 4 of 'add_assoc_stringl_ex' discards 'const' qualifier from pointer target type [enabled by default]
   add_assoc_stringl(return_value, "scope", ops->scope->name, ops->scope->name_length, 1);
   ^
In file included from /usr/include/php/main/php.h:38:0,
                 from /tmp/B.f73e5564-3c09-42e6-a75b-fce158480d3d/BUILD/php-pecl-parsekit-1.3.0/parsekit.c:25:
/usr/include/php/Zend/zend_API.h:382:14: note: expected 'char *' but argument is of type 'const char *'
 ZEND_API int add_assoc_stringl_ex(zval *arg, const char *key, uint key_len, char *str, uint length, int duplicate);
              ^
/tmp/B.f73e5564-3c09-42e6-a75b-fce158480d3d/BUILD/php-pecl-parsekit-1.3.0/parsekit.c:288:4: warning: passing argument 4 of 'add_assoc_string_ex' discards 'const' qualifier from pointer target type [enabled by default]
    add_assoc_string(tmpzval, "function_name", ops->prototype->common.function_name, 1);
    ^
In file included from /usr/include/php/main/php.h:38:0,
                 from /tmp/B.f73e5564-3c09-42e6-a75b-fce158480d3d/BUILD/php-pecl-parsekit-1.3.0/parsekit.c:25:
/usr/include/php/Zend/zend_API.h:381:14: note: expected 'char *' but argument is of type 'const char *'
 ZEND_API int add_assoc_string_ex(zval *arg, const char *key, uint key_len, char *str, int duplicate);
              ^
/tmp/B.f73e5564-3c09-42e6-a75b-fce158480d3d/BUILD/php-pecl-parsekit-1.3.0/parsekit.c:293:4: warning: passing argument 4 of 'add_assoc_stringl_ex' discards 'const' qualifier from pointer target type [enabled by default]
    add_assoc_stringl(tmpzval, "scope", ops->prototype->common.scope->name, ops->prototype->common.scope->name_length, 1);
    ^
In file included from /usr/include/php/main/php.h:38:0,
                 from /tmp/B.f73e5564-3c09-42e6-a75b-fce158480d3d/BUILD/php-pecl-parsekit-1.3.0/parsekit.c:25:
/usr/include/php/Zend/zend_API.h:382:14: note: expected 'char *' but argument is of type 'const char *'
 ZEND_API int add_assoc_stringl_ex(zval *arg, const char *key, uint key_len, char *str, uint length, int duplicate);
              ^
/tmp/B.f73e5564-3c09-42e6-a75b-fce158480d3d/BUILD/php-pecl-parsekit-1.3.0/parsekit.c:303:60: error: 'zend_op_array' has no member named 'pass_rest_by_reference'
  add_assoc_bool(return_value, "pass_rest_by_reference", ops->pass_rest_by_reference);
                                                            ^
/usr/include/php/Zend/zend_API.h:387:92: note: in definition of macro 'add_assoc_bool'
 #define add_assoc_bool(__arg, __key, __b) add_assoc_bool_ex(__arg, __key, strlen(__key)+1, __b)
                                                                                            ^
/tmp/B.f73e5564-3c09-42e6-a75b-fce158480d3d/BUILD/php-pecl-parsekit-1.3.0/parsekit.c:338:3: warning: passing argument 4 of 'add_assoc_stringl_ex' discards 'const' qualifier from pointer target type [enabled by default]
   add_assoc_stringl(return_value, "doc_comment", ops->doc_comment, ops->doc_comment_len, 1);
   ^
In file included from /usr/include/php/main/php.h:38:0,
                 from /tmp/B.f73e5564-3c09-42e6-a75b-fce158480d3d/BUILD/php-pecl-parsekit-1.3.0/parsekit.c:25:
/usr/include/php/Zend/zend_API.h:382:14: note: expected 'char *' but argument is of type 'const char *'
 ZEND_API int add_assoc_stringl_ex(zval *arg, const char *key, uint key_len, char *str, uint length, int duplicate);
              ^
/tmp/B.f73e5564-3c09-42e6-a75b-fce158480d3d/BUILD/php-pecl-parsekit-1.3.0/parsekit.c:377:54: error: 'zend_op_array' has no member named 'return_reference'
  add_assoc_bool(return_value, "return_reference", ops->return_reference);
                                                      ^
/usr/include/php/Zend/zend_API.h:387:92: note: in definition of macro 'add_assoc_bool'
 #define add_assoc_bool(__arg, __key, __b) add_assoc_bool_ex(__arg, __key, strlen(__key)+1, __b)
                                                                                            ^
/tmp/B.f73e5564-3c09-42e6-a75b-fce158480d3d/BUILD/php-pecl-parsekit-1.3.0/parsekit.c:380:42: error: 'zend_op_array' has no member named 'size'
  add_assoc_long(return_value, "size", ops->size);
                                          ^
/usr/include/php/Zend/zend_API.h:385:92: note: in definition of macro 'add_assoc_long'
 #define add_assoc_long(__arg, __key, __n) add_assoc_long_ex(__arg, __key, strlen(__key)+1, __n)
                                                                                            ^
/tmp/B.f73e5564-3c09-42e6-a75b-fce158480d3d/BUILD/php-pecl-parsekit-1.3.0/parsekit.c:383:54: error: 'zend_op_array' has no member named 'current_brk_cont'
  add_assoc_long(return_value, "current_brk_cont", ops->current_brk_cont);
                                                      ^
/usr/include/php/Zend/zend_API.h:385:92: note: in definition of macro 'add_assoc_long'
 #define add_assoc_long(__arg, __key, __n) add_assoc_long_ex(__arg, __key, strlen(__key)+1, __n)
                                                                                            ^
/tmp/B.f73e5564-3c09-42e6-a75b-fce158480d3d/BUILD/php-pecl-parsekit-1.3.0/parsekit.c:384:53: error: 'zend_op_array' has no member named 'backpatch_count'
  add_assoc_long(return_value, "backpatch_count", ops->backpatch_count);
                                                     ^
/usr/include/php/Zend/zend_API.h:385:92: note: in definition of macro 'add_assoc_long'
 #define add_assoc_long(__arg, __key, __n) add_assoc_long_ex(__arg, __key, strlen(__key)+1, __n)
                                                                                            ^
/tmp/B.f73e5564-3c09-42e6-a75b-fce158480d3d/BUILD/php-pecl-parsekit-1.3.0/parsekit.c:385:51: error: 'zend_op_array' has no member named 'done_pass_two'
  add_assoc_bool(return_value, "done_pass_two", ops->done_pass_two);
                                                   ^
/usr/include/php/Zend/zend_API.h:387:92: note: in definition of macro 'add_assoc_bool'
 #define add_assoc_bool(__arg, __key, __b) add_assoc_bool_ex(__arg, __key, strlen(__key)+1, __b)
                                                                                            ^
/tmp/B.f73e5564-3c09-42e6-a75b-fce158480d3d/BUILD/php-pecl-parsekit-1.3.0/parsekit.c:416:9: error: 'zend_op_array' has no member named 'start_op'
  if (ops->start_op) {
         ^
/tmp/B.f73e5564-3c09-42e6-a75b-fce158480d3d/BUILD/php-pecl-parsekit-1.3.0/parsekit.c:419:53: error: 'zend_op_array' has no member named 'start_op'
   snprintf(sop, sizeof(sop), "%X", (unsigned int)ops->start_op); 
                                                     ^
/tmp/B.f73e5564-3c09-42e6-a75b-fce158480d3d/BUILD/php-pecl-parsekit-1.3.0/parsekit.c:426:3: warning: passing argument 4 of 'add_assoc_string_ex' discards 'const' qualifier from pointer target type [enabled by default]
   add_assoc_string(return_value, "filename", ops->filename, 1);
   ^
In file included from /usr/include/php/main/php.h:38:0,
                 from /tmp/B.f73e5564-3c09-42e6-a75b-fce158480d3d/BUILD/php-pecl-parsekit-1.3.0/parsekit.c:25:
/usr/include/php/Zend/zend_API.h:381:14: note: expected 'char *' but argument is of type 'const char *'
 ZEND_API int add_assoc_string_ex(zval *arg, const char *key, uint key_len, char *str, int duplicate);
              ^
/tmp/B.f73e5564-3c09-42e6-a75b-fce158480d3d/BUILD/php-pecl-parsekit-1.3.0/parsekit.c:434:45: error: 'zend_op_array' has no member named 'size'
  for(op = ops->opcodes, i = 0; op && i < ops->size; op++, i++) {
                                             ^
/tmp/B.f73e5564-3c09-42e6-a75b-fce158480d3d/BUILD/php-pecl-parsekit-1.3.0/parsekit.c: In function 'php_parsekit_parse_node_simple':
/tmp/B.f73e5564-3c09-42e6-a75b-fce158480d3d/BUILD/php-pecl-parsekit-1.3.0/parsekit.c:450:14: error: 'union <anonymous>' has no member named 'var'
   if (node->u.var) {
              ^
/tmp/B.f73e5564-3c09-42e6-a75b-fce158480d3d/BUILD/php-pecl-parsekit-1.3.0/parsekit.c:452:15: error: 'union <anonymous>' has no member named 'jmp_addr'
    if (node->u.jmp_addr >= oparray->opcodes &&
               ^
/tmp/B.f73e5564-3c09-42e6-a75b-fce158480d3d/BUILD/php-pecl-parsekit-1.3.0/parsekit.c:453:12: error: 'union <anonymous>' has no member named 'jmp_addr'
     node->u.jmp_addr <= (oparray->opcodes + (sizeof(zend_op) * oparray->size))) 
            ^
/tmp/B.f73e5564-3c09-42e6-a75b-fce158480d3d/BUILD/php-pecl-parsekit-1.3.0/parsekit.c:453:71: error: 'zend_op_array' has no member named 'size'
     node->u.jmp_addr <= (oparray->opcodes + (sizeof(zend_op) * oparray->size))) 
                                                                       ^
/tmp/B.f73e5564-3c09-42e6-a75b-fce158480d3d/BUILD/php-pecl-parsekit-1.3.0/parsekit.c:455:37: error: 'union <anonymous>' has no member named 'jmp_addr'
     spprintf(pret, 0, "#%d", node->u.jmp_addr - oparray->opcodes);
                                     ^
/tmp/B.f73e5564-3c09-42e6-a75b-fce158480d3d/BUILD/php-pecl-parsekit-1.3.0/parsekit.c:460:38: error: 'union <anonymous>' has no member named 'var'
     spprintf(pret, 0, "0x%X", node->u.var);
                                      ^
/tmp/B.f73e5564-3c09-42e6-a75b-fce158480d3d/BUILD/php-pecl-parsekit-1.3.0/parsekit.c:517:36: error: 'union <anonymous>' has no member named 'var'
  spprintf(pret, 0, "T(%d)", node->u.var / sizeof(temp_variable));
                                    ^
/tmp/B.f73e5564-3c09-42e6-a75b-fce158480d3d/BUILD/php-pecl-parsekit-1.3.0/parsekit.c: In function 'php_parsekit_parse_op_array_simple':
/tmp/B.f73e5564-3c09-42e6-a75b-fce158480d3d/BUILD/php-pecl-parsekit-1.3.0/parsekit.c:531:46: error: 'zend_op_array' has no member named 'size'
  for (op = ops->opcodes, i = 0; op && i < ops->size; op++, i++) {
                                              ^
/tmp/B.f73e5564-3c09-42e6-a75b-fce158480d3d/BUILD/php-pecl-parsekit-1.3.0/parsekit.c:535:3: warning: passing argument 3 of 'php_parsekit_parse_node_simple' from incompatible pointer type [enabled by default]
   if (php_parsekit_parse_node_simple(&result, ops, &(op->result), ops TSRMLS_CC)) {
   ^
/tmp/B.f73e5564-3c09-42e6-a75b-fce158480d3d/BUILD/php-pecl-parsekit-1.3.0/parsekit.c:447:12: note: expected 'struct znode *' but argument is of type 'union znode_op *'
 static int php_parsekit_parse_node_simple(char **pret, zend_op_array *op_array, znode *node, zend_op_array *oparray TSRMLS_DC)
            ^
/tmp/B.f73e5564-3c09-42e6-a75b-fce158480d3d/BUILD/php-pecl-parsekit-1.3.0/parsekit.c:538:3: warning: passing argument 3 of 'php_parsekit_parse_node_simple' from incompatible pointer type [enabled by default]
   if (php_parsekit_parse_node_simple(&op1, ops, &(op->op1), ops TSRMLS_CC)) {
   ^
/tmp/B.f73e5564-3c09-42e6-a75b-fce158480d3d/BUILD/php-pecl-parsekit-1.3.0/parsekit.c:447:12: note: expected 'struct znode *' but argument is of type 'union znode_op *'
 static int php_parsekit_parse_node_simple(char **pret, zend_op_array *op_array, znode *node, zend_op_array *oparray TSRMLS_DC)
            ^
/tmp/B.f73e5564-3c09-42e6-a75b-fce158480d3d/BUILD/php-pecl-parsekit-1.3.0/parsekit.c:541:3: warning: passing argument 3 of 'php_parsekit_parse_node_simple' from incompatible pointer type [enabled by default]
   if (php_parsekit_parse_node_simple(&op2, ops, &(op->op2), ops TSRMLS_CC)) {
   ^
/tmp/B.f73e5564-3c09-42e6-a75b-fce158480d3d/BUILD/php-pecl-parsekit-1.3.0/parsekit.c:447:12: note: expected 'struct znode *' but argument is of type 'union znode_op *'
 static int php_parsekit_parse_node_simple(char **pret, zend_op_array *op_array, znode *node, zend_op_array *oparray TSRMLS_DC)
            ^
/tmp/B.f73e5564-3c09-42e6-a75b-fce158480d3d/BUILD/php-pecl-parsekit-1.3.0/parsekit.c: In function 'php_parsekit_parse_class_entry':
/tmp/B.f73e5564-3c09-42e6-a75b-fce158480d3d/BUILD/php-pecl-parsekit-1.3.0/parsekit.c:630:2: warning: passing argument 4 of 'add_assoc_stringl_ex' discards 'const' qualifier from pointer target type [enabled by default]
  add_assoc_stringl(return_value, "name", ce->name, ce->name_length, 1);
  ^
In file included from /usr/include/php/main/php.h:38:0,
                 from /tmp/B.f73e5564-3c09-42e6-a75b-fce158480d3d/BUILD/php-pecl-parsekit-1.3.0/parsekit.c:25:
/usr/include/php/Zend/zend_API.h:382:14: note: expected 'char *' but argument is of type 'const char *'
 ZEND_API int add_assoc_stringl_ex(zval *arg, const char *key, uint key_len, char *str, uint length, int duplicate);
              ^
/tmp/B.f73e5564-3c09-42e6-a75b-fce158480d3d/BUILD/php-pecl-parsekit-1.3.0/parsekit.c:632:3: warning: passing argument 4 of 'add_assoc_stringl_ex' discards 'const' qualifier from pointer target type [enabled by default]
   add_assoc_stringl(return_value, "parent", ce->parent->name, ce->parent->name_length, 1);
   ^
In file included from /usr/include/php/main/php.h:38:0,
                 from /tmp/B.f73e5564-3c09-42e6-a75b-fce158480d3d/BUILD/php-pecl-parsekit-1.3.0/parsekit.c:25:
/usr/include/php/Zend/zend_API.h:382:14: note: expected 'char *' but argument is of type 'const char *'
 ZEND_API int add_assoc_stringl_ex(zval *arg, const char *key, uint key_len, char *str, uint length, int duplicate);
              ^
/tmp/B.f73e5564-3c09-42e6-a75b-fce158480d3d/BUILD/php-pecl-parsekit-1.3.0/parsekit.c:636:54: error: 'zend_class_entry' has no member named 'constants_updated'
  add_assoc_bool(return_value, "constants_updated", ce->constants_updated);
                                                      ^
/usr/include/php/Zend/zend_API.h:387:92: note: in definition of macro 'add_assoc_bool'
 #define add_assoc_bool(__arg, __key, __b) add_assoc_bool_ex(__arg, __key, strlen(__key)+1, __b)
                                                                                            ^
/tmp/B.f73e5564-3c09-42e6-a75b-fce158480d3d/BUILD/php-pecl-parsekit-1.3.0/parsekit.c:643:3: warning: passing argument 4 of 'add_assoc_string_ex' discards 'const' qualifier from pointer target type [enabled by default]
   add_assoc_string(return_value, "constructor", ce->constructor->common.function_name, 1);
   ^
In file included from /usr/include/php/main/php.h:38:0,
                 from /tmp/B.f73e5564-3c09-42e6-a75b-fce158480d3d/BUILD/php-pecl-parsekit-1.3.0/parsekit.c:25:
/usr/include/php/Zend/zend_API.h:381:14: note: expected 'char *' but argument is of type 'const char *'
 ZEND_API int add_assoc_string_ex(zval *arg, const char *key, uint key_len, char *str, int duplicate);
              ^
/tmp/B.f73e5564-3c09-42e6-a75b-fce158480d3d/BUILD/php-pecl-parsekit-1.3.0/parsekit.c:649:3: warning: passing argument 4 of 'add_assoc_string_ex' discards 'const' qualifier from pointer target type [enabled by default]
   add_assoc_string(return_value, "clone", ce->clone->common.function_name, 1);
   ^
In file included from /usr/include/php/main/php.h:38:0,
                 from /tmp/B.f73e5564-3c09-42e6-a75b-fce158480d3d/BUILD/php-pecl-parsekit-1.3.0/parsekit.c:25:
/usr/include/php/Zend/zend_API.h:381:14: note: expected 'char *' but argument is of type 'const char *'
 ZEND_API int add_assoc_string_ex(zval *arg, const char *key, uint key_len, char *str, int duplicate);
              ^
/tmp/B.f73e5564-3c09-42e6-a75b-fce158480d3d/BUILD/php-pecl-parsekit-1.3.0/parsekit.c:655:3: warning: passing argument 4 of 'add_assoc_string_ex' discards 'const' qualifier from pointer target type [enabled by default]
   add_assoc_string(return_value, "__get", ce->__get->common.function_name, 1);
   ^
In file included from /usr/include/php/main/php.h:38:0,
                 from /tmp/B.f73e5564-3c09-42e6-a75b-fce158480d3d/BUILD/php-pecl-parsekit-1.3.0/parsekit.c:25:
/usr/include/php/Zend/zend_API.h:381:14: note: expected 'char *' but argument is of type 'const char *'
 ZEND_API int add_assoc_string_ex(zval *arg, const char *key, uint key_len, char *str, int duplicate);
              ^
/tmp/B.f73e5564-3c09-42e6-a75b-fce158480d3d/BUILD/php-pecl-parsekit-1.3.0/parsekit.c:661:3: warning: passing argument 4 of 'add_assoc_string_ex' discards 'const' qualifier from pointer target type [enabled by default]
   add_assoc_string(return_value, "__set", ce->__set->common.function_name, 1);
   ^
In file included from /usr/include/php/main/php.h:38:0,
                 from /tmp/B.f73e5564-3c09-42e6-a75b-fce158480d3d/BUILD/php-pecl-parsekit-1.3.0/parsekit.c:25:
/usr/include/php/Zend/zend_API.h:381:14: note: expected 'char *' but argument is of type 'const char *'
 ZEND_API int add_assoc_string_ex(zval *arg, const char *key, uint key_len, char *str, int duplicate);
              ^
/tmp/B.f73e5564-3c09-42e6-a75b-fce158480d3d/BUILD/php-pecl-parsekit-1.3.0/parsekit.c:667:3: warning: passing argument 4 of 'add_assoc_string_ex' discards 'const' qualifier from pointer target type [enabled by default]
   add_assoc_string(return_value, "__call", ce->__call->common.function_name, 1);
   ^
In file included from /usr/include/php/main/php.h:38:0,
                 from /tmp/B.f73e5564-3c09-42e6-a75b-fce158480d3d/BUILD/php-pecl-parsekit-1.3.0/parsekit.c:25:
/usr/include/php/Zend/zend_API.h:381:14: note: expected 'char *' but argument is of type 'const char *'
 ZEND_API int add_assoc_string_ex(zval *arg, const char *key, uint key_len, char *str, int duplicate);
              ^
/tmp/B.f73e5564-3c09-42e6-a75b-fce158480d3d/BUILD/php-pecl-parsekit-1.3.0/parsekit.c:685:4: warning: passing argument 4 of 'add_assoc_stringl_ex' discards 'const' qualifier from pointer target type [enabled by default]
    add_assoc_stringl(tmp_zval, "name", property_info->name, property_info->name_length, 1);
    ^
In file included from /usr/include/php/main/php.h:38:0,
                 from /tmp/B.f73e5564-3c09-42e6-a75b-fce158480d3d/BUILD/php-pecl-parsekit-1.3.0/parsekit.c:25:
/usr/include/php/Zend/zend_API.h:382:14: note: expected 'char *' but argument is of type 'const char *'
 ZEND_API int add_assoc_stringl_ex(zval *arg, const char *key, uint key_len, char *str, uint length, int duplicate);
              ^
/tmp/B.f73e5564-3c09-42e6-a75b-fce158480d3d/BUILD/php-pecl-parsekit-1.3.0/parsekit.c:694:8: error: 'zend_class_entry' has no member named 'static_members'
  if (ce->static_members && zend_hash_num_elements(ce->static_members) > 0) {
        ^
/tmp/B.f73e5564-3c09-42e6-a75b-fce158480d3d/BUILD/php-pecl-parsekit-1.3.0/parsekit.c:694:53: error: 'zend_class_entry' has no member named 'static_members'
  if (ce->static_members && zend_hash_num_elements(ce->static_members) > 0) {
                                                     ^
/tmp/B.f73e5564-3c09-42e6-a75b-fce158480d3d/BUILD/php-pecl-parsekit-1.3.0/parsekit.c:699:38: error: 'zend_class_entry' has no member named 'static_members'
   zend_hash_copy(HASH_OF(tmpzval), ce->static_members, (copy_ctor_func_t) zval_add_ref, (void *) &tmp_zval, sizeof(zval *)); 
                                      ^
In file included from /usr/include/php/main/php.h:38:0,
                 from /tmp/B.f73e5564-3c09-42e6-a75b-fce158480d3d/BUILD/php-pecl-parsekit-1.3.0/parsekit.c:25:
/tmp/B.f73e5564-3c09-42e6-a75b-fce158480d3d/BUILD/php-pecl-parsekit-1.3.0/parsekit.c:727:47: error: 'zend_class_entry' has no member named 'filename'
  add_assoc_string(return_value, "filename", ce->filename, 1);
                                               ^
/usr/include/php/Zend/zend_API.h:390:111: note: in definition of macro 'add_assoc_string'
 #define add_assoc_string(__arg, __key, __str, __duplicate) add_assoc_string_ex(__arg, __key, strlen(__key)+1, __str, __duplicate)
                                                                                                               ^
/tmp/B.f73e5564-3c09-42e6-a75b-fce158480d3d/BUILD/php-pecl-parsekit-1.3.0/parsekit.c:728:47: error: 'zend_class_entry' has no member named 'line_start'
  add_assoc_long(return_value, "line_start", ce->line_start);
                                               ^
/usr/include/php/Zend/zend_API.h:385:92: note: in definition of macro 'add_assoc_long'
 #define add_assoc_long(__arg, __key, __n) add_assoc_long_ex(__arg, __key, strlen(__key)+1, __n)
                                                                                            ^
/tmp/B.f73e5564-3c09-42e6-a75b-fce158480d3d/BUILD/php-pecl-parsekit-1.3.0/parsekit.c:729:45: error: 'zend_class_entry' has no member named 'line_end'
  add_assoc_long(return_value, "line_end", ce->line_end);
                                             ^
/usr/include/php/Zend/zend_API.h:385:92: note: in definition of macro 'add_assoc_long'
 #define add_assoc_long(__arg, __key, __n) add_assoc_long_ex(__arg, __key, strlen(__key)+1, __n)
                                                                                            ^
/tmp/B.f73e5564-3c09-42e6-a75b-fce158480d3d/BUILD/php-pecl-parsekit-1.3.0/parsekit.c:730:8: error: 'zend_class_entry' has no member named 'doc_comment'
  if (ce->doc_comment) {
        ^
In file included from /usr/include/php/main/php.h:38:0,
                 from /tmp/B.f73e5564-3c09-42e6-a75b-fce158480d3d/BUILD/php-pecl-parsekit-1.3.0/parsekit.c:25:
/tmp/B.f73e5564-3c09-42e6-a75b-fce158480d3d/BUILD/php-pecl-parsekit-1.3.0/parsekit.c:731:52: error: 'zend_class_entry' has no member named 'doc_comment'
   add_assoc_stringl(return_value, "doc_comment", ce->doc_comment, ce->doc_comment_len, 1);
                                                    ^
/usr/include/php/Zend/zend_API.h:391:123: note: in definition of macro 'add_assoc_stringl'
 #define add_assoc_stringl(__arg, __key, __str, __length, __duplicate) add_assoc_stringl_ex(__arg, __key, strlen(__key)+1, __str, __length, __duplicate)
                                                                                                                           ^
/tmp/B.f73e5564-3c09-42e6-a75b-fce158480d3d/BUILD/php-pecl-parsekit-1.3.0/parsekit.c:731:69: error: 'zend_class_entry' has no member named 'doc_comment_len'
   add_assoc_stringl(return_value, "doc_comment", ce->doc_comment, ce->doc_comment_len, 1);
                                                                     ^
/usr/include/php/Zend/zend_API.h:391:130: note: in definition of macro 'add_assoc_stringl'
 #define add_assoc_stringl(__arg, __key, __str, __length, __duplicate) add_assoc_stringl_ex(__arg, __key, strlen(__key)+1, __str, __length, __duplicate)
                                                                                                                                  ^
/tmp/B.f73e5564-3c09-42e6-a75b-fce158480d3d/BUILD/php-pecl-parsekit-1.3.0/parsekit.c:736:2: warning: passing argument 1 of 'zval_refcount_p' from incompatible pointer type [enabled by default]
  add_assoc_long(return_value, "refcount", Z_REFCOUNT_P(ce));
  ^
In file included from /usr/include/php/main/php.h:34:0,
                 from /tmp/B.f73e5564-3c09-42e6-a75b-fce158480d3d/BUILD/php-pecl-parsekit-1.3.0/parsekit.c:25:
/usr/include/php/Zend/zend.h:396:37: note: expected 'struct zval *' but argument is of type 'struct zend_class_entry *'
 static zend_always_inline zend_uint zval_refcount_p(zval* pz) {
                                     ^
/tmp/B.f73e5564-3c09-42e6-a75b-fce158480d3d/BUILD/php-pecl-parsekit-1.3.0/parsekit.c:760:33: error: 'zend_class_entry' has no member named 'default_properties'
  if (zend_hash_num_elements(&(ce->default_properties)) > 0) {
                                 ^
/tmp/B.f73e5564-3c09-42e6-a75b-fce158480d3d/BUILD/php-pecl-parsekit-1.3.0/parsekit.c:765:40: error: 'zend_class_entry' has no member named 'default_properties'
   zend_hash_copy(HASH_OF(tmpzval), &(ce->default_properties), (copy_ctor_func_t) zval_add_ref, (void *) &tmp_zval, sizeof(zval *)); 
                                        ^
/tmp/B.f73e5564-3c09-42e6-a75b-fce158480d3d/BUILD/php-pecl-parsekit-1.3.0/parsekit.c: In function 'zif_parsekit_func_arginfo':
/tmp/B.f73e5564-3c09-42e6-a75b-fce158480d3d/BUILD/php-pecl-parsekit-1.3.0/parsekit.c:1048:11: warning: assignment discards 'const' qualifier from pointer target type [enabled by default]
     class = Z_OBJCE_PP(classname)->name;
           ^
/tmp/B.f73e5564-3c09-42e6-a75b-fce158480d3d/BUILD/php-pecl-parsekit-1.3.0/parsekit.c: At top level:
/tmp/B.f73e5564-3c09-42e6-a75b-fce158480d3d/BUILD/php-pecl-parsekit-1.3.0/parsekit.c:1134:1: error: unknown type name 'function_entry'
 function_entry parsekit_functions[] = {
 ^
/tmp/B.f73e5564-3c09-42e6-a75b-fce158480d3d/BUILD/php-pecl-parsekit-1.3.0/parsekit.c:1135:2: warning: braces around scalar initializer [enabled by default]
  PHP_FE(parsekit_compile_string,   php_parsekit_second_arg_force_ref)
  ^
/tmp/B.f73e5564-3c09-42e6-a75b-fce158480d3d/BUILD/php-pecl-parsekit-1.3.0/parsekit.c:1135:2: warning: (near initialization for 'parsekit_functions[0]') [enabled by default]
/tmp/B.f73e5564-3c09-42e6-a75b-fce158480d3d/BUILD/php-pecl-parsekit-1.3.0/parsekit.c:1135:2: warning: initialization makes integer from pointer without a cast [enabled by default]
/tmp/B.f73e5564-3c09-42e6-a75b-fce158480d3d/BUILD/php-pecl-parsekit-1.3.0/parsekit.c:1135:2: warning: (near initialization for 'parsekit_functions[0]') [enabled by default]
/tmp/B.f73e5564-3c09-42e6-a75b-fce158480d3d/BUILD/php-pecl-parsekit-1.3.0/parsekit.c:1135:2: warning: excess elements in scalar initializer [enabled by default]
/tmp/B.f73e5564-3c09-42e6-a75b-fce158480d3d/BUILD/php-pecl-parsekit-1.3.0/parsekit.c:1135:2: warning: (near initialization for 'parsekit_functions[0]') [enabled by default]
/tmp/B.f73e5564-3c09-42e6-a75b-fce158480d3d/BUILD/php-pecl-parsekit-1.3.0/parsekit.c:1135:2: warning: excess elements in scalar initializer [enabled by default]
/tmp/B.f73e5564-3c09-42e6-a75b-fce158480d3d/BUILD/php-pecl-parsekit-1.3.0/parsekit.c:1135:2: warning: (near initialization for 'parsekit_functions[0]') [enabled by default]
In file included from /usr/include/php/main/php.h:38:0,
                 from /tmp/B.f73e5564-3c09-42e6-a75b-fce158480d3d/BUILD/php-pecl-parsekit-1.3.0/parsekit.c:25:
/usr/include/php/Zend/zend_API.h:71:129: warning: excess elements in scalar initializer [enabled by default]
 #define ZEND_FENTRY(zend_name, name, arg_info, flags) { #zend_name, name, arg_info, (zend_uint) (sizeof(arg_info)/sizeof(struct _zend_arg_info)-1), flags },
                                                                                                                                 ^
/usr/include/php/Zend/zend_API.h:77:38: note: in expansion of macro 'ZEND_FENTRY'
 #define ZEND_FE(name, arg_info)      ZEND_FENTRY(name, ZEND_FN(name), arg_info, 0)
                                      ^
/usr/include/php/main/php.h:349:18: note: in expansion of macro 'ZEND_FE'
 #define PHP_FE   ZEND_FE
                  ^
/tmp/B.f73e5564-3c09-42e6-a75b-fce158480d3d/BUILD/php-pecl-parsekit-1.3.0/parsekit.c:1135:2: note: in expansion of macro 'PHP_FE'
  PHP_FE(parsekit_compile_string,   php_parsekit_second_arg_force_ref)
  ^
/usr/include/php/Zend/zend_API.h:71:129: warning: (near initialization for 'parsekit_functions[0]') [enabled by default]
 #define ZEND_FENTRY(zend_name, name, arg_info, flags) { #zend_name, name, arg_info, (zend_uint) (sizeof(arg_info)/sizeof(struct _zend_arg_info)-1), flags },
                                                                                                                                 ^
/usr/include/php/Zend/zend_API.h:77:38: note: in expansion of macro 'ZEND_FENTRY'
 #define ZEND_FE(name, arg_info)      ZEND_FENTRY(name, ZEND_FN(name), arg_info, 0)
                                      ^
/usr/include/php/main/php.h:349:18: note: in expansion of macro 'ZEND_FE'
 #define PHP_FE   ZEND_FE
                  ^
/tmp/B.f73e5564-3c09-42e6-a75b-fce158480d3d/BUILD/php-pecl-parsekit-1.3.0/parsekit.c:1135:2: note: in expansion of macro 'PHP_FE'
  PHP_FE(parsekit_compile_string,   php_parsekit_second_arg_force_ref)
  ^
/usr/include/php/Zend/zend_API.h:71:129: warning: excess elements in scalar initializer [enabled by default]
 #define ZEND_FENTRY(zend_name, name, arg_info, flags) { #zend_name, name, arg_info, (zend_uint) (sizeof(arg_info)/sizeof(struct _zend_arg_info)-1), flags },
                                                                                                                                 ^
/usr/include/php/Zend/zend_API.h:77:38: note: in expansion of macro 'ZEND_FENTRY'
 #define ZEND_FE(name, arg_info)      ZEND_FENTRY(name, ZEND_FN(name), arg_info, 0)
                                      ^
/usr/include/php/main/php.h:349:18: note: in expansion of macro 'ZEND_FE'
 #define PHP_FE   ZEND_FE
                  ^
/tmp/B.f73e5564-3c09-42e6-a75b-fce158480d3d/BUILD/php-pecl-parsekit-1.3.0/parsekit.c:1135:2: note: in expansion of macro 'PHP_FE'
  PHP_FE(parsekit_compile_string,   php_parsekit_second_arg_force_ref)
  ^
/usr/include/php/Zend/zend_API.h:71:129: warning: (near initialization for 'parsekit_functions[0]') [enabled by default]
 #define ZEND_FENTRY(zend_name, name, arg_info, flags) { #zend_name, name, arg_info, (zend_uint) (sizeof(arg_info)/sizeof(struct _zend_arg_info)-1), flags },
                                                                                                                                 ^
/usr/include/php/Zend/zend_API.h:77:38: note: in expansion of macro 'ZEND_FENTRY'
 #define ZEND_FE(name, arg_info)      ZEND_FENTRY(name, ZEND_FN(name), arg_info, 0)
                                      ^
/usr/include/php/main/php.h:349:18: note: in expansion of macro 'ZEND_FE'
 #define PHP_FE   ZEND_FE
                  ^
/tmp/B.f73e5564-3c09-42e6-a75b-fce158480d3d/BUILD/php-pecl-parsekit-1.3.0/parsekit.c:1135:2: note: in expansion of macro 'PHP_FE'
  PHP_FE(parsekit_compile_string,   php_parsekit_second_arg_force_ref)
  ^
/tmp/B.f73e5564-3c09-42e6-a75b-fce158480d3d/BUILD/php-pecl-parsekit-1.3.0/parsekit.c:1136:2: warning: braces around scalar initializer [enabled by default]
  PHP_FE(parsekit_compile_file,   php_parsekit_second_arg_force_ref)
  ^
/tmp/B.f73e5564-3c09-42e6-a75b-fce158480d3d/BUILD/php-pecl-parsekit-1.3.0/parsekit.c:1136:2: warning: (near initialization for 'parsekit_functions[1]') [enabled by default]
/tmp/B.f73e5564-3c09-42e6-a75b-fce158480d3d/BUILD/php-pecl-parsekit-1.3.0/parsekit.c:1136:2: warning: initialization makes integer from pointer without a cast [enabled by default]
/tmp/B.f73e5564-3c09-42e6-a75b-fce158480d3d/BUILD/php-pecl-parsekit-1.3.0/parsekit.c:1136:2: warning: (near initialization for 'parsekit_functions[1]') [enabled by default]
/tmp/B.f73e5564-3c09-42e6-a75b-fce158480d3d/BUILD/php-pecl-parsekit-1.3.0/parsekit.c:1136:2: warning: excess elements in scalar initializer [enabled by default]
/tmp/B.f73e5564-3c09-42e6-a75b-fce158480d3d/BUILD/php-pecl-parsekit-1.3.0/parsekit.c:1136:2: warning: (near initialization for 'parsekit_functions[1]') [enabled by default]
/tmp/B.f73e5564-3c09-42e6-a75b-fce158480d3d/BUILD/php-pecl-parsekit-1.3.0/parsekit.c:1136:2: warning: excess elements in scalar initializer [enabled by default]
/tmp/B.f73e5564-3c09-42e6-a75b-fce158480d3d/BUILD/php-pecl-parsekit-1.3.0/parsekit.c:1136:2: warning: (near initialization for 'parsekit_functions[1]') [enabled by default]
In file included from /usr/include/php/main/php.h:38:0,
                 from /tmp/B.f73e5564-3c09-42e6-a75b-fce158480d3d/BUILD/php-pecl-parsekit-1.3.0/parsekit.c:25:
/usr/include/php/Zend/zend_API.h:71:129: warning: excess elements in scalar initializer [enabled by default]
 #define ZEND_FENTRY(zend_name, name, arg_info, flags) { #zend_name, name, arg_info, (zend_uint) (sizeof(arg_info)/sizeof(struct _zend_arg_info)-1), flags },
                                                                                                                                 ^
/usr/include/php/Zend/zend_API.h:77:38: note: in expansion of macro 'ZEND_FENTRY'
 #define ZEND_FE(name, arg_info)      ZEND_FENTRY(name, ZEND_FN(name), arg_info, 0)
                                      ^
/usr/include/php/main/php.h:349:18: note: in expansion of macro 'ZEND_FE'
 #define PHP_FE   ZEND_FE
                  ^
/tmp/B.f73e5564-3c09-42e6-a75b-fce158480d3d/BUILD/php-pecl-parsekit-1.3.0/parsekit.c:1136:2: note: in expansion of macro 'PHP_FE'
  PHP_FE(parsekit_compile_file,   php_parsekit_second_arg_force_ref)
  ^
/usr/include/php/Zend/zend_API.h:71:129: warning: (near initialization for 'parsekit_functions[1]') [enabled by default]
 #define ZEND_FENTRY(zend_name, name, arg_info, flags) { #zend_name, name, arg_info, (zend_uint) (sizeof(arg_info)/sizeof(struct _zend_arg_info)-1), flags },
                                                                                                                                 ^
/usr/include/php/Zend/zend_API.h:77:38: note: in expansion of macro 'ZEND_FENTRY'
 #define ZEND_FE(name, arg_info)      ZEND_FENTRY(name, ZEND_FN(name), arg_info, 0)
                                      ^
/usr/include/php/main/php.h:349:18: note: in expansion of macro 'ZEND_FE'
 #define PHP_FE   ZEND_FE
                  ^
/tmp/B.f73e5564-3c09-42e6-a75b-fce158480d3d/BUILD/php-pecl-parsekit-1.3.0/parsekit.c:1136:2: note: in expansion of macro 'PHP_FE'
  PHP_FE(parsekit_compile_file,   php_parsekit_second_arg_force_ref)
  ^
/usr/include/php/Zend/zend_API.h:71:129: warning: excess elements in scalar initializer [enabled by default]
 #define ZEND_FENTRY(zend_name, name, arg_info, flags) { #zend_name, name, arg_info, (zend_uint) (sizeof(arg_info)/sizeof(struct _zend_arg_info)-1), flags },
                                                                                                                                 ^
/usr/include/php/Zend/zend_API.h:77:38: note: in expansion of macro 'ZEND_FENTRY'
 #define ZEND_FE(name, arg_info)      ZEND_FENTRY(name, ZEND_FN(name), arg_info, 0)
                                      ^
/usr/include/php/main/php.h:349:18: note: in expansion of macro 'ZEND_FE'
 #define PHP_FE   ZEND_FE
                  ^
/tmp/B.f73e5564-3c09-42e6-a75b-fce158480d3d/BUILD/php-pecl-parsekit-1.3.0/parsekit.c:1136:2: note: in expansion of macro 'PHP_FE'
  PHP_FE(parsekit_compile_file,   php_parsekit_second_arg_force_ref)
  ^
/usr/include/php/Zend/zend_API.h:71:129: warning: (near initialization for 'parsekit_functions[1]') [enabled by default]
 #define ZEND_FENTRY(zend_name, name, arg_info, flags) { #zend_name, name, arg_info, (zend_uint) (sizeof(arg_info)/sizeof(struct _zend_arg_info)-1), flags },
                                                                                                                                 ^
/usr/include/php/Zend/zend_API.h:77:38: note: in expansion of macro 'ZEND_FENTRY'
 #define ZEND_FE(name, arg_info)      ZEND_FENTRY(name, ZEND_FN(name), arg_info, 0)
                                      ^
/usr/include/php/main/php.h:349:18: note: in expansion of macro 'ZEND_FE'
 #define PHP_FE   ZEND_FE
                  ^
/tmp/B.f73e5564-3c09-42e6-a75b-fce158480d3d/BUILD/php-pecl-parsekit-1.3.0/parsekit.c:1136:2: note: in expansion of macro 'PHP_FE'
  PHP_FE(parsekit_compile_file,   php_parsekit_second_arg_force_ref)
  ^
/tmp/B.f73e5564-3c09-42e6-a75b-fce158480d3d/BUILD/php-pecl-parsekit-1.3.0/parsekit.c:1137:2: warning: braces around scalar initializer [enabled by default]
  PHP_FE(parsekit_opcode_flags,   NULL)
  ^
/tmp/B.f73e5564-3c09-42e6-a75b-fce158480d3d/BUILD/php-pecl-parsekit-1.3.0/parsekit.c:1137:2: warning: (near initialization for 'parsekit_functions[2]') [enabled by default]
/tmp/B.f73e5564-3c09-42e6-a75b-fce158480d3d/BUILD/php-pecl-parsekit-1.3.0/parsekit.c:1137:2: warning: initialization makes integer from pointer without a cast [enabled by default]
/tmp/B.f73e5564-3c09-42e6-a75b-fce158480d3d/BUILD/php-pecl-parsekit-1.3.0/parsekit.c:1137:2: warning: (near initialization for 'parsekit_functions[2]') [enabled by default]
/tmp/B.f73e5564-3c09-42e6-a75b-fce158480d3d/BUILD/php-pecl-parsekit-1.3.0/parsekit.c:1137:2: warning: excess elements in scalar initializer [enabled by default]
/tmp/B.f73e5564-3c09-42e6-a75b-fce158480d3d/BUILD/php-pecl-parsekit-1.3.0/parsekit.c:1137:2: warning: (near initialization for 'parsekit_functions[2]') [enabled by default]
/tmp/B.f73e5564-3c09-42e6-a75b-fce158480d3d/BUILD/php-pecl-parsekit-1.3.0/parsekit.c:1137:2: warning: excess elements in scalar initializer [enabled by default]
/tmp/B.f73e5564-3c09-42e6-a75b-fce158480d3d/BUILD/php-pecl-parsekit-1.3.0/parsekit.c:1137:2: warning: (near initialization for 'parsekit_functions[2]') [enabled by default]
In file included from /usr/include/php/main/php.h:38:0,
                 from /tmp/B.f73e5564-3c09-42e6-a75b-fce158480d3d/BUILD/php-pecl-parsekit-1.3.0/parsekit.c:25:
/usr/include/php/Zend/zend_API.h:71:129: warning: excess elements in scalar initializer [enabled by default]
 #define ZEND_FENTRY(zend_name, name, arg_info, flags) { #zend_name, name, arg_info, (zend_uint) (sizeof(arg_info)/sizeof(struct _zend_arg_info)-1), flags },
                                                                                                                                 ^
/usr/include/php/Zend/zend_API.h:77:38: note: in expansion of macro 'ZEND_FENTRY'
 #define ZEND_FE(name, arg_info)      ZEND_FENTRY(name, ZEND_FN(name), arg_info, 0)
                                      ^
/usr/include/php/main/php.h:349:18: note: in expansion of macro 'ZEND_FE'
 #define PHP_FE   ZEND_FE
                  ^
/tmp/B.f73e5564-3c09-42e6-a75b-fce158480d3d/BUILD/php-pecl-parsekit-1.3.0/parsekit.c:1137:2: note: in expansion of macro 'PHP_FE'
  PHP_FE(parsekit_opcode_flags,   NULL)
  ^
/usr/include/php/Zend/zend_API.h:71:129: warning: (near initialization for 'parsekit_functions[2]') [enabled by default]
 #define ZEND_FENTRY(zend_name, name, arg_info, flags) { #zend_name, name, arg_info, (zend_uint) (sizeof(arg_info)/sizeof(struct _zend_arg_info)-1), flags },
                                                                                                                                 ^
/usr/include/php/Zend/zend_API.h:77:38: note: in expansion of macro 'ZEND_FENTRY'
 #define ZEND_FE(name, arg_info)      ZEND_FENTRY(name, ZEND_FN(name), arg_info, 0)
                                      ^
/usr/include/php/main/php.h:349:18: note: in expansion of macro 'ZEND_FE'
 #define PHP_FE   ZEND_FE
                  ^
/tmp/B.f73e5564-3c09-42e6-a75b-fce158480d3d/BUILD/php-pecl-parsekit-1.3.0/parsekit.c:1137:2: note: in expansion of macro 'PHP_FE'
  PHP_FE(parsekit_opcode_flags,   NULL)
  ^
/usr/include/php/Zend/zend_API.h:71:129: warning: excess elements in scalar initializer [enabled by default]
 #define ZEND_FENTRY(zend_name, name, arg_info, flags) { #zend_name, name, arg_info, (zend_uint) (sizeof(arg_info)/sizeof(struct _zend_arg_info)-1), flags },
                                                                                                                                 ^
/usr/include/php/Zend/zend_API.h:77:38: note: in expansion of macro 'ZEND_FENTRY'
 #define ZEND_FE(name, arg_info)      ZEND_FENTRY(name, ZEND_FN(name), arg_info, 0)
                                      ^
/usr/include/php/main/php.h:349:18: note: in expansion of macro 'ZEND_FE'
 #define PHP_FE   ZEND_FE
                  ^
/tmp/B.f73e5564-3c09-42e6-a75b-fce158480d3d/BUILD/php-pecl-parsekit-1.3.0/parsekit.c:1137:2: note: in expansion of macro 'PHP_FE'
  PHP_FE(parsekit_opcode_flags,   NULL)
  ^
/usr/include/php/Zend/zend_API.h:71:129: warning: (near initialization for 'parsekit_functions[2]') [enabled by default]
 #define ZEND_FENTRY(zend_name, name, arg_info, flags) { #zend_name, name, arg_info, (zend_uint) (sizeof(arg_info)/sizeof(struct _zend_arg_info)-1), flags },
                                                                                                                                 ^
/usr/include/php/Zend/zend_API.h:77:38: note: in expansion of macro 'ZEND_FENTRY'
 #define ZEND_FE(name, arg_info)      ZEND_FENTRY(name, ZEND_FN(name), arg_info, 0)
                                      ^
/usr/include/php/main/php.h:349:18: note: in expansion of macro 'ZEND_FE'
 #define PHP_FE   ZEND_FE
                  ^
/tmp/B.f73e5564-3c09-42e6-a75b-fce158480d3d/BUILD/php-pecl-parsekit-1.3.0/parsekit.c:1137:2: note: in expansion of macro 'PHP_FE'
  PHP_FE(parsekit_opcode_flags,   NULL)
  ^
/tmp/B.f73e5564-3c09-42e6-a75b-fce158480d3d/BUILD/php-pecl-parsekit-1.3.0/parsekit.c:1138:2: warning: braces around scalar initializer [enabled by default]
  PHP_FE(parsekit_opcode_name,   NULL)
  ^
/tmp/B.f73e5564-3c09-42e6-a75b-fce158480d3d/BUILD/php-pecl-parsekit-1.3.0/parsekit.c:1138:2: warning: (near initialization for 'parsekit_functions[3]') [enabled by default]
/tmp/B.f73e5564-3c09-42e6-a75b-fce158480d3d/BUILD/php-pecl-parsekit-1.3.0/parsekit.c:1138:2: warning: initialization makes integer from pointer without a cast [enabled by default]
/tmp/B.f73e5564-3c09-42e6-a75b-fce158480d3d/BUILD/php-pecl-parsekit-1.3.0/parsekit.c:1138:2: warning: (near initialization for 'parsekit_functions[3]') [enabled by default]
/tmp/B.f73e5564-3c09-42e6-a75b-fce158480d3d/BUILD/php-pecl-parsekit-1.3.0/parsekit.c:1138:2: warning: excess elements in scalar initializer [enabled by default]
/tmp/B.f73e5564-3c09-42e6-a75b-fce158480d3d/BUILD/php-pecl-parsekit-1.3.0/parsekit.c:1138:2: warning: (near initialization for 'parsekit_functions[3]') [enabled by default]
/tmp/B.f73e5564-3c09-42e6-a75b-fce158480d3d/BUILD/php-pecl-parsekit-1.3.0/parsekit.c:1138:2: warning: excess elements in scalar initializer [enabled by default]
/tmp/B.f73e5564-3c09-42e6-a75b-fce158480d3d/BUILD/php-pecl-parsekit-1.3.0/parsekit.c:1138:2: warning: (near initialization for 'parsekit_functions[3]') [enabled by default]
In file included from /usr/include/php/main/php.h:38:0,
                 from /tmp/B.f73e5564-3c09-42e6-a75b-fce158480d3d/BUILD/php-pecl-parsekit-1.3.0/parsekit.c:25:
/usr/include/php/Zend/zend_API.h:71:129: warning: excess elements in scalar initializer [enabled by default]
 #define ZEND_FENTRY(zend_name, name, arg_info, flags) { #zend_name, name, arg_info, (zend_uint) (sizeof(arg_info)/sizeof(struct _zend_arg_info)-1), flags },
                                                                                                                                 ^
/usr/include/php/Zend/zend_API.h:77:38: note: in expansion of macro 'ZEND_FENTRY'
 #define ZEND_FE(name, arg_info)      ZEND_FENTRY(name, ZEND_FN(name), arg_info, 0)
                                      ^
/usr/include/php/main/php.h:349:18: note: in expansion of macro 'ZEND_FE'
 #define PHP_FE   ZEND_FE
                  ^
/tmp/B.f73e5564-3c09-42e6-a75b-fce158480d3d/BUILD/php-pecl-parsekit-1.3.0/parsekit.c:1138:2: note: in expansion of macro 'PHP_FE'
  PHP_FE(parsekit_opcode_name,   NULL)
  ^
/usr/include/php/Zend/zend_API.h:71:129: warning: (near initialization for 'parsekit_functions[3]') [enabled by default]
 #define ZEND_FENTRY(zend_name, name, arg_info, flags) { #zend_name, name, arg_info, (zend_uint) (sizeof(arg_info)/sizeof(struct _zend_arg_info)-1), flags },
                                                                                                                                 ^
/usr/include/php/Zend/zend_API.h:77:38: note: in expansion of macro 'ZEND_FENTRY'
 #define ZEND_FE(name, arg_info)      ZEND_FENTRY(name, ZEND_FN(name), arg_info, 0)
                                      ^
/usr/include/php/main/php.h:349:18: note: in expansion of macro 'ZEND_FE'
 #define PHP_FE   ZEND_FE
                  ^
/tmp/B.f73e5564-3c09-42e6-a75b-fce158480d3d/BUILD/php-pecl-parsekit-1.3.0/parsekit.c:1138:2: note: in expansion of macro 'PHP_FE'
  PHP_FE(parsekit_opcode_name,   NULL)
  ^
/usr/include/php/Zend/zend_API.h:71:129: warning: excess elements in scalar initializer [enabled by default]
 #define ZEND_FENTRY(zend_name, name, arg_info, flags) { #zend_name, name, arg_info, (zend_uint) (sizeof(arg_info)/sizeof(struct _zend_arg_info)-1), flags },
                                                                                                                                 ^
/usr/include/php/Zend/zend_API.h:77:38: note: in expansion of macro 'ZEND_FENTRY'
 #define ZEND_FE(name, arg_info)      ZEND_FENTRY(name, ZEND_FN(name), arg_info, 0)
                                      ^
/usr/include/php/main/php.h:349:18: note: in expansion of macro 'ZEND_FE'
 #define PHP_FE   ZEND_FE
                  ^
/tmp/B.f73e5564-3c09-42e6-a75b-fce158480d3d/BUILD/php-pecl-parsekit-1.3.0/parsekit.c:1138:2: note: in expansion of macro 'PHP_FE'
  PHP_FE(parsekit_opcode_name,   NULL)
  ^
/usr/include/php/Zend/zend_API.h:71:129: warning: (near initialization for 'parsekit_functions[3]') [enabled by default]
 #define ZEND_FENTRY(zend_name, name, arg_info, flags) { #zend_name, name, arg_info, (zend_uint) (sizeof(arg_info)/sizeof(struct _zend_arg_info)-1), flags },
                                                                                                                                 ^
/usr/include/php/Zend/zend_API.h:77:38: note: in expansion of macro 'ZEND_FENTRY'
 #define ZEND_FE(name, arg_info)      ZEND_FENTRY(name, ZEND_FN(name), arg_info, 0)
                                      ^
/usr/include/php/main/php.h:349:18: note: in expansion of macro 'ZEND_FE'
 #define PHP_FE   ZEND_FE
                  ^
/tmp/B.f73e5564-3c09-42e6-a75b-fce158480d3d/BUILD/php-pecl-parsekit-1.3.0/parsekit.c:1138:2: note: in expansion of macro 'PHP_FE'
  PHP_FE(parsekit_opcode_name,   NULL)
  ^
/tmp/B.f73e5564-3c09-42e6-a75b-fce158480d3d/BUILD/php-pecl-parsekit-1.3.0/parsekit.c:1139:2: warning: braces around scalar initializer [enabled by default]
  PHP_FE(parsekit_func_arginfo,   NULL)
  ^
/tmp/B.f73e5564-3c09-42e6-a75b-fce158480d3d/BUILD/php-pecl-parsekit-1.3.0/parsekit.c:1139:2: warning: (near initialization for 'parsekit_functions[4]') [enabled by default]
/tmp/B.f73e5564-3c09-42e6-a75b-fce158480d3d/BUILD/php-pecl-parsekit-1.3.0/parsekit.c:1139:2: warning: initialization makes integer from pointer without a cast [enabled by default]
/tmp/B.f73e5564-3c09-42e6-a75b-fce158480d3d/BUILD/php-pecl-parsekit-1.3.0/parsekit.c:1139:2: warning: (near initialization for 'parsekit_functions[4]') [enabled by default]
/tmp/B.f73e5564-3c09-42e6-a75b-fce158480d3d/BUILD/php-pecl-parsekit-1.3.0/parsekit.c:1139:2: warning: excess elements in scalar initializer [enabled by default]
/tmp/B.f73e5564-3c09-42e6-a75b-fce158480d3d/BUILD/php-pecl-parsekit-1.3.0/parsekit.c:1139:2: warning: (near initialization for 'parsekit_functions[4]') [enabled by default]
/tmp/B.f73e5564-3c09-42e6-a75b-fce158480d3d/BUILD/php-pecl-parsekit-1.3.0/parsekit.c:1139:2: warning: excess elements in scalar initializer [enabled by default]
/tmp/B.f73e5564-3c09-42e6-a75b-fce158480d3d/BUILD/php-pecl-parsekit-1.3.0/parsekit.c:1139:2: warning: (near initialization for 'parsekit_functions[4]') [enabled by default]
In file included from /usr/include/php/main/php.h:38:0,
                 from /tmp/B.f73e5564-3c09-42e6-a75b-fce158480d3d/BUILD/php-pecl-parsekit-1.3.0/parsekit.c:25:
/usr/include/php/Zend/zend_API.h:71:129: warning: excess elements in scalar initializer [enabled by default]
 #define ZEND_FENTRY(zend_name, name, arg_info, flags) { #zend_name, name, arg_info, (zend_uint) (sizeof(arg_info)/sizeof(struct _zend_arg_info)-1), flags },
                                                                                                                                 ^
/usr/include/php/Zend/zend_API.h:77:38: note: in expansion of macro 'ZEND_FENTRY'
 #define ZEND_FE(name, arg_info)      ZEND_FENTRY(name, ZEND_FN(name), arg_info, 0)
                                      ^
/usr/include/php/main/php.h:349:18: note: in expansion of macro 'ZEND_FE'
 #define PHP_FE   ZEND_FE
                  ^
/tmp/B.f73e5564-3c09-42e6-a75b-fce158480d3d/BUILD/php-pecl-parsekit-1.3.0/parsekit.c:1139:2: note: in expansion of macro 'PHP_FE'
  PHP_FE(parsekit_func_arginfo,   NULL)
  ^
/usr/include/php/Zend/zend_API.h:71:129: warning: (near initialization for 'parsekit_functions[4]') [enabled by default]
 #define ZEND_FENTRY(zend_name, name, arg_info, flags) { #zend_name, name, arg_info, (zend_uint) (sizeof(arg_info)/sizeof(struct _zend_arg_info)-1), flags },
                                                                                                                                 ^
/usr/include/php/Zend/zend_API.h:77:38: note: in expansion of macro 'ZEND_FENTRY'
 #define ZEND_FE(name, arg_info)      ZEND_FENTRY(name, ZEND_FN(name), arg_info, 0)
                                      ^
/usr/include/php/main/php.h:349:18: note: in expansion of macro 'ZEND_FE'
 #define PHP_FE   ZEND_FE
                  ^
/tmp/B.f73e5564-3c09-42e6-a75b-fce158480d3d/BUILD/php-pecl-parsekit-1.3.0/parsekit.c:1139:2: note: in expansion of macro 'PHP_FE'
  PHP_FE(parsekit_func_arginfo,   NULL)
  ^
/usr/include/php/Zend/zend_API.h:71:129: warning: excess elements in scalar initializer [enabled by default]
 #define ZEND_FENTRY(zend_name, name, arg_info, flags) { #zend_name, name, arg_info, (zend_uint) (sizeof(arg_info)/sizeof(struct _zend_arg_info)-1), flags },
                                                                                                                                 ^
/usr/include/php/Zend/zend_API.h:77:38: note: in expansion of macro 'ZEND_FENTRY'
 #define ZEND_FE(name, arg_info)      ZEND_FENTRY(name, ZEND_FN(name), arg_info, 0)
                                      ^
/usr/include/php/main/php.h:349:18: note: in expansion of macro 'ZEND_FE'
 #define PHP_FE   ZEND_FE
                  ^
/tmp/B.f73e5564-3c09-42e6-a75b-fce158480d3d/BUILD/php-pecl-parsekit-1.3.0/parsekit.c:1139:2: note: in expansion of macro 'PHP_FE'
  PHP_FE(parsekit_func_arginfo,   NULL)
  ^
/usr/include/php/Zend/zend_API.h:71:129: warning: (near initialization for 'parsekit_functions[4]') [enabled by default]
 #define ZEND_FENTRY(zend_name, name, arg_info, flags) { #zend_name, name, arg_info, (zend_uint) (sizeof(arg_info)/sizeof(struct _zend_arg_info)-1), flags },
                                                                                                                                 ^
/usr/include/php/Zend/zend_API.h:77:38: note: in expansion of macro 'ZEND_FENTRY'
 #define ZEND_FE(name, arg_info)      ZEND_FENTRY(name, ZEND_FN(name), arg_info, 0)
                                      ^
/usr/include/php/main/php.h:349:18: note: in expansion of macro 'ZEND_FE'
 #define PHP_FE   ZEND_FE
                  ^
/tmp/B.f73e5564-3c09-42e6-a75b-fce158480d3d/BUILD/php-pecl-parsekit-1.3.0/parsekit.c:1139:2: note: in expansion of macro 'PHP_FE'
  PHP_FE(parsekit_func_arginfo,   NULL)
  ^
/tmp/B.f73e5564-3c09-42e6-a75b-fce158480d3d/BUILD/php-pecl-parsekit-1.3.0/parsekit.c:1140:2: warning: braces around scalar initializer [enabled by default]
  {NULL, NULL, NULL}
  ^
/tmp/B.f73e5564-3c09-42e6-a75b-fce158480d3d/BUILD/php-pecl-parsekit-1.3.0/parsekit.c:1140:2: warning: (near initialization for 'parsekit_functions[5]') [enabled by default]
/tmp/B.f73e5564-3c09-42e6-a75b-fce158480d3d/BUILD/php-pecl-parsekit-1.3.0/parsekit.c:1140:2: warning: initialization makes integer from pointer without a cast [enabled by default]
/tmp/B.f73e5564-3c09-42e6-a75b-fce158480d3d/BUILD/php-pecl-parsekit-1.3.0/parsekit.c:1140:2: warning: (near initialization for 'parsekit_functions[5]') [enabled by default]
/tmp/B.f73e5564-3c09-42e6-a75b-fce158480d3d/BUILD/php-pecl-parsekit-1.3.0/parsekit.c:1140:2: warning: excess elements in scalar initializer [enabled by default]
/tmp/B.f73e5564-3c09-42e6-a75b-fce158480d3d/BUILD/php-pecl-parsekit-1.3.0/parsekit.c:1140:2: warning: (near initialization for 'parsekit_functions[5]') [enabled by default]
/tmp/B.f73e5564-3c09-42e6-a75b-fce158480d3d/BUILD/php-pecl-parsekit-1.3.0/parsekit.c:1140:2: warning: excess elements in scalar initializer [enabled by default]
/tmp/B.f73e5564-3c09-42e6-a75b-fce158480d3d/BUILD/php-pecl-parsekit-1.3.0/parsekit.c:1140:2: warning: (near initialization for 'parsekit_functions[5]') [enabled by default]
/tmp/B.f73e5564-3c09-42e6-a75b-fce158480d3d/BUILD/php-pecl-parsekit-1.3.0/parsekit.c:1151:2: warning: initialization from incompatible pointer type [enabled by default]
  parsekit_functions,
  ^
/tmp/B.f73e5564-3c09-42e6-a75b-fce158480d3d/BUILD/php-pecl-parsekit-1.3.0/parsekit.c:1151:2: warning: (near initialization for 'parsekit_module_entry.functions') [enabled by default]
Makefile:201: recipe for target 'parsekit.lo' failed
make: *** [parsekit.lo] Error 1
error: Bad exit status from /tmp/B.f73e5564-3c09-42e6-a75b-fce158480d3d/BUILD/tmp/rpm-tmp.36705 (%build)


RPM build errors:
    Bad exit status from /tmp/B.f73e5564-3c09-42e6-a75b-fce158480d3d/BUILD/tmp/rpm-tmp.36705 (%build)
ended at: Mon Apr 28 14:15:56 2014, done in 0:00:07.492204
error: No files produced.
+ chmod -R u+rwX /tmp/B.f73e5564-3c09-42e6-a75b-fce158480d3d/BUILD
+ rm -rf /tmp/B.f73e5564-3c09-42e6-a75b-fce158480d3d/tmp /tmp/B.f73e5564-3c09-42e6-a75b-fce158480d3d/BUILD
+ rm -rf /tmp/B.f73e5564-3c09-42e6-a75b-fce158480d3d
Begin-PLD-Builder-Info
Build-Time: user:6.37s sys:0.53s real:12.70s (faults io:0 non-io:714924)

End-PLD-Builder-Info
[Back to list of logs] [View rpm -qa of builder]