FailedOk

th/SRPMS[OK]
th/x32[OK]
th/i686[OK]
th/x86_64[OK]

ac/SRPMS[OK]
ac/i386[OK]
ac/i586[OK]
ac/i686[OK]
ac/alpha[OK]
ac/amd64[OK]
ac/athlon[OK]
ac/ppc[OK]
ac/sparc[OK]
ac/sparc64[OK]

Advanced Search
main()
Powered by PLD Linux
(c) 2002-2019 PLD Team
$Revision: 1.37 $
Powered by The Bad Thing.
Your IP: 18.207.132.114

php-pecl-solr 9400ad0d-4143-46f2-8a00-be80dd641b65

Status:Failed
Source URL:ftp://buildlogs.pld-linux.org/th/i686/FAIL/php-pecl-solr,9400ad0d-4143-46f2-8a00-be80dd641b65.bz2
text/plain URL:View!
full text:View!
rpm -qa of builder:View!
Date:2019/08/06 14:23:04
Runtime:0:00:10.291413

Toc:

  • error 1
  • rpm: error: Failed build dependencies:
  • error 2
  • error: ftp://ftp1.pld-linux.org/dists/th/test/i686/RPMS/packages.ndir.gz: broken file
  • error 3
  • error: ftp://ftp1.pld-linux.org/dists/th/test/i686/RPMS/packages.ndir.gz: broken file
  • error 4
  • poldek: error: ftp://ftp1.pld-linux.org/dists/th/test/i686/RPMS/packages.ndir.gz: broken file
  • error 5
  • poldek: error: ftp://ftp1.pld-linux.org/dists/th/test/i686/RPMS/packages.ndir.gz: broken file
  • error 6
  • rpm: error: Failed build dependencies:
  • error 7
  • error: ftp://ftp1.pld-linux.org/dists/th/test/i686/RPMS/packages.ndir.gz: broken file
  • error 8
  • error: ftp://ftp1.pld-linux.org/dists/th/test/i686/RPMS/packages.ndir.gz: broken file
  • prep
  • Executing(%prep): /bin/sh -e /tmp/B.GLV3PE/BUILD/tmp/rpm-tmp.99878
  • build
  • Executing(%build): /bin/sh -e /tmp/B.GLV3PE/BUILD/tmp/rpm-tmp.99878
  • error 9
  • error: Bad exit status from /tmp/B.GLV3PE/BUILD/tmp/rpm-tmp.99878 (%build)
  • error 10
  • RPM build errors:
  • error 11
  • error: No files produced.

Content:

checking if we should skip the build
started at: Tue Aug  6 14:22:30 2019
killing old processes on a builder
sending signal 9 to pid -1
Killed
cleaning up /tmp
fetching https://srcbuilder.pld-linux.org/th//srpms/9400ad0d-4143-46f2-8a00-be80dd641b65/php74-pecl-solr-2.5.0-1.src.rpm
fetched 738992 bytes, 1461.7 K/s
installing srpm: php74-pecl-solr-2.5.0-1.src.rpm
+ install -d /tmp/B.GLV3PE/BUILD /tmp/B.GLV3PE/RPMS
+ LC_ALL=en_US.UTF-8
+ rpm -qp --changelog php74-pecl-solr-2.5.0-1.src.rpm
* Tue Aug 06 2019 PLD Linux Team <feedback@pld-linux.org>
- For complete changelog see: http://git.pld-linux.org/?p=packages/php-pecl-solr.git;a=log;h=master
* Mon Jul 08 2019 Elan Ruusamäe <glen@pld-linux.org> 12d0120
- cleanup patches * Sun Jul 07 2019 Elan Ruusamäe <glen@pld-linux.org> b6beaa4
- up to 2.5.0 * Tue Aug 07 2018 Elan Ruusamäe <glen@pld-linux.org> d4505b6
- patch to build under php 7.2 + rpm -Uhv --nodeps --define '_topdir /tmp/B.GLV3PE' --define '_specdir %{_topdir}' --define '_sourcedir %{_specdir}' --define '_rpmdir %{_topdir}/RPMS' --define '_builddir %{_topdir}/BUILD' --define 'php_suffix 74' php74-pecl-solr-2.5.0-1.src.rpm Preparing... ################################################## php74-pecl-solr ################################################## + rm -f php74-pecl-solr-2.5.0-1.src.rpm + install -m 700 -d /tmp/B.GLV3PE/BUILD/tmp + TMPDIR=/tmp/B.GLV3PE/BUILD/tmp + exec nice -n 0 rpmbuild -bp --short-circuit --nodeps --define '_topdir /tmp/B.GLV3PE' --define '_specdir %{_topdir}' --define '_sourcedir %{_specdir}' --define '_rpmdir %{_topdir}/RPMS' --define '_builddir %{_topdir}/BUILD' --target i686-pld-linux --define 'php_suffix 74' --define 'prep exit 0' /tmp/B.GLV3PE/php-pecl-solr.spec sh: php-config: inaccessible or not found warning: %changelog not in descending chronological order Building target platforms: i686-pld-linux checking BuildConflict-ing packages no BuildConflicts found checking BR rpm: sh: php-config: inaccessible or not found rpm: warning: %changelog not in descending chronological order rpm: error: Failed build dependencies: rpm: php74-cli is needed by php74-pecl-solr-2.5.0-1.src rpm: php74-curl is needed by php74-pecl-solr-2.5.0-1.src rpm: php74-devel >= 4:5.3.0 is needed by php74-pecl-solr-2.5.0-1.src rpm: php74-json is needed by php74-pecl-solr-2.5.0-1.src rpm: php-packagexml2cl is needed by php74-pecl-solr-2.5.0-1.src rpm: php74-pcre is needed by php74-pecl-solr-2.5.0-1.src rpm: php74-xml is needed by php74-pecl-solr-2.5.0-1.src rpm: Building target platforms: i686-pld-linux updating poldek cache... ready is up to date Retrieving th::packages.ndir.md... th is up to date Retrieving th::packages.ndir.md... th is up to date Retrieving th-ready::packages.ndir.md... th-ready is up to date Retrieving th-ready::packages.ndir.md... th-ready is up to date error: ftp://ftp1.pld-linux.org/dists/th/test/i686/RPMS/packages.ndir.gz: broken file Retrieving th-test::packages.ndir.md... Retrieving th-test::packages.ndir.gz... ..............................done error: ftp://ftp1.pld-linux.org/dists/th/test/i686/RPMS/packages.ndir.gz: broken file Retrieving th-test::packages.ndir.md... th-test is up to date checking conflicting packages in BRed packages poldek: error: ftp://ftp1.pld-linux.org/dists/th/test/i686/RPMS/packages.ndir.gz: broken file poldek: Retrieving th-test::packages.ndir.md... poldek: Retrieving th-test::packages.ndir.gz... poldek: ..............................done poldek: error: ftp://ftp1.pld-linux.org/dists/th/test/i686/RPMS/packages.ndir.gz: broken file poldek: warn: ftp://ftp1.pld-linux.org/dists/th/test/i686/RPMS/: load failed, skipped poldek: Loading [pndir]ready... poldek: Loading [pndir]th-test... poldek: Loading [pndir]th-ready... poldek: Loading [pndir]th-ready... poldek: Loading [pndir]th... poldek: Loading [pndir]th... poldek: 28630 packages read poldek: Removed 1010 duplicate packages from available set poldek: Processing dependencies... poldek: php-packagexml2cl-0.1-4.noarch marks php74-program-7.4.0-1.alpha1.1.i686 (cap /usr/bin/php) poldek: php-packagexml2cl-0.1-4.noarch marks php74-simplexml-7.4.0-1.alpha1.1.i686 (cap php(simplexml)) poldek: There are 9 packages to install (2 marked by dependencies): poldek: I php-packagexml2cl-0.1-4.noarch php74-cli-7.4.0-1.alpha1.1.i686 poldek: I php74-common-7.4.0-1.alpha1.1.i686 php74-curl-7.4.0-1.alpha1.1.i686 poldek: I php74-devel-7.4.0-1.alpha1.1.i686 php74-json-7.4.0-1.alpha1.1.i686 poldek: I php74-xml-7.4.0-1.alpha1.1.i686 poldek: D php74-program-7.4.0-1.alpha1.1.i686 poldek: D php74-simplexml-7.4.0-1.alpha1.1.i686 poldek: This operation will use 15.5MB of disk space. poldek: Need to get 2.1MB of archives (2.1MB to download). poldek: poldek: Retrieving [1/9] th::php74-common-7.4.0-1.alpha1.1.i686.rpm... poldek: ..............................done poldek: Retrieving [2/9] th::php74-cli-7.4.0-1.alpha1.1.i686.rpm... poldek: ..............................done poldek: Retrieving [3/9] th::php74-program-7.4.0-1.alpha1.1.i686.rpm... poldek: ..............................done poldek: Retrieving [4/9] th::php74-simplexml-7.4.0-1.alpha1.1.i686.rpm... poldek: ..............................done poldek: Retrieving [5/9] th::php74-curl-7.4.0-1.alpha1.1.i686.rpm... poldek: ..............................done poldek: Retrieving [6/9] th::php74-devel-7.4.0-1.alpha1.1.i686.rpm... poldek: ..............................done poldek: Retrieving [7/9] th::php74-json-7.4.0-1.alpha1.1.i686.rpm... poldek: ..............................done poldek: Retrieving [8/9] th::php74-xml-7.4.0-1.alpha1.1.i686.rpm... poldek: ..............................done poldek: Retrieving [9/9] th::php-packagexml2cl-0.1-4.noarch.rpm... poldek: ..............................done poldek: Executing pm-command.sh --upgrade -vh --test --root / --define _check_dirname_deps 1... poldek: Preparing... ################################################## no conflicts found checking BR rpm: sh: php-config: inaccessible or not found rpm: warning: %changelog not in descending chronological order rpm: error: Failed build dependencies: rpm: php74-cli is needed by php74-pecl-solr-2.5.0-1.src rpm: php74-curl is needed by php74-pecl-solr-2.5.0-1.src rpm: php74-devel >= 4:5.3.0 is needed by php74-pecl-solr-2.5.0-1.src rpm: php74-json is needed by php74-pecl-solr-2.5.0-1.src rpm: php-packagexml2cl is needed by php74-pecl-solr-2.5.0-1.src rpm: php74-pcre is needed by php74-pecl-solr-2.5.0-1.src rpm: php74-xml is needed by php74-pecl-solr-2.5.0-1.src rpm: Building target platforms: i686-pld-linux installing BR: php\-packagexml2cl php74\-pcre php74\-xml php74\-cli php74\-json php74\-devel php74\-curl + poldek --noask --caplookup -Q -v '--ignore=hhvm-*' '--ignore=php4-*' '--ignore=php52-*' '--ignore=php53-*' '--ignore=php54-*' '--ignore=php55-*' '--ignore=php56-*' '--ignore=php70-*' '--ignore=php71-*' '--ignore=php72-*' '--ignore=php73-*' --upgrade php-packagexml2cl php74-pcre php74-xml php74-cli php74-json php74-devel php74-curl error: ftp://ftp1.pld-linux.org/dists/th/test/i686/RPMS/packages.ndir.gz: broken file Retrieving th-test::packages.ndir.md... Retrieving th-test::packages.ndir.gz... ..............................done error: ftp://ftp1.pld-linux.org/dists/th/test/i686/RPMS/packages.ndir.gz: broken file warn: ftp://ftp1.pld-linux.org/dists/th/test/i686/RPMS/: load failed, skipped Loading [pndir]ready... Loading [pndir]th-test... Loading [pndir]th-ready... Loading [pndir]th-ready... Loading [pndir]th... Loading [pndir]th... 28630 packages read Removed 1010 duplicate packages from available set Processing dependencies... There are 6 packages to install: I php74-cli-7.4.0-1.alpha1.1.i686 php74-common-7.4.0-1.alpha1.1.i686 I php74-curl-7.4.0-1.alpha1.1.i686 php74-devel-7.4.0-1.alpha1.1.i686 I php74-json-7.4.0-1.alpha1.1.i686 php74-xml-7.4.0-1.alpha1.1.i686 This operation will use 15.5MB of disk space. Need to get 2.1MB of archives. Executing pm-command.sh --upgrade -vh --root / --define _check_dirname_deps 1... Preparing... ################################################## php74-common ################################################## php74-cli ################################################## php74-curl ################################################## php74-devel ################################################## php74-json ################################################## php74-xml ################################################## Installing set #2 Processing dependencies... php-packagexml2cl-0.1-4.noarch marks php74-program-7.4.0-1.alpha1.1.i686 (cap /usr/bin/php) php-packagexml2cl-0.1-4.noarch marks php74-simplexml-7.4.0-1.alpha1.1.i686 (cap php(simplexml)) There are 3 packages to install (2 marked by dependencies): I php-packagexml2cl-0.1-4.noarch D php74-program-7.4.0-1.alpha1.1.i686 D php74-simplexml-7.4.0-1.alpha1.1.i686 This operation will use 59.2KB of disk space. Need to get 38.3KB of archives. Executing pm-command.sh --upgrade -vh --root / --define _check_dirname_deps 1... Preparing... ################################################## php74-program ################################################## php74-simplexml ################################################## php-packagexml2cl ################################################## building RPM using: set -ex; : build-id: 9400ad0d-4143-46f2-8a00-be80dd641b65; TMPDIR=/tmp/B.GLV3PE/BUILD/tmp exec nice -n 0 rpmbuild -bb --define '_smp_mflags -j9' --define '_make_opts -Otarget' --define '_pld_builder 1' --define '_topdir /tmp/B.GLV3PE' --define '_specdir %{_topdir}' --define '_sourcedir %{_specdir}' --define '_rpmdir %{_topdir}/RPMS' --define '_builddir %{_topdir}/BUILD' --target i686-pld-linux --define 'php_suffix 74' /tmp/B.GLV3PE/php-pecl-solr.spec + : build-id: 9400ad0d-4143-46f2-8a00-be80dd641b65 + TMPDIR=/tmp/B.GLV3PE/BUILD/tmp + exec nice -n 0 rpmbuild -bb --define '_smp_mflags -j9' --define '_make_opts -Otarget' --define '_pld_builder 1' --define '_topdir /tmp/B.GLV3PE' --define '_specdir %{_topdir}' --define '_sourcedir %{_specdir}' --define '_rpmdir %{_topdir}/RPMS' --define '_builddir %{_topdir}/BUILD' --target i686-pld-linux --define 'php_suffix 74' /tmp/B.GLV3PE/php-pecl-solr.spec warning: %changelog not in descending chronological order Building target platforms: i686-pld-linux Executing(%prep): /bin/sh -e /tmp/B.GLV3PE/BUILD/tmp/rpm-tmp.99878 + umask 022 + cd /tmp/B.GLV3PE/BUILD + cd /tmp/B.GLV3PE/BUILD + rm -rf php74-pecl-solr-2.5.0 + /bin/mkdir -p php74-pecl-solr-2.5.0 + cd php74-pecl-solr-2.5.0 + /usr/bin/gzip -dc /tmp/B.GLV3PE/solr-2.5.0.tgz + /bin/tar -xf - + STATUS=0 + '[' 0 -ne 0 ']' + /bin/id -u + '[' 1001 '=' 0 ']' + /bin/id -u + '[' 1001 '=' 0 ']' + /bin/chmod -Rf a+rX,u+w,g-w,o-w . + mv solr-2.5.0/CREDITS solr-2.5.0/LICENSE solr-2.5.0/README.ABOUT_SOLR_EXTENSION solr-2.5.0/README.CONTRIBUTORS solr-2.5.0/README.INSTALLATION solr-2.5.0/README.MEMORY_ALLOCATION solr-2.5.0/README.SUBMITTING_CONTRIBUTIONS solr-2.5.0/TODO solr-2.5.0/config.m4 solr-2.5.0/config.w32 solr-2.5.0/docs solr-2.5.0/examples solr-2.5.0/pecl-compat solr-2.5.0/solr.dsp solr-2.5.0/src solr-2.5.0/tests . + echo 'Patch #0 (tests-online.patch):' Patch #0 (tests-online.patch): + '[' -f /tmp/B.GLV3PE/tests-online.patch ']' + /bin/cat /tmp/B.GLV3PE/tests-online.patch + /usr/bin/patch -s -p1 + <<"EOF" + >run-tests.sh + cat + chmod +x run-tests.sh + exit 0 Executing(%build): /bin/sh -e /tmp/B.GLV3PE/BUILD/tmp/rpm-tmp.99878 TMP=/home/users/builder/tmp HOME=/home/users/builder PATH=/home/users/builder/GNUstep/Tools:/usr/local/bin:/usr/bin:/bin:/home/users/builder/bin TMPDIR=/tmp/B.GLV3PE/BUILD/tmp + umask 022 + cd /tmp/B.GLV3PE/BUILD + cd php74-pecl-solr-2.5.0 + >ChangeLog + packagexml2cl package.xml + awk '-F"' '/define PHP_SOLR_VERSION / {print $2}' src/php7/php_solr_version.h + extver=2.5.0 + test x2.5.0 '!=' x2.5.0 + phpize Configuring for: PHP Api Version: 20190529 Zend Module Api No: 20190529 Zend Extension Api No: 320190529 + ./configure 'LDFLAGS=-Wl,--as-needed -Wl,--no-copy-dt-needed-entries -Wl,-z,relro -Wl,-z,combreloc ' 'CFLAGS=-O2 -fwrapv -pipe -Wformat -Werror=format-security -gdwarf-4 -fno-debug-types-section -fvar-tracking-assignments -g2 -Wp,-D_FORTIFY_SOURCE=2 -fstack-protector-strong --param=ssp-buffer-size=4 -Werror=trampolines -fomit-frame-pointer -march=i686 -fasynchronous-unwind-tables -mtune=pentium4 -gdwarf-4 -fno-debug-types-section -fvar-tracking-assignments -g2 ' 'CXXFLAGS=-O2 -fwrapv -pipe -Wformat -Werror=format-security -gdwarf-4 -fno-debug-types-section -fvar-tracking-assignments -g2 -Wp,-D_FORTIFY_SOURCE=2 -fstack-protector-strong --param=ssp-buffer-size=4 -Werror=trampolines -fomit-frame-pointer -march=i686 -fasynchronous-unwind-tables -mtune=pentium4 -gdwarf-4 -fno-debug-types-section -fvar-tracking-assignments -g2 ' 'FFLAGS=-O2 -fwrapv -pipe -Wformat -Werror=format-security -gdwarf-4 -fno-debug-types-section -fvar-tracking-assignments -g2 -Wp,-D_FORTIFY_SOURCE=2 -fstack-protector-strong --param=ssp-buffer-size=4 -Werror=trampolines -fomit-frame-pointer -march=i686 -fasynchronous-unwind-tables -mtune=pentium4 -gdwarf-4 -fno-debug-types-section -fvar-tracking-assignments -g2 ' 'FCFLAGS=-O2 -fwrapv -pipe -Wformat -Werror=format-security -gdwarf-4 -fno-debug-types-section -fvar-tracking-assignments -g2 -Wp,-D_FORTIFY_SOURCE=2 -fstack-protector-strong --param=ssp-buffer-size=4 -Werror=trampolines -fomit-frame-pointer -march=i686 -fasynchronous-unwind-tables -mtune=pentium4 -gdwarf-4 -fno-debug-types-section -fvar-tracking-assignments -g2 ' 'CPPFLAGS=' 'CC=i686-pld-linux-gcc' 'CXX=i686-pld-linux-g++' '--host=i686-pld-linux' '--build=i686-pld-linux' '--prefix=/usr' '--exec-prefix=/usr' '--bindir=/usr/bin' '--sbindir=/usr/sbin' '--sysconfdir=/etc' '--datadir=/usr/share' '--includedir=/usr/include' '--libdir=/usr/lib' '--libexecdir=/usr/libexec' '--localstatedir=/var' '--sharedstatedir=/var/lib' '--mandir=/usr/share/man' '--infodir=/usr/share/info' '--x-libraries=/usr/lib' checking for grep that handles long lines and -e... /bin/grep checking for egrep... /bin/grep -E checking for a sed that does not truncate output... /bin/sed checking for i686-pld-linux-pkg-config... no checking for pkg-config... /usr/bin/pkg-config checking pkg-config is at least version 0.9.0... yes checking for i686-pld-linux-cc... i686-pld-linux-gcc checking whether the C compiler works... yes checking for C compiler default output file name... a.out checking for suffix of executables... checking whether we are cross compiling... no checking for suffix of object files... o checking whether we are using the GNU C compiler... yes checking whether i686-pld-linux-gcc accepts -g... yes checking for i686-pld-linux-gcc option to accept ISO C89... none needed checking how to run the C preprocessor... i686-pld-linux-gcc -E checking for icc... no checking for suncc... no checking for system library directory... lib checking if compiler supports -R... no checking if compiler supports -Wl,-rpath,... yes checking build system type... i686-pld-linux-gnu checking host system type... i686-pld-linux-gnu checking target system type... i686-pld-linux-gnu checking for PHP prefix... /usr checking for PHP includes... -I/usr/include/php -I/usr/include/php/main -I/usr/include/php/TSRM -I/usr/include/php/Zend -I/usr/include/php/ext -I/usr/include/php/ext/date/lib checking for PHP extension directory... /usr/lib/php74 checking for PHP installed headers prefix... /usr/include/php checking if debug is enabled... no checking if zts is enabled... no checking for gawk... gawk checking for cURL support... yes, shared checking for cURL in default path... found in /usr checking for cURL 7.15.0 or greater... libcurl 7.65.2 checking whether to enable the Solr extension... yes, shared checking whether to compile with solr in verbose mode... no checking libxml2 install dir... no checking whether to enable code coverage... no checking for curl_easy_perform in -lcurl... yes checking for JSON... Yes checking for libxml-2.0 >= 2.7.6... yes checking PHP version... PHP 7 checking how to print strings... print -r checking for a sed that does not truncate output... (cached) /bin/sed checking for fgrep... /bin/grep -F checking for ld used by i686-pld-linux-gcc... /usr/bin/ld checking if the linker (/usr/bin/ld) is GNU ld... yes checking for BSD- or MS-compatible name lister (nm)... /usr/bin/nm -B checking the name lister (/usr/bin/nm -B) interface... BSD nm checking whether ln -s works... yes checking the maximum length of command line arguments... 1572864 checking how to convert i686-pld-linux-gnu file names to i686-pld-linux-gnu format... func_convert_file_noop checking how to convert i686-pld-linux-gnu file names to toolchain format... func_convert_file_noop checking for /usr/bin/ld option to reload object files... -r checking for i686-pld-linux-objdump... no checking for objdump... objdump checking how to recognize dependent libraries... pass_all checking for i686-pld-linux-dlltool... no checking for dlltool... no checking how to associate runtime and link libraries... print -r -- checking for i686-pld-linux-ar... no checking for ar... ar checking for archiver @FILE support... @ checking for i686-pld-linux-strip... no checking for strip... strip checking for i686-pld-linux-ranlib... no checking for ranlib... ranlib checking for mawk... (cached) gawk checking command to parse /usr/bin/nm -B output from i686-pld-linux-gcc object... ok checking for sysroot... no checking for a working dd... /bin/dd checking how to truncate binary pipes... /bin/dd bs=4096 count=1 checking for i686-pld-linux-mt... no checking for mt... no checking if : is a manifest tool... no checking for ANSI C header files... yes checking for sys/types.h... yes checking for sys/stat.h... yes checking for stdlib.h... yes checking for string.h... yes checking for memory.h... yes checking for strings.h... yes checking for inttypes.h... yes checking for stdint.h... yes checking for unistd.h... yes checking for dlfcn.h... yes checking for objdir... .libs checking if i686-pld-linux-gcc supports -fno-rtti -fno-exceptions... no checking for i686-pld-linux-gcc option to produce PIC... -fPIC -DPIC checking if i686-pld-linux-gcc PIC flag -fPIC -DPIC works... yes checking if i686-pld-linux-gcc static flag -static works... yes checking if i686-pld-linux-gcc supports -c -o file.o... yes checking if i686-pld-linux-gcc supports -c -o file.o... (cached) yes checking whether the i686-pld-linux-gcc linker (/usr/bin/ld) supports shared libraries... yes checking whether -lc should be explicitly linked in... no checking dynamic linker characteristics... GNU/Linux ld.so checking how to hardcode library paths into programs... immediate checking whether stripping libraries is possible... yes checking if libtool supports shared libraries... yes checking whether to build shared libraries... yes checking whether to build static libraries... no configure: creating ./config.status config.status: creating config.h config.status: executing libtool commands + /usr/bin/make -Otarget -j9 /bin/sh /tmp/B.GLV3PE/BUILD/php74-pecl-solr-2.5.0/libtool --mode=compile i686-pld-linux-gcc -I. -I/tmp/B.GLV3PE/BUILD/php74-pecl-solr-2.5.0 -DPHP_ATOM_INC -I/tmp/B.GLV3PE/BUILD/php74-pecl-solr-2.5.0/include -I/tmp/B.GLV3PE/BUILD/php74-pecl-solr-2.5.0/main -I/tmp/B.GLV3PE/BUILD/php74-pecl-solr-2.5.0 -I/usr/include/php -I/usr/include/php/main -I/usr/include/php/TSRM -I/usr/include/php/Zend -I/usr/include/php/ext -I/usr/include/php/ext/date/lib -I/usr/include/libxml2 -I/usr/include/php -I/usr/include/php/main -I/usr/include/php/TSRM -I/usr/include/php/Zend -I/usr/include/php/ext -I/usr/include/php/ext/date/lib -I/usr/include/libxml2 -DHAVE_CONFIG_H -O2 -fwrapv -pipe -Wformat -Werror=format-security -gdwarf-4 -fno-debug-types-section -fvar-tracking-assignments -g2 -Wp,-D_FORTIFY_SOURCE=2 -fstack-protector-strong --param=ssp-buffer-size=4 -Werror=trampolines -fomit-frame-pointer -march=i686 -fasynchronous-unwind-tables -mtune=pentium4 -gdwarf-4 -fno-debug-types-section -fvar-tracking-assignments -g2 -c /tmp/B.GLV3PE/BUILD/php74-pecl-solr-2.5.0/src/php7/php_solr_exception.c -o src/php7/php_solr_exception.lo libtool: compile: i686-pld-linux-gcc -I. -I/tmp/B.GLV3PE/BUILD/php74-pecl-solr-2.5.0 -DPHP_ATOM_INC -I/tmp/B.GLV3PE/BUILD/php74-pecl-solr-2.5.0/include -I/tmp/B.GLV3PE/BUILD/php74-pecl-solr-2.5.0/main -I/tmp/B.GLV3PE/BUILD/php74-pecl-solr-2.5.0 -I/usr/include/php -I/usr/include/php/main -I/usr/include/php/TSRM -I/usr/include/php/Zend -I/usr/include/php/ext -I/usr/include/php/ext/date/lib -I/usr/include/libxml2 -I/usr/include/php -I/usr/include/php/main -I/usr/include/php/TSRM -I/usr/include/php/Zend -I/usr/include/php/ext -I/usr/include/php/ext/date/lib -I/usr/include/libxml2 -DHAVE_CONFIG_H -O2 -fwrapv -pipe -Wformat -Werror=format-security -gdwarf-4 -fno-debug-types-section -fvar-tracking-assignments -g2 -Wp,-D_FORTIFY_SOURCE=2 -fstack-protector-strong --param=ssp-buffer-size=4 -Werror=trampolines -fomit-frame-pointer -march=i686 -fasynchronous-unwind-tables -mtune=pentium4 -gdwarf-4 -fno-debug-types-section -fvar-tracking-assignments -g2 -c /tmp/B.GLV3PE/BUILD/php74-pecl-solr-2.5.0/src/php7/php_solr_exception.c -fPIC -DPIC -o src/php7/.libs/php_solr_exception.o /bin/sh /tmp/B.GLV3PE/BUILD/php74-pecl-solr-2.5.0/libtool --mode=compile i686-pld-linux-gcc -I. -I/tmp/B.GLV3PE/BUILD/php74-pecl-solr-2.5.0 -DPHP_ATOM_INC -I/tmp/B.GLV3PE/BUILD/php74-pecl-solr-2.5.0/include -I/tmp/B.GLV3PE/BUILD/php74-pecl-solr-2.5.0/main -I/tmp/B.GLV3PE/BUILD/php74-pecl-solr-2.5.0 -I/usr/include/php -I/usr/include/php/main -I/usr/include/php/TSRM -I/usr/include/php/Zend -I/usr/include/php/ext -I/usr/include/php/ext/date/lib -I/usr/include/libxml2 -I/usr/include/php -I/usr/include/php/main -I/usr/include/php/TSRM -I/usr/include/php/Zend -I/usr/include/php/ext -I/usr/include/php/ext/date/lib -I/usr/include/libxml2 -DHAVE_CONFIG_H -O2 -fwrapv -pipe -Wformat -Werror=format-security -gdwarf-4 -fno-debug-types-section -fvar-tracking-assignments -g2 -Wp,-D_FORTIFY_SOURCE=2 -fstack-protector-strong --param=ssp-buffer-size=4 -Werror=trampolines -fomit-frame-pointer -march=i686 -fasynchronous-unwind-tables -mtune=pentium4 -gdwarf-4 -fno-debug-types-section -fvar-tracking-assignments -g2 -c /tmp/B.GLV3PE/BUILD/php74-pecl-solr-2.5.0/src/php7/php_solr_object.c -o src/php7/php_solr_object.lo libtool: compile: i686-pld-linux-gcc -I. -I/tmp/B.GLV3PE/BUILD/php74-pecl-solr-2.5.0 -DPHP_ATOM_INC -I/tmp/B.GLV3PE/BUILD/php74-pecl-solr-2.5.0/include -I/tmp/B.GLV3PE/BUILD/php74-pecl-solr-2.5.0/main -I/tmp/B.GLV3PE/BUILD/php74-pecl-solr-2.5.0 -I/usr/include/php -I/usr/include/php/main -I/usr/include/php/TSRM -I/usr/include/php/Zend -I/usr/include/php/ext -I/usr/include/php/ext/date/lib -I/usr/include/libxml2 -I/usr/include/php -I/usr/include/php/main -I/usr/include/php/TSRM -I/usr/include/php/Zend -I/usr/include/php/ext -I/usr/include/php/ext/date/lib -I/usr/include/libxml2 -DHAVE_CONFIG_H -O2 -fwrapv -pipe -Wformat -Werror=format-security -gdwarf-4 -fno-debug-types-section -fvar-tracking-assignments -g2 -Wp,-D_FORTIFY_SOURCE=2 -fstack-protector-strong --param=ssp-buffer-size=4 -Werror=trampolines -fomit-frame-pointer -march=i686 -fasynchronous-unwind-tables -mtune=pentium4 -gdwarf-4 -fno-debug-types-section -fvar-tracking-assignments -g2 -c /tmp/B.GLV3PE/BUILD/php74-pecl-solr-2.5.0/src/php7/php_solr_object.c -fPIC -DPIC -o src/php7/.libs/php_solr_object.o /bin/sh /tmp/B.GLV3PE/BUILD/php74-pecl-solr-2.5.0/libtool --mode=compile i686-pld-linux-gcc -I. -I/tmp/B.GLV3PE/BUILD/php74-pecl-solr-2.5.0 -DPHP_ATOM_INC -I/tmp/B.GLV3PE/BUILD/php74-pecl-solr-2.5.0/include -I/tmp/B.GLV3PE/BUILD/php74-pecl-solr-2.5.0/main -I/tmp/B.GLV3PE/BUILD/php74-pecl-solr-2.5.0 -I/usr/include/php -I/usr/include/php/main -I/usr/include/php/TSRM -I/usr/include/php/Zend -I/usr/include/php/ext -I/usr/include/php/ext/date/lib -I/usr/include/libxml2 -I/usr/include/php -I/usr/include/php/main -I/usr/include/php/TSRM -I/usr/include/php/Zend -I/usr/include/php/ext -I/usr/include/php/ext/date/lib -I/usr/include/libxml2 -DHAVE_CONFIG_H -O2 -fwrapv -pipe -Wformat -Werror=format-security -gdwarf-4 -fno-debug-types-section -fvar-tracking-assignments -g2 -Wp,-D_FORTIFY_SOURCE=2 -fstack-protector-strong --param=ssp-buffer-size=4 -Werror=trampolines -fomit-frame-pointer -march=i686 -fasynchronous-unwind-tables -mtune=pentium4 -gdwarf-4 -fno-debug-types-section -fvar-tracking-assignments -g2 -c /tmp/B.GLV3PE/BUILD/php74-pecl-solr-2.5.0/src/php7/php_solr_response.c -o src/php7/php_solr_response.lo libtool: compile: i686-pld-linux-gcc -I. -I/tmp/B.GLV3PE/BUILD/php74-pecl-solr-2.5.0 -DPHP_ATOM_INC -I/tmp/B.GLV3PE/BUILD/php74-pecl-solr-2.5.0/include -I/tmp/B.GLV3PE/BUILD/php74-pecl-solr-2.5.0/main -I/tmp/B.GLV3PE/BUILD/php74-pecl-solr-2.5.0 -I/usr/include/php -I/usr/include/php/main -I/usr/include/php/TSRM -I/usr/include/php/Zend -I/usr/include/php/ext -I/usr/include/php/ext/date/lib -I/usr/include/libxml2 -I/usr/include/php -I/usr/include/php/main -I/usr/include/php/TSRM -I/usr/include/php/Zend -I/usr/include/php/ext -I/usr/include/php/ext/date/lib -I/usr/include/libxml2 -DHAVE_CONFIG_H -O2 -fwrapv -pipe -Wformat -Werror=format-security -gdwarf-4 -fno-debug-types-section -fvar-tracking-assignments -g2 -Wp,-D_FORTIFY_SOURCE=2 -fstack-protector-strong --param=ssp-buffer-size=4 -Werror=trampolines -fomit-frame-pointer -march=i686 -fasynchronous-unwind-tables -mtune=pentium4 -gdwarf-4 -fno-debug-types-section -fvar-tracking-assignments -g2 -c /tmp/B.GLV3PE/BUILD/php74-pecl-solr-2.5.0/src/php7/php_solr_response.c -fPIC -DPIC -o src/php7/.libs/php_solr_response.o /bin/sh /tmp/B.GLV3PE/BUILD/php74-pecl-solr-2.5.0/libtool --mode=compile i686-pld-linux-gcc -I. -I/tmp/B.GLV3PE/BUILD/php74-pecl-solr-2.5.0 -DPHP_ATOM_INC -I/tmp/B.GLV3PE/BUILD/php74-pecl-solr-2.5.0/include -I/tmp/B.GLV3PE/BUILD/php74-pecl-solr-2.5.0/main -I/tmp/B.GLV3PE/BUILD/php74-pecl-solr-2.5.0 -I/usr/include/php -I/usr/include/php/main -I/usr/include/php/TSRM -I/usr/include/php/Zend -I/usr/include/php/ext -I/usr/include/php/ext/date/lib -I/usr/include/libxml2 -I/usr/include/php -I/usr/include/php/main -I/usr/include/php/TSRM -I/usr/include/php/Zend -I/usr/include/php/ext -I/usr/include/php/ext/date/lib -I/usr/include/libxml2 -DHAVE_CONFIG_H -O2 -fwrapv -pipe -Wformat -Werror=format-security -gdwarf-4 -fno-debug-types-section -fvar-tracking-assignments -g2 -Wp,-D_FORTIFY_SOURCE=2 -fstack-protector-strong --param=ssp-buffer-size=4 -Werror=trampolines -fomit-frame-pointer -march=i686 -fasynchronous-unwind-tables -mtune=pentium4 -gdwarf-4 -fno-debug-types-section -fvar-tracking-assignments -g2 -c /tmp/B.GLV3PE/BUILD/php74-pecl-solr-2.5.0/src/php7/php_solr.c -o src/php7/php_solr.lo libtool: compile: i686-pld-linux-gcc -I. -I/tmp/B.GLV3PE/BUILD/php74-pecl-solr-2.5.0 -DPHP_ATOM_INC -I/tmp/B.GLV3PE/BUILD/php74-pecl-solr-2.5.0/include -I/tmp/B.GLV3PE/BUILD/php74-pecl-solr-2.5.0/main -I/tmp/B.GLV3PE/BUILD/php74-pecl-solr-2.5.0 -I/usr/include/php -I/usr/include/php/main -I/usr/include/php/TSRM -I/usr/include/php/Zend -I/usr/include/php/ext -I/usr/include/php/ext/date/lib -I/usr/include/libxml2 -I/usr/include/php -I/usr/include/php/main -I/usr/include/php/TSRM -I/usr/include/php/Zend -I/usr/include/php/ext -I/usr/include/php/ext/date/lib -I/usr/include/libxml2 -DHAVE_CONFIG_H -O2 -fwrapv -pipe -Wformat -Werror=format-security -gdwarf-4 -fno-debug-types-section -fvar-tracking-assignments -g2 -Wp,-D_FORTIFY_SOURCE=2 -fstack-protector-strong --param=ssp-buffer-size=4 -Werror=trampolines -fomit-frame-pointer -march=i686 -fasynchronous-unwind-tables -mtune=pentium4 -gdwarf-4 -fno-debug-types-section -fvar-tracking-assignments -g2 -c /tmp/B.GLV3PE/BUILD/php74-pecl-solr-2.5.0/src/php7/php_solr.c -fPIC -DPIC -o src/php7/.libs/php_solr.o /tmp/B.GLV3PE/BUILD/php74-pecl-solr-2.5.0/src/php7/php_solr.c: In function 'zm_startup_solr': /tmp/B.GLV3PE/BUILD/php74-pecl-solr-2.5.0/src/php7/php_solr.c:1125:39: warning: assignment to 'zend_object_write_property_t' {aka 'struct _zval_struct * (*)(struct _zval_struct *, struct _zval_struct *, struct _zval_struct *, void **)'} from incompatible pointer type 'void (*)(zval *, zval *, zval *, void **)' {aka 'void (*)(struct _zval_struct *, struct _zval_struct *, struct _zval_struct *, void **)'} [-Wincompatible-pointer-types] solr_object_handlers.write_property = solr_object_write_property; ^ /tmp/B.GLV3PE/BUILD/php74-pecl-solr-2.5.0/src/php7/php_solr.c:1130:46: warning: assignment to 'zend_object_write_property_t' {aka 'struct _zval_struct * (*)(struct _zval_struct *, struct _zval_struct *, struct _zval_struct *, void **)'} from incompatible pointer type 'void (*)(zval *, zval *, zval *, void **)' {aka 'void (*)(struct _zval_struct *, struct _zval_struct *, struct _zval_struct *, void **)'} [-Wincompatible-pointer-types] solr_document_field_handlers.write_property = solr_document_field_write_property; ^ /bin/sh /tmp/B.GLV3PE/BUILD/php74-pecl-solr-2.5.0/libtool --mode=compile i686-pld-linux-gcc -I. -I/tmp/B.GLV3PE/BUILD/php74-pecl-solr-2.5.0 -DPHP_ATOM_INC -I/tmp/B.GLV3PE/BUILD/php74-pecl-solr-2.5.0/include -I/tmp/B.GLV3PE/BUILD/php74-pecl-solr-2.5.0/main -I/tmp/B.GLV3PE/BUILD/php74-pecl-solr-2.5.0 -I/usr/include/php -I/usr/include/php/main -I/usr/include/php/TSRM -I/usr/include/php/Zend -I/usr/include/php/ext -I/usr/include/php/ext/date/lib -I/usr/include/libxml2 -I/usr/include/php -I/usr/include/php/main -I/usr/include/php/TSRM -I/usr/include/php/Zend -I/usr/include/php/ext -I/usr/include/php/ext/date/lib -I/usr/include/libxml2 -DHAVE_CONFIG_H -O2 -fwrapv -pipe -Wformat -Werror=format-security -gdwarf-4 -fno-debug-types-section -fvar-tracking-assignments -g2 -Wp,-D_FORTIFY_SOURCE=2 -fstack-protector-strong --param=ssp-buffer-size=4 -Werror=trampolines -fomit-frame-pointer -march=i686 -fasynchronous-unwind-tables -mtune=pentium4 -gdwarf-4 -fno-debug-types-section -fvar-tracking-assignments -g2 -c /tmp/B.GLV3PE/BUILD/php74-pecl-solr-2.5.0/src/php7/php_solr_params.c -o src/php7/php_solr_params.lo libtool: compile: i686-pld-linux-gcc -I. -I/tmp/B.GLV3PE/BUILD/php74-pecl-solr-2.5.0 -DPHP_ATOM_INC -I/tmp/B.GLV3PE/BUILD/php74-pecl-solr-2.5.0/include -I/tmp/B.GLV3PE/BUILD/php74-pecl-solr-2.5.0/main -I/tmp/B.GLV3PE/BUILD/php74-pecl-solr-2.5.0 -I/usr/include/php -I/usr/include/php/main -I/usr/include/php/TSRM -I/usr/include/php/Zend -I/usr/include/php/ext -I/usr/include/php/ext/date/lib -I/usr/include/libxml2 -I/usr/include/php -I/usr/include/php/main -I/usr/include/php/TSRM -I/usr/include/php/Zend -I/usr/include/php/ext -I/usr/include/php/ext/date/lib -I/usr/include/libxml2 -DHAVE_CONFIG_H -O2 -fwrapv -pipe -Wformat -Werror=format-security -gdwarf-4 -fno-debug-types-section -fvar-tracking-assignments -g2 -Wp,-D_FORTIFY_SOURCE=2 -fstack-protector-strong --param=ssp-buffer-size=4 -Werror=trampolines -fomit-frame-pointer -march=i686 -fasynchronous-unwind-tables -mtune=pentium4 -gdwarf-4 -fno-debug-types-section -fvar-tracking-assignments -g2 -c /tmp/B.GLV3PE/BUILD/php74-pecl-solr-2.5.0/src/php7/php_solr_params.c -fPIC -DPIC -o src/php7/.libs/php_solr_params.o /bin/sh /tmp/B.GLV3PE/BUILD/php74-pecl-solr-2.5.0/libtool --mode=compile i686-pld-linux-gcc -I. -I/tmp/B.GLV3PE/BUILD/php74-pecl-solr-2.5.0 -DPHP_ATOM_INC -I/tmp/B.GLV3PE/BUILD/php74-pecl-solr-2.5.0/include -I/tmp/B.GLV3PE/BUILD/php74-pecl-solr-2.5.0/main -I/tmp/B.GLV3PE/BUILD/php74-pecl-solr-2.5.0 -I/usr/include/php -I/usr/include/php/main -I/usr/include/php/TSRM -I/usr/include/php/Zend -I/usr/include/php/ext -I/usr/include/php/ext/date/lib -I/usr/include/libxml2 -I/usr/include/php -I/usr/include/php/main -I/usr/include/php/TSRM -I/usr/include/php/Zend -I/usr/include/php/ext -I/usr/include/php/ext/date/lib -I/usr/include/libxml2 -DHAVE_CONFIG_H -O2 -fwrapv -pipe -Wformat -Werror=format-security -gdwarf-4 -fno-debug-types-section -fvar-tracking-assignments -g2 -Wp,-D_FORTIFY_SOURCE=2 -fstack-protector-strong --param=ssp-buffer-size=4 -Werror=trampolines -fomit-frame-pointer -march=i686 -fasynchronous-unwind-tables -mtune=pentium4 -gdwarf-4 -fno-debug-types-section -fvar-tracking-assignments -g2 -c /tmp/B.GLV3PE/BUILD/php74-pecl-solr-2.5.0/src/php7/php_solr_input_document.c -o src/php7/php_solr_input_document.lo libtool: compile: i686-pld-linux-gcc -I. -I/tmp/B.GLV3PE/BUILD/php74-pecl-solr-2.5.0 -DPHP_ATOM_INC -I/tmp/B.GLV3PE/BUILD/php74-pecl-solr-2.5.0/include -I/tmp/B.GLV3PE/BUILD/php74-pecl-solr-2.5.0/main -I/tmp/B.GLV3PE/BUILD/php74-pecl-solr-2.5.0 -I/usr/include/php -I/usr/include/php/main -I/usr/include/php/TSRM -I/usr/include/php/Zend -I/usr/include/php/ext -I/usr/include/php/ext/date/lib -I/usr/include/libxml2 -I/usr/include/php -I/usr/include/php/main -I/usr/include/php/TSRM -I/usr/include/php/Zend -I/usr/include/php/ext -I/usr/include/php/ext/date/lib -I/usr/include/libxml2 -DHAVE_CONFIG_H -O2 -fwrapv -pipe -Wformat -Werror=format-security -gdwarf-4 -fno-debug-types-section -fvar-tracking-assignments -g2 -Wp,-D_FORTIFY_SOURCE=2 -fstack-protector-strong --param=ssp-buffer-size=4 -Werror=trampolines -fomit-frame-pointer -march=i686 -fasynchronous-unwind-tables -mtune=pentium4 -gdwarf-4 -fno-debug-types-section -fvar-tracking-assignments -g2 -c /tmp/B.GLV3PE/BUILD/php74-pecl-solr-2.5.0/src/php7/php_solr_input_document.c -fPIC -DPIC -o src/php7/.libs/php_solr_input_document.o /bin/sh /tmp/B.GLV3PE/BUILD/php74-pecl-solr-2.5.0/libtool --mode=compile i686-pld-linux-gcc -I. -I/tmp/B.GLV3PE/BUILD/php74-pecl-solr-2.5.0 -DPHP_ATOM_INC -I/tmp/B.GLV3PE/BUILD/php74-pecl-solr-2.5.0/include -I/tmp/B.GLV3PE/BUILD/php74-pecl-solr-2.5.0/main -I/tmp/B.GLV3PE/BUILD/php74-pecl-solr-2.5.0 -I/usr/include/php -I/usr/include/php/main -I/usr/include/php/TSRM -I/usr/include/php/Zend -I/usr/include/php/ext -I/usr/include/php/ext/date/lib -I/usr/include/libxml2 -I/usr/include/php -I/usr/include/php/main -I/usr/include/php/TSRM -I/usr/include/php/Zend -I/usr/include/php/ext -I/usr/include/php/ext/date/lib -I/usr/include/libxml2 -DHAVE_CONFIG_H -O2 -fwrapv -pipe -Wformat -Werror=format-security -gdwarf-4 -fno-debug-types-section -fvar-tracking-assignments -g2 -Wp,-D_FORTIFY_SOURCE=2 -fstack-protector-strong --param=ssp-buffer-size=4 -Werror=trampolines -fomit-frame-pointer -march=i686 -fasynchronous-unwind-tables -mtune=pentium4 -gdwarf-4 -fno-debug-types-section -fvar-tracking-assignments -g2 -c /tmp/B.GLV3PE/BUILD/php74-pecl-solr-2.5.0/src/php7/php_solr_utils.c -o src/php7/php_solr_utils.lo libtool: compile: i686-pld-linux-gcc -I. -I/tmp/B.GLV3PE/BUILD/php74-pecl-solr-2.5.0 -DPHP_ATOM_INC -I/tmp/B.GLV3PE/BUILD/php74-pecl-solr-2.5.0/include -I/tmp/B.GLV3PE/BUILD/php74-pecl-solr-2.5.0/main -I/tmp/B.GLV3PE/BUILD/php74-pecl-solr-2.5.0 -I/usr/include/php -I/usr/include/php/main -I/usr/include/php/TSRM -I/usr/include/php/Zend -I/usr/include/php/ext -I/usr/include/php/ext/date/lib -I/usr/include/libxml2 -I/usr/include/php -I/usr/include/php/main -I/usr/include/php/TSRM -I/usr/include/php/Zend -I/usr/include/php/ext -I/usr/include/php/ext/date/lib -I/usr/include/libxml2 -DHAVE_CONFIG_H -O2 -fwrapv -pipe -Wformat -Werror=format-security -gdwarf-4 -fno-debug-types-section -fvar-tracking-assignments -g2 -Wp,-D_FORTIFY_SOURCE=2 -fstack-protector-strong --param=ssp-buffer-size=4 -Werror=trampolines -fomit-frame-pointer -march=i686 -fasynchronous-unwind-tables -mtune=pentium4 -gdwarf-4 -fno-debug-types-section -fvar-tracking-assignments -g2 -c /tmp/B.GLV3PE/BUILD/php74-pecl-solr-2.5.0/src/php7/php_solr_utils.c -fPIC -DPIC -o src/php7/.libs/php_solr_utils.o /bin/sh /tmp/B.GLV3PE/BUILD/php74-pecl-solr-2.5.0/libtool --mode=compile i686-pld-linux-gcc -I. -I/tmp/B.GLV3PE/BUILD/php74-pecl-solr-2.5.0 -DPHP_ATOM_INC -I/tmp/B.GLV3PE/BUILD/php74-pecl-solr-2.5.0/include -I/tmp/B.GLV3PE/BUILD/php74-pecl-solr-2.5.0/main -I/tmp/B.GLV3PE/BUILD/php74-pecl-solr-2.5.0 -I/usr/include/php -I/usr/include/php/main -I/usr/include/php/TSRM -I/usr/include/php/Zend -I/usr/include/php/ext -I/usr/include/php/ext/date/lib -I/usr/include/libxml2 -I/usr/include/php -I/usr/include/php/main -I/usr/include/php/TSRM -I/usr/include/php/Zend -I/usr/include/php/ext -I/usr/include/php/ext/date/lib -I/usr/include/libxml2 -DHAVE_CONFIG_H -O2 -fwrapv -pipe -Wformat -Werror=format-security -gdwarf-4 -fno-debug-types-section -fvar-tracking-assignments -g2 -Wp,-D_FORTIFY_SOURCE=2 -fstack-protector-strong --param=ssp-buffer-size=4 -Werror=trampolines -fomit-frame-pointer -march=i686 -fasynchronous-unwind-tables -mtune=pentium4 -gdwarf-4 -fno-debug-types-section -fvar-tracking-assignments -g2 -c /tmp/B.GLV3PE/BUILD/php74-pecl-solr-2.5.0/src/php7/php_solr_document.c -o src/php7/php_solr_document.lo libtool: compile: i686-pld-linux-gcc -I. -I/tmp/B.GLV3PE/BUILD/php74-pecl-solr-2.5.0 -DPHP_ATOM_INC -I/tmp/B.GLV3PE/BUILD/php74-pecl-solr-2.5.0/include -I/tmp/B.GLV3PE/BUILD/php74-pecl-solr-2.5.0/main -I/tmp/B.GLV3PE/BUILD/php74-pecl-solr-2.5.0 -I/usr/include/php -I/usr/include/php/main -I/usr/include/php/TSRM -I/usr/include/php/Zend -I/usr/include/php/ext -I/usr/include/php/ext/date/lib -I/usr/include/libxml2 -I/usr/include/php -I/usr/include/php/main -I/usr/include/php/TSRM -I/usr/include/php/Zend -I/usr/include/php/ext -I/usr/include/php/ext/date/lib -I/usr/include/libxml2 -DHAVE_CONFIG_H -O2 -fwrapv -pipe -Wformat -Werror=format-security -gdwarf-4 -fno-debug-types-section -fvar-tracking-assignments -g2 -Wp,-D_FORTIFY_SOURCE=2 -fstack-protector-strong --param=ssp-buffer-size=4 -Werror=trampolines -fomit-frame-pointer -march=i686 -fasynchronous-unwind-tables -mtune=pentium4 -gdwarf-4 -fno-debug-types-section -fvar-tracking-assignments -g2 -c /tmp/B.GLV3PE/BUILD/php74-pecl-solr-2.5.0/src/php7/php_solr_document.c -fPIC -DPIC -o src/php7/.libs/php_solr_document.o In file included from /usr/include/php/Zend/zend.h:33, from /usr/include/php/main/php.h:33, from /tmp/B.GLV3PE/BUILD/php74-pecl-solr-2.5.0/src/php7/php_solr.h:26, from /tmp/B.GLV3PE/BUILD/php74-pecl-solr-2.5.0/src/php7/php_solr_document.c:21: /tmp/B.GLV3PE/BUILD/php74-pecl-solr-2.5.0/src/php7/php_solr_document.c: In function 'zim_SolrDocument_key': /tmp/B.GLV3PE/BUILD/php74-pecl-solr-2.5.0/src/php7/php_solr_document.c:756:61: warning: passing argument 3 of 'zend_hash_get_current_key_ex' from incompatible pointer type [-Wincompatible-pointer-types] if (zend_hash_get_current_key(doc_fields, &field_name_str, &num_index)) ^~~~~~~~~~ /usr/include/php/Zend/zend_hash.h:248:46: note: in definition of macro 'zend_hash_get_current_key' zend_hash_get_current_key_ex(ht, str_index, num_index, &(ht)->nInternalPointer) ^~~~~~~~~ /usr/include/php/Zend/zend_hash.h:234:117: note: expected 'zend_ulong *' {aka 'unsigned int *'} but argument is of type 'ulong *' {aka 'long unsigned int *'} ZEND_API int ZEND_FASTCALL zend_hash_get_current_key_ex(const HashTable *ht, zend_string **str_index, zend_ulong *num_index, HashPosition *pos); ~~~~~~~~~~~~^~~~~~~~~ /bin/sh /tmp/B.GLV3PE/BUILD/php74-pecl-solr-2.5.0/libtool --mode=compile i686-pld-linux-gcc -I. -I/tmp/B.GLV3PE/BUILD/php74-pecl-solr-2.5.0 -DPHP_ATOM_INC -I/tmp/B.GLV3PE/BUILD/php74-pecl-solr-2.5.0/include -I/tmp/B.GLV3PE/BUILD/php74-pecl-solr-2.5.0/main -I/tmp/B.GLV3PE/BUILD/php74-pecl-solr-2.5.0 -I/usr/include/php -I/usr/include/php/main -I/usr/include/php/TSRM -I/usr/include/php/Zend -I/usr/include/php/ext -I/usr/include/php/ext/date/lib -I/usr/include/libxml2 -I/usr/include/php -I/usr/include/php/main -I/usr/include/php/TSRM -I/usr/include/php/Zend -I/usr/include/php/ext -I/usr/include/php/ext/date/lib -I/usr/include/libxml2 -DHAVE_CONFIG_H -O2 -fwrapv -pipe -Wformat -Werror=format-security -gdwarf-4 -fno-debug-types-section -fvar-tracking-assignments -g2 -Wp,-D_FORTIFY_SOURCE=2 -fstack-protector-strong --param=ssp-buffer-size=4 -Werror=trampolines -fomit-frame-pointer -march=i686 -fasynchronous-unwind-tables -mtune=pentium4 -gdwarf-4 -fno-debug-types-section -fvar-tracking-assignments -g2 -c /tmp/B.GLV3PE/BUILD/php74-pecl-solr-2.5.0/src/php7/php_solr_extract.c -o src/php7/php_solr_extract.lo libtool: compile: i686-pld-linux-gcc -I. -I/tmp/B.GLV3PE/BUILD/php74-pecl-solr-2.5.0 -DPHP_ATOM_INC -I/tmp/B.GLV3PE/BUILD/php74-pecl-solr-2.5.0/include -I/tmp/B.GLV3PE/BUILD/php74-pecl-solr-2.5.0/main -I/tmp/B.GLV3PE/BUILD/php74-pecl-solr-2.5.0 -I/usr/include/php -I/usr/include/php/main -I/usr/include/php/TSRM -I/usr/include/php/Zend -I/usr/include/php/ext -I/usr/include/php/ext/date/lib -I/usr/include/libxml2 -I/usr/include/php -I/usr/include/php/main -I/usr/include/php/TSRM -I/usr/include/php/Zend -I/usr/include/php/ext -I/usr/include/php/ext/date/lib -I/usr/include/libxml2 -DHAVE_CONFIG_H -O2 -fwrapv -pipe -Wformat -Werror=format-security -gdwarf-4 -fno-debug-types-section -fvar-tracking-assignments -g2 -Wp,-D_FORTIFY_SOURCE=2 -fstack-protector-strong --param=ssp-buffer-size=4 -Werror=trampolines -fomit-frame-pointer -march=i686 -fasynchronous-unwind-tables -mtune=pentium4 -gdwarf-4 -fno-debug-types-section -fvar-tracking-assignments -g2 -c /tmp/B.GLV3PE/BUILD/php74-pecl-solr-2.5.0/src/php7/php_solr_extract.c -fPIC -DPIC -o src/php7/.libs/php_solr_extract.o /bin/sh /tmp/B.GLV3PE/BUILD/php74-pecl-solr-2.5.0/libtool --mode=compile i686-pld-linux-gcc -I. -I/tmp/B.GLV3PE/BUILD/php74-pecl-solr-2.5.0 -DPHP_ATOM_INC -I/tmp/B.GLV3PE/BUILD/php74-pecl-solr-2.5.0/include -I/tmp/B.GLV3PE/BUILD/php74-pecl-solr-2.5.0/main -I/tmp/B.GLV3PE/BUILD/php74-pecl-solr-2.5.0 -I/usr/include/php -I/usr/include/php/main -I/usr/include/php/TSRM -I/usr/include/php/Zend -I/usr/include/php/ext -I/usr/include/php/ext/date/lib -I/usr/include/libxml2 -I/usr/include/php -I/usr/include/php/main -I/usr/include/php/TSRM -I/usr/include/php/Zend -I/usr/include/php/ext -I/usr/include/php/ext/date/lib -I/usr/include/libxml2 -DHAVE_CONFIG_H -O2 -fwrapv -pipe -Wformat -Werror=format-security -gdwarf-4 -fno-debug-types-section -fvar-tracking-assignments -g2 -Wp,-D_FORTIFY_SOURCE=2 -fstack-protector-strong --param=ssp-buffer-size=4 -Werror=trampolines -fomit-frame-pointer -march=i686 -fasynchronous-unwind-tables -mtune=pentium4 -gdwarf-4 -fno-debug-types-section -fvar-tracking-assignments -g2 -c /tmp/B.GLV3PE/BUILD/php74-pecl-solr-2.5.0/src/php7/php_solr_client.c -o src/php7/php_solr_client.lo libtool: compile: i686-pld-linux-gcc -I. -I/tmp/B.GLV3PE/BUILD/php74-pecl-solr-2.5.0 -DPHP_ATOM_INC -I/tmp/B.GLV3PE/BUILD/php74-pecl-solr-2.5.0/include -I/tmp/B.GLV3PE/BUILD/php74-pecl-solr-2.5.0/main -I/tmp/B.GLV3PE/BUILD/php74-pecl-solr-2.5.0 -I/usr/include/php -I/usr/include/php/main -I/usr/include/php/TSRM -I/usr/include/php/Zend -I/usr/include/php/ext -I/usr/include/php/ext/date/lib -I/usr/include/libxml2 -I/usr/include/php -I/usr/include/php/main -I/usr/include/php/TSRM -I/usr/include/php/Zend -I/usr/include/php/ext -I/usr/include/php/ext/date/lib -I/usr/include/libxml2 -DHAVE_CONFIG_H -O2 -fwrapv -pipe -Wformat -Werror=format-security -gdwarf-4 -fno-debug-types-section -fvar-tracking-assignments -g2 -Wp,-D_FORTIFY_SOURCE=2 -fstack-protector-strong --param=ssp-buffer-size=4 -Werror=trampolines -fomit-frame-pointer -march=i686 -fasynchronous-unwind-tables -mtune=pentium4 -gdwarf-4 -fno-debug-types-section -fvar-tracking-assignments -g2 -c /tmp/B.GLV3PE/BUILD/php74-pecl-solr-2.5.0/src/php7/php_solr_client.c -fPIC -DPIC -o src/php7/.libs/php_solr_client.o /bin/sh /tmp/B.GLV3PE/BUILD/php74-pecl-solr-2.5.0/libtool --mode=compile i686-pld-linux-gcc -I. -I/tmp/B.GLV3PE/BUILD/php74-pecl-solr-2.5.0 -DPHP_ATOM_INC -I/tmp/B.GLV3PE/BUILD/php74-pecl-solr-2.5.0/include -I/tmp/B.GLV3PE/BUILD/php74-pecl-solr-2.5.0/main -I/tmp/B.GLV3PE/BUILD/php74-pecl-solr-2.5.0 -I/usr/include/php -I/usr/include/php/main -I/usr/include/php/TSRM -I/usr/include/php/Zend -I/usr/include/php/ext -I/usr/include/php/ext/date/lib -I/usr/include/libxml2 -I/usr/include/php -I/usr/include/php/main -I/usr/include/php/TSRM -I/usr/include/php/Zend -I/usr/include/php/ext -I/usr/include/php/ext/date/lib -I/usr/include/libxml2 -DHAVE_CONFIG_H -O2 -fwrapv -pipe -Wformat -Werror=format-security -gdwarf-4 -fno-debug-types-section -fvar-tracking-assignments -g2 -Wp,-D_FORTIFY_SOURCE=2 -fstack-protector-strong --param=ssp-buffer-size=4 -Werror=trampolines -fomit-frame-pointer -march=i686 -fasynchronous-unwind-tables -mtune=pentium4 -gdwarf-4 -fno-debug-types-section -fvar-tracking-assignments -g2 -c /tmp/B.GLV3PE/BUILD/php74-pecl-solr-2.5.0/src/php7/php_solr_collapse_function.c -o src/php7/php_solr_collapse_function.lo libtool: compile: i686-pld-linux-gcc -I. -I/tmp/B.GLV3PE/BUILD/php74-pecl-solr-2.5.0 -DPHP_ATOM_INC -I/tmp/B.GLV3PE/BUILD/php74-pecl-solr-2.5.0/include -I/tmp/B.GLV3PE/BUILD/php74-pecl-solr-2.5.0/main -I/tmp/B.GLV3PE/BUILD/php74-pecl-solr-2.5.0 -I/usr/include/php -I/usr/include/php/main -I/usr/include/php/TSRM -I/usr/include/php/Zend -I/usr/include/php/ext -I/usr/include/php/ext/date/lib -I/usr/include/libxml2 -I/usr/include/php -I/usr/include/php/main -I/usr/include/php/TSRM -I/usr/include/php/Zend -I/usr/include/php/ext -I/usr/include/php/ext/date/lib -I/usr/include/libxml2 -DHAVE_CONFIG_H -O2 -fwrapv -pipe -Wformat -Werror=format-security -gdwarf-4 -fno-debug-types-section -fvar-tracking-assignments -g2 -Wp,-D_FORTIFY_SOURCE=2 -fstack-protector-strong --param=ssp-buffer-size=4 -Werror=trampolines -fomit-frame-pointer -march=i686 -fasynchronous-unwind-tables -mtune=pentium4 -gdwarf-4 -fno-debug-types-section -fvar-tracking-assignments -g2 -c /tmp/B.GLV3PE/BUILD/php74-pecl-solr-2.5.0/src/php7/php_solr_collapse_function.c -fPIC -DPIC -o src/php7/.libs/php_solr_collapse_function.o /bin/sh /tmp/B.GLV3PE/BUILD/php74-pecl-solr-2.5.0/libtool --mode=compile i686-pld-linux-gcc -I. -I/tmp/B.GLV3PE/BUILD/php74-pecl-solr-2.5.0 -DPHP_ATOM_INC -I/tmp/B.GLV3PE/BUILD/php74-pecl-solr-2.5.0/include -I/tmp/B.GLV3PE/BUILD/php74-pecl-solr-2.5.0/main -I/tmp/B.GLV3PE/BUILD/php74-pecl-solr-2.5.0 -I/usr/include/php -I/usr/include/php/main -I/usr/include/php/TSRM -I/usr/include/php/Zend -I/usr/include/php/ext -I/usr/include/php/ext/date/lib -I/usr/include/libxml2 -I/usr/include/php -I/usr/include/php/main -I/usr/include/php/TSRM -I/usr/include/php/Zend -I/usr/include/php/ext -I/usr/include/php/ext/date/lib -I/usr/include/libxml2 -DHAVE_CONFIG_H -O2 -fwrapv -pipe -Wformat -Werror=format-security -gdwarf-4 -fno-debug-types-section -fvar-tracking-assignments -g2 -Wp,-D_FORTIFY_SOURCE=2 -fstack-protector-strong --param=ssp-buffer-size=4 -Werror=trampolines -fomit-frame-pointer -march=i686 -fasynchronous-unwind-tables -mtune=pentium4 -gdwarf-4 -fno-debug-types-section -fvar-tracking-assignments -g2 -c /tmp/B.GLV3PE/BUILD/php74-pecl-solr-2.5.0/src/php7/solr_string.c -o src/php7/solr_string.lo libtool: compile: i686-pld-linux-gcc -I. -I/tmp/B.GLV3PE/BUILD/php74-pecl-solr-2.5.0 -DPHP_ATOM_INC -I/tmp/B.GLV3PE/BUILD/php74-pecl-solr-2.5.0/include -I/tmp/B.GLV3PE/BUILD/php74-pecl-solr-2.5.0/main -I/tmp/B.GLV3PE/BUILD/php74-pecl-solr-2.5.0 -I/usr/include/php -I/usr/include/php/main -I/usr/include/php/TSRM -I/usr/include/php/Zend -I/usr/include/php/ext -I/usr/include/php/ext/date/lib -I/usr/include/libxml2 -I/usr/include/php -I/usr/include/php/main -I/usr/include/php/TSRM -I/usr/include/php/Zend -I/usr/include/php/ext -I/usr/include/php/ext/date/lib -I/usr/include/libxml2 -DHAVE_CONFIG_H -O2 -fwrapv -pipe -Wformat -Werror=format-security -gdwarf-4 -fno-debug-types-section -fvar-tracking-assignments -g2 -Wp,-D_FORTIFY_SOURCE=2 -fstack-protector-strong --param=ssp-buffer-size=4 -Werror=trampolines -fomit-frame-pointer -march=i686 -fasynchronous-unwind-tables -mtune=pentium4 -gdwarf-4 -fno-debug-types-section -fvar-tracking-assignments -g2 -c /tmp/B.GLV3PE/BUILD/php74-pecl-solr-2.5.0/src/php7/solr_string.c -fPIC -DPIC -o src/php7/.libs/solr_string.o /bin/sh /tmp/B.GLV3PE/BUILD/php74-pecl-solr-2.5.0/libtool --mode=compile i686-pld-linux-gcc -I. -I/tmp/B.GLV3PE/BUILD/php74-pecl-solr-2.5.0 -DPHP_ATOM_INC -I/tmp/B.GLV3PE/BUILD/php74-pecl-solr-2.5.0/include -I/tmp/B.GLV3PE/BUILD/php74-pecl-solr-2.5.0/main -I/tmp/B.GLV3PE/BUILD/php74-pecl-solr-2.5.0 -I/usr/include/php -I/usr/include/php/main -I/usr/include/php/TSRM -I/usr/include/php/Zend -I/usr/include/php/ext -I/usr/include/php/ext/date/lib -I/usr/include/libxml2 -I/usr/include/php -I/usr/include/php/main -I/usr/include/php/TSRM -I/usr/include/php/Zend -I/usr/include/php/ext -I/usr/include/php/ext/date/lib -I/usr/include/libxml2 -DHAVE_CONFIG_H -O2 -fwrapv -pipe -Wformat -Werror=format-security -gdwarf-4 -fno-debug-types-section -fvar-tracking-assignments -g2 -Wp,-D_FORTIFY_SOURCE=2 -fstack-protector-strong --param=ssp-buffer-size=4 -Werror=trampolines -fomit-frame-pointer -march=i686 -fasynchronous-unwind-tables -mtune=pentium4 -gdwarf-4 -fno-debug-types-section -fvar-tracking-assignments -g2 -c /tmp/B.GLV3PE/BUILD/php74-pecl-solr-2.5.0/src/php7/solr_functions_document.c -o src/php7/solr_functions_document.lo libtool: compile: i686-pld-linux-gcc -I. -I/tmp/B.GLV3PE/BUILD/php74-pecl-solr-2.5.0 -DPHP_ATOM_INC -I/tmp/B.GLV3PE/BUILD/php74-pecl-solr-2.5.0/include -I/tmp/B.GLV3PE/BUILD/php74-pecl-solr-2.5.0/main -I/tmp/B.GLV3PE/BUILD/php74-pecl-solr-2.5.0 -I/usr/include/php -I/usr/include/php/main -I/usr/include/php/TSRM -I/usr/include/php/Zend -I/usr/include/php/ext -I/usr/include/php/ext/date/lib -I/usr/include/libxml2 -I/usr/include/php -I/usr/include/php/main -I/usr/include/php/TSRM -I/usr/include/php/Zend -I/usr/include/php/ext -I/usr/include/php/ext/date/lib -I/usr/include/libxml2 -DHAVE_CONFIG_H -O2 -fwrapv -pipe -Wformat -Werror=format-security -gdwarf-4 -fno-debug-types-section -fvar-tracking-assignments -g2 -Wp,-D_FORTIFY_SOURCE=2 -fstack-protector-strong --param=ssp-buffer-size=4 -Werror=trampolines -fomit-frame-pointer -march=i686 -fasynchronous-unwind-tables -mtune=pentium4 -gdwarf-4 -fno-debug-types-section -fvar-tracking-assignments -g2 -c /tmp/B.GLV3PE/BUILD/php74-pecl-solr-2.5.0/src/php7/solr_functions_document.c -fPIC -DPIC -o src/php7/.libs/solr_functions_document.o /bin/sh /tmp/B.GLV3PE/BUILD/php74-pecl-solr-2.5.0/libtool --mode=compile i686-pld-linux-gcc -I. -I/tmp/B.GLV3PE/BUILD/php74-pecl-solr-2.5.0 -DPHP_ATOM_INC -I/tmp/B.GLV3PE/BUILD/php74-pecl-solr-2.5.0/include -I/tmp/B.GLV3PE/BUILD/php74-pecl-solr-2.5.0/main -I/tmp/B.GLV3PE/BUILD/php74-pecl-solr-2.5.0 -I/usr/include/php -I/usr/include/php/main -I/usr/include/php/TSRM -I/usr/include/php/Zend -I/usr/include/php/ext -I/usr/include/php/ext/date/lib -I/usr/include/libxml2 -I/usr/include/php -I/usr/include/php/main -I/usr/include/php/TSRM -I/usr/include/php/Zend -I/usr/include/php/ext -I/usr/include/php/ext/date/lib -I/usr/include/libxml2 -DHAVE_CONFIG_H -O2 -fwrapv -pipe -Wformat -Werror=format-security -gdwarf-4 -fno-debug-types-section -fvar-tracking-assignments -g2 -Wp,-D_FORTIFY_SOURCE=2 -fstack-protector-strong --param=ssp-buffer-size=4 -Werror=trampolines -fomit-frame-pointer -march=i686 -fasynchronous-unwind-tables -mtune=pentium4 -gdwarf-4 -fno-debug-types-section -fvar-tracking-assignments -g2 -c /tmp/B.GLV3PE/BUILD/php74-pecl-solr-2.5.0/src/php7/solr_functions_response.c -o src/php7/solr_functions_response.lo libtool: compile: i686-pld-linux-gcc -I. -I/tmp/B.GLV3PE/BUILD/php74-pecl-solr-2.5.0 -DPHP_ATOM_INC -I/tmp/B.GLV3PE/BUILD/php74-pecl-solr-2.5.0/include -I/tmp/B.GLV3PE/BUILD/php74-pecl-solr-2.5.0/main -I/tmp/B.GLV3PE/BUILD/php74-pecl-solr-2.5.0 -I/usr/include/php -I/usr/include/php/main -I/usr/include/php/TSRM -I/usr/include/php/Zend -I/usr/include/php/ext -I/usr/include/php/ext/date/lib -I/usr/include/libxml2 -I/usr/include/php -I/usr/include/php/main -I/usr/include/php/TSRM -I/usr/include/php/Zend -I/usr/include/php/ext -I/usr/include/php/ext/date/lib -I/usr/include/libxml2 -DHAVE_CONFIG_H -O2 -fwrapv -pipe -Wformat -Werror=format-security -gdwarf-4 -fno-debug-types-section -fvar-tracking-assignments -g2 -Wp,-D_FORTIFY_SOURCE=2 -fstack-protector-strong --param=ssp-buffer-size=4 -Werror=trampolines -fomit-frame-pointer -march=i686 -fasynchronous-unwind-tables -mtune=pentium4 -gdwarf-4 -fno-debug-types-section -fvar-tracking-assignments -g2 -c /tmp/B.GLV3PE/BUILD/php74-pecl-solr-2.5.0/src/php7/solr_functions_response.c -fPIC -DPIC -o src/php7/.libs/solr_functions_response.o /bin/sh /tmp/B.GLV3PE/BUILD/php74-pecl-solr-2.5.0/libtool --mode=compile i686-pld-linux-gcc -I. -I/tmp/B.GLV3PE/BUILD/php74-pecl-solr-2.5.0 -DPHP_ATOM_INC -I/tmp/B.GLV3PE/BUILD/php74-pecl-solr-2.5.0/include -I/tmp/B.GLV3PE/BUILD/php74-pecl-solr-2.5.0/main -I/tmp/B.GLV3PE/BUILD/php74-pecl-solr-2.5.0 -I/usr/include/php -I/usr/include/php/main -I/usr/include/php/TSRM -I/usr/include/php/Zend -I/usr/include/php/ext -I/usr/include/php/ext/date/lib -I/usr/include/libxml2 -I/usr/include/php -I/usr/include/php/main -I/usr/include/php/TSRM -I/usr/include/php/Zend -I/usr/include/php/ext -I/usr/include/php/ext/date/lib -I/usr/include/libxml2 -DHAVE_CONFIG_H -O2 -fwrapv -pipe -Wformat -Werror=format-security -gdwarf-4 -fno-debug-types-section -fvar-tracking-assignments -g2 -Wp,-D_FORTIFY_SOURCE=2 -fstack-protector-strong --param=ssp-buffer-size=4 -Werror=trampolines -fomit-frame-pointer -march=i686 -fasynchronous-unwind-tables -mtune=pentium4 -gdwarf-4 -fno-debug-types-section -fvar-tracking-assignments -g2 -c /tmp/B.GLV3PE/BUILD/php74-pecl-solr-2.5.0/src/php7/php_solr_dismax_query.c -o src/php7/php_solr_dismax_query.lo libtool: compile: i686-pld-linux-gcc -I. -I/tmp/B.GLV3PE/BUILD/php74-pecl-solr-2.5.0 -DPHP_ATOM_INC -I/tmp/B.GLV3PE/BUILD/php74-pecl-solr-2.5.0/include -I/tmp/B.GLV3PE/BUILD/php74-pecl-solr-2.5.0/main -I/tmp/B.GLV3PE/BUILD/php74-pecl-solr-2.5.0 -I/usr/include/php -I/usr/include/php/main -I/usr/include/php/TSRM -I/usr/include/php/Zend -I/usr/include/php/ext -I/usr/include/php/ext/date/lib -I/usr/include/libxml2 -I/usr/include/php -I/usr/include/php/main -I/usr/include/php/TSRM -I/usr/include/php/Zend -I/usr/include/php/ext -I/usr/include/php/ext/date/lib -I/usr/include/libxml2 -DHAVE_CONFIG_H -O2 -fwrapv -pipe -Wformat -Werror=format-security -gdwarf-4 -fno-debug-types-section -fvar-tracking-assignments -g2 -Wp,-D_FORTIFY_SOURCE=2 -fstack-protector-strong --param=ssp-buffer-size=4 -Werror=trampolines -fomit-frame-pointer -march=i686 -fasynchronous-unwind-tables -mtune=pentium4 -gdwarf-4 -fno-debug-types-section -fvar-tracking-assignments -g2 -c /tmp/B.GLV3PE/BUILD/php74-pecl-solr-2.5.0/src/php7/php_solr_dismax_query.c -fPIC -DPIC -o src/php7/.libs/php_solr_dismax_query.o /bin/sh /tmp/B.GLV3PE/BUILD/php74-pecl-solr-2.5.0/libtool --mode=compile i686-pld-linux-gcc -I. -I/tmp/B.GLV3PE/BUILD/php74-pecl-solr-2.5.0 -DPHP_ATOM_INC -I/tmp/B.GLV3PE/BUILD/php74-pecl-solr-2.5.0/include -I/tmp/B.GLV3PE/BUILD/php74-pecl-solr-2.5.0/main -I/tmp/B.GLV3PE/BUILD/php74-pecl-solr-2.5.0 -I/usr/include/php -I/usr/include/php/main -I/usr/include/php/TSRM -I/usr/include/php/Zend -I/usr/include/php/ext -I/usr/include/php/ext/date/lib -I/usr/include/libxml2 -I/usr/include/php -I/usr/include/php/main -I/usr/include/php/TSRM -I/usr/include/php/Zend -I/usr/include/php/ext -I/usr/include/php/ext/date/lib -I/usr/include/libxml2 -DHAVE_CONFIG_H -O2 -fwrapv -pipe -Wformat -Werror=format-security -gdwarf-4 -fno-debug-types-section -fvar-tracking-assignments -g2 -Wp,-D_FORTIFY_SOURCE=2 -fstack-protector-strong --param=ssp-buffer-size=4 -Werror=trampolines -fomit-frame-pointer -march=i686 -fasynchronous-unwind-tables -mtune=pentium4 -gdwarf-4 -fno-debug-types-section -fvar-tracking-assignments -g2 -c /tmp/B.GLV3PE/BUILD/php74-pecl-solr-2.5.0/src/php7/solr_functions_debug.c -o src/php7/solr_functions_debug.lo libtool: compile: i686-pld-linux-gcc -I. -I/tmp/B.GLV3PE/BUILD/php74-pecl-solr-2.5.0 -DPHP_ATOM_INC -I/tmp/B.GLV3PE/BUILD/php74-pecl-solr-2.5.0/include -I/tmp/B.GLV3PE/BUILD/php74-pecl-solr-2.5.0/main -I/tmp/B.GLV3PE/BUILD/php74-pecl-solr-2.5.0 -I/usr/include/php -I/usr/include/php/main -I/usr/include/php/TSRM -I/usr/include/php/Zend -I/usr/include/php/ext -I/usr/include/php/ext/date/lib -I/usr/include/libxml2 -I/usr/include/php -I/usr/include/php/main -I/usr/include/php/TSRM -I/usr/include/php/Zend -I/usr/include/php/ext -I/usr/include/php/ext/date/lib -I/usr/include/libxml2 -DHAVE_CONFIG_H -O2 -fwrapv -pipe -Wformat -Werror=format-security -gdwarf-4 -fno-debug-types-section -fvar-tracking-assignments -g2 -Wp,-D_FORTIFY_SOURCE=2 -fstack-protector-strong --param=ssp-buffer-size=4 -Werror=trampolines -fomit-frame-pointer -march=i686 -fasynchronous-unwind-tables -mtune=pentium4 -gdwarf-4 -fno-debug-types-section -fvar-tracking-assignments -g2 -c /tmp/B.GLV3PE/BUILD/php74-pecl-solr-2.5.0/src/php7/solr_functions_debug.c -fPIC -DPIC -o src/php7/.libs/solr_functions_debug.o /bin/sh /tmp/B.GLV3PE/BUILD/php74-pecl-solr-2.5.0/libtool --mode=compile i686-pld-linux-gcc -I. -I/tmp/B.GLV3PE/BUILD/php74-pecl-solr-2.5.0 -DPHP_ATOM_INC -I/tmp/B.GLV3PE/BUILD/php74-pecl-solr-2.5.0/include -I/tmp/B.GLV3PE/BUILD/php74-pecl-solr-2.5.0/main -I/tmp/B.GLV3PE/BUILD/php74-pecl-solr-2.5.0 -I/usr/include/php -I/usr/include/php/main -I/usr/include/php/TSRM -I/usr/include/php/Zend -I/usr/include/php/ext -I/usr/include/php/ext/date/lib -I/usr/include/libxml2 -I/usr/include/php -I/usr/include/php/main -I/usr/include/php/TSRM -I/usr/include/php/Zend -I/usr/include/php/ext -I/usr/include/php/ext/date/lib -I/usr/include/libxml2 -DHAVE_CONFIG_H -O2 -fwrapv -pipe -Wformat -Werror=format-security -gdwarf-4 -fno-debug-types-section -fvar-tracking-assignments -g2 -Wp,-D_FORTIFY_SOURCE=2 -fstack-protector-strong --param=ssp-buffer-size=4 -Werror=trampolines -fomit-frame-pointer -march=i686 -fasynchronous-unwind-tables -mtune=pentium4 -gdwarf-4 -fno-debug-types-section -fvar-tracking-assignments -g2 -c /tmp/B.GLV3PE/BUILD/php74-pecl-solr-2.5.0/src/php7/solr_functions_helpers.c -o src/php7/solr_functions_helpers.lo libtool: compile: i686-pld-linux-gcc -I. -I/tmp/B.GLV3PE/BUILD/php74-pecl-solr-2.5.0 -DPHP_ATOM_INC -I/tmp/B.GLV3PE/BUILD/php74-pecl-solr-2.5.0/include -I/tmp/B.GLV3PE/BUILD/php74-pecl-solr-2.5.0/main -I/tmp/B.GLV3PE/BUILD/php74-pecl-solr-2.5.0 -I/usr/include/php -I/usr/include/php/main -I/usr/include/php/TSRM -I/usr/include/php/Zend -I/usr/include/php/ext -I/usr/include/php/ext/date/lib -I/usr/include/libxml2 -I/usr/include/php -I/usr/include/php/main -I/usr/include/php/TSRM -I/usr/include/php/Zend -I/usr/include/php/ext -I/usr/include/php/ext/date/lib -I/usr/include/libxml2 -DHAVE_CONFIG_H -O2 -fwrapv -pipe -Wformat -Werror=format-security -gdwarf-4 -fno-debug-types-section -fvar-tracking-assignments -g2 -Wp,-D_FORTIFY_SOURCE=2 -fstack-protector-strong --param=ssp-buffer-size=4 -Werror=trampolines -fomit-frame-pointer -march=i686 -fasynchronous-unwind-tables -mtune=pentium4 -gdwarf-4 -fno-debug-types-section -fvar-tracking-assignments -g2 -c /tmp/B.GLV3PE/BUILD/php74-pecl-solr-2.5.0/src/php7/solr_functions_helpers.c -fPIC -DPIC -o src/php7/.libs/solr_functions_helpers.o /bin/sh /tmp/B.GLV3PE/BUILD/php74-pecl-solr-2.5.0/libtool --mode=compile i686-pld-linux-gcc -I. -I/tmp/B.GLV3PE/BUILD/php74-pecl-solr-2.5.0 -DPHP_ATOM_INC -I/tmp/B.GLV3PE/BUILD/php74-pecl-solr-2.5.0/include -I/tmp/B.GLV3PE/BUILD/php74-pecl-solr-2.5.0/main -I/tmp/B.GLV3PE/BUILD/php74-pecl-solr-2.5.0 -I/usr/include/php -I/usr/include/php/main -I/usr/include/php/TSRM -I/usr/include/php/Zend -I/usr/include/php/ext -I/usr/include/php/ext/date/lib -I/usr/include/libxml2 -I/usr/include/php -I/usr/include/php/main -I/usr/include/php/TSRM -I/usr/include/php/Zend -I/usr/include/php/ext -I/usr/include/php/ext/date/lib -I/usr/include/libxml2 -DHAVE_CONFIG_H -O2 -fwrapv -pipe -Wformat -Werror=format-security -gdwarf-4 -fno-debug-types-section -fvar-tracking-assignments -g2 -Wp,-D_FORTIFY_SOURCE=2 -fstack-protector-strong --param=ssp-buffer-size=4 -Werror=trampolines -fomit-frame-pointer -march=i686 -fasynchronous-unwind-tables -mtune=pentium4 -gdwarf-4 -fno-debug-types-section -fvar-tracking-assignments -g2 -c /tmp/B.GLV3PE/BUILD/php74-pecl-solr-2.5.0/src/php7/solr_functions_client.c -o src/php7/solr_functions_client.lo libtool: compile: i686-pld-linux-gcc -I. -I/tmp/B.GLV3PE/BUILD/php74-pecl-solr-2.5.0 -DPHP_ATOM_INC -I/tmp/B.GLV3PE/BUILD/php74-pecl-solr-2.5.0/include -I/tmp/B.GLV3PE/BUILD/php74-pecl-solr-2.5.0/main -I/tmp/B.GLV3PE/BUILD/php74-pecl-solr-2.5.0 -I/usr/include/php -I/usr/include/php/main -I/usr/include/php/TSRM -I/usr/include/php/Zend -I/usr/include/php/ext -I/usr/include/php/ext/date/lib -I/usr/include/libxml2 -I/usr/include/php -I/usr/include/php/main -I/usr/include/php/TSRM -I/usr/include/php/Zend -I/usr/include/php/ext -I/usr/include/php/ext/date/lib -I/usr/include/libxml2 -DHAVE_CONFIG_H -O2 -fwrapv -pipe -Wformat -Werror=format-security -gdwarf-4 -fno-debug-types-section -fvar-tracking-assignments -g2 -Wp,-D_FORTIFY_SOURCE=2 -fstack-protector-strong --param=ssp-buffer-size=4 -Werror=trampolines -fomit-frame-pointer -march=i686 -fasynchronous-unwind-tables -mtune=pentium4 -gdwarf-4 -fno-debug-types-section -fvar-tracking-assignments -g2 -c /tmp/B.GLV3PE/BUILD/php74-pecl-solr-2.5.0/src/php7/solr_functions_client.c -fPIC -DPIC -o src/php7/.libs/solr_functions_client.o /bin/sh /tmp/B.GLV3PE/BUILD/php74-pecl-solr-2.5.0/libtool --mode=compile i686-pld-linux-gcc -I. -I/tmp/B.GLV3PE/BUILD/php74-pecl-solr-2.5.0 -DPHP_ATOM_INC -I/tmp/B.GLV3PE/BUILD/php74-pecl-solr-2.5.0/include -I/tmp/B.GLV3PE/BUILD/php74-pecl-solr-2.5.0/main -I/tmp/B.GLV3PE/BUILD/php74-pecl-solr-2.5.0 -I/usr/include/php -I/usr/include/php/main -I/usr/include/php/TSRM -I/usr/include/php/Zend -I/usr/include/php/ext -I/usr/include/php/ext/date/lib -I/usr/include/libxml2 -I/usr/include/php -I/usr/include/php/main -I/usr/include/php/TSRM -I/usr/include/php/Zend -I/usr/include/php/ext -I/usr/include/php/ext/date/lib -I/usr/include/libxml2 -DHAVE_CONFIG_H -O2 -fwrapv -pipe -Wformat -Werror=format-security -gdwarf-4 -fno-debug-types-section -fvar-tracking-assignments -g2 -Wp,-D_FORTIFY_SOURCE=2 -fstack-protector-strong --param=ssp-buffer-size=4 -Werror=trampolines -fomit-frame-pointer -march=i686 -fasynchronous-unwind-tables -mtune=pentium4 -gdwarf-4 -fno-debug-types-section -fvar-tracking-assignments -g2 -c /tmp/B.GLV3PE/BUILD/php74-pecl-solr-2.5.0/src/php7/solr_functions_params.c -o src/php7/solr_functions_params.lo libtool: compile: i686-pld-linux-gcc -I. -I/tmp/B.GLV3PE/BUILD/php74-pecl-solr-2.5.0 -DPHP_ATOM_INC -I/tmp/B.GLV3PE/BUILD/php74-pecl-solr-2.5.0/include -I/tmp/B.GLV3PE/BUILD/php74-pecl-solr-2.5.0/main -I/tmp/B.GLV3PE/BUILD/php74-pecl-solr-2.5.0 -I/usr/include/php -I/usr/include/php/main -I/usr/include/php/TSRM -I/usr/include/php/Zend -I/usr/include/php/ext -I/usr/include/php/ext/date/lib -I/usr/include/libxml2 -I/usr/include/php -I/usr/include/php/main -I/usr/include/php/TSRM -I/usr/include/php/Zend -I/usr/include/php/ext -I/usr/include/php/ext/date/lib -I/usr/include/libxml2 -DHAVE_CONFIG_H -O2 -fwrapv -pipe -Wformat -Werror=format-security -gdwarf-4 -fno-debug-types-section -fvar-tracking-assignments -g2 -Wp,-D_FORTIFY_SOURCE=2 -fstack-protector-strong --param=ssp-buffer-size=4 -Werror=trampolines -fomit-frame-pointer -march=i686 -fasynchronous-unwind-tables -mtune=pentium4 -gdwarf-4 -fno-debug-types-section -fvar-tracking-assignments -g2 -c /tmp/B.GLV3PE/BUILD/php74-pecl-solr-2.5.0/src/php7/solr_functions_params.c -fPIC -DPIC -o src/php7/.libs/solr_functions_params.o /bin/sh /tmp/B.GLV3PE/BUILD/php74-pecl-solr-2.5.0/libtool --mode=compile i686-pld-linux-gcc -I. -I/tmp/B.GLV3PE/BUILD/php74-pecl-solr-2.5.0 -DPHP_ATOM_INC -I/tmp/B.GLV3PE/BUILD/php74-pecl-solr-2.5.0/include -I/tmp/B.GLV3PE/BUILD/php74-pecl-solr-2.5.0/main -I/tmp/B.GLV3PE/BUILD/php74-pecl-solr-2.5.0 -I/usr/include/php -I/usr/include/php/main -I/usr/include/php/TSRM -I/usr/include/php/Zend -I/usr/include/php/ext -I/usr/include/php/ext/date/lib -I/usr/include/libxml2 -I/usr/include/php -I/usr/include/php/main -I/usr/include/php/TSRM -I/usr/include/php/Zend -I/usr/include/php/ext -I/usr/include/php/ext/date/lib -I/usr/include/libxml2 -DHAVE_CONFIG_H -O2 -fwrapv -pipe -Wformat -Werror=format-security -gdwarf-4 -fno-debug-types-section -fvar-tracking-assignments -g2 -Wp,-D_FORTIFY_SOURCE=2 -fstack-protector-strong --param=ssp-buffer-size=4 -Werror=trampolines -fomit-frame-pointer -march=i686 -fasynchronous-unwind-tables -mtune=pentium4 -gdwarf-4 -fno-debug-types-section -fvar-tracking-assignments -g2 -c /tmp/B.GLV3PE/BUILD/php74-pecl-solr-2.5.0/src/php7/php_solr_query.c -o src/php7/php_solr_query.lo libtool: compile: i686-pld-linux-gcc -I. -I/tmp/B.GLV3PE/BUILD/php74-pecl-solr-2.5.0 -DPHP_ATOM_INC -I/tmp/B.GLV3PE/BUILD/php74-pecl-solr-2.5.0/include -I/tmp/B.GLV3PE/BUILD/php74-pecl-solr-2.5.0/main -I/tmp/B.GLV3PE/BUILD/php74-pecl-solr-2.5.0 -I/usr/include/php -I/usr/include/php/main -I/usr/include/php/TSRM -I/usr/include/php/Zend -I/usr/include/php/ext -I/usr/include/php/ext/date/lib -I/usr/include/libxml2 -I/usr/include/php -I/usr/include/php/main -I/usr/include/php/TSRM -I/usr/include/php/Zend -I/usr/include/php/ext -I/usr/include/php/ext/date/lib -I/usr/include/libxml2 -DHAVE_CONFIG_H -O2 -fwrapv -pipe -Wformat -Werror=format-security -gdwarf-4 -fno-debug-types-section -fvar-tracking-assignments -g2 -Wp,-D_FORTIFY_SOURCE=2 -fstack-protector-strong --param=ssp-buffer-size=4 -Werror=trampolines -fomit-frame-pointer -march=i686 -fasynchronous-unwind-tables -mtune=pentium4 -gdwarf-4 -fno-debug-types-section -fvar-tracking-assignments -g2 -c /tmp/B.GLV3PE/BUILD/php74-pecl-solr-2.5.0/src/php7/php_solr_query.c -fPIC -DPIC -o src/php7/.libs/php_solr_query.o /bin/sh /tmp/B.GLV3PE/BUILD/php74-pecl-solr-2.5.0/libtool --mode=link i686-pld-linux-gcc -DPHP_ATOM_INC -I/tmp/B.GLV3PE/BUILD/php74-pecl-solr-2.5.0/include -I/tmp/B.GLV3PE/BUILD/php74-pecl-solr-2.5.0/main -I/tmp/B.GLV3PE/BUILD/php74-pecl-solr-2.5.0 -I/usr/include/php -I/usr/include/php/main -I/usr/include/php/TSRM -I/usr/include/php/Zend -I/usr/include/php/ext -I/usr/include/php/ext/date/lib -I/usr/include/libxml2 -I/usr/include/php -I/usr/include/php/main -I/usr/include/php/TSRM -I/usr/include/php/Zend -I/usr/include/php/ext -I/usr/include/php/ext/date/lib -I/usr/include/libxml2 -DHAVE_CONFIG_H -O2 -fwrapv -pipe -Wformat -Werror=format-security -gdwarf-4 -fno-debug-types-section -fvar-tracking-assignments -g2 -Wp,-D_FORTIFY_SOURCE=2 -fstack-protector-strong --param=ssp-buffer-size=4 -Werror=trampolines -fomit-frame-pointer -march=i686 -fasynchronous-unwind-tables -mtune=pentium4 -gdwarf-4 -fno-debug-types-section -fvar-tracking-assignments -g2 -Wl,--as-needed -Wl,--no-copy-dt-needed-entries -Wl,-z,relro -Wl,-z,combreloc -o solr.la -export-dynamic -avoid-version -prefer-pic -module -rpath /tmp/B.GLV3PE/BUILD/php74-pecl-solr-2.5.0/modules src/php7/php_solr.lo src/php7/php_solr_object.lo src/php7/php_solr_document.lo src/php7/php_solr_input_document.lo src/php7/php_solr_client.lo src/php7/php_solr_params.lo src/php7/php_solr_query.lo src/php7/php_solr_response.lo src/php7/php_solr_exception.lo src/php7/php_solr_utils.lo src/php7/php_solr_dismax_query.lo src/php7/php_solr_collapse_function.lo src/php7/php_solr_extract.lo src/php7/solr_string.lo src/php7/solr_functions_document.lo src/php7/solr_functions_client.lo src/php7/solr_functions_helpers.lo src/php7/solr_functions_params.lo src/php7/solr_functions_response.lo src/php7/solr_functions_debug.lo -lcurl -lcurl -lcares -lnghttp2 -lidn2 -lrtmp -lz -lssl -lcrypto -lssh2 -lssh2 -lpsl -lssl -lcrypto -lssl -lcrypto -lgssapi -lldap -llber -lbrotlidec -lz -lxml2 libtool: link: i686-pld-linux-gcc -shared -fPIC -DPIC -O2 -gdwarf-4 -g2 -fstack-protector-strong -march=i686 -mtune=pentium4 -gdwarf-4 -g2 -Wl,--as-needed -Wl,--no-copy-dt-needed-entries -Wl,-z -Wl,relro -Wl,-z -Wl,combreloc -pthread src/php7/.libs/php_solr.o src/php7/.libs/php_solr_object.o src/php7/.libs/php_solr_document.o src/php7/.libs/php_solr_input_document.o src/php7/.libs/php_solr_client.o src/php7/.libs/php_solr_params.o src/php7/.libs/php_solr_query.o src/php7/.libs/php_solr_response.o src/php7/.libs/php_solr_exception.o src/php7/.libs/php_solr_utils.o src/php7/.libs/php_solr_dismax_query.o src/php7/.libs/php_solr_collapse_function.o src/php7/.libs/php_solr_extract.o src/php7/.libs/solr_string.o src/php7/.libs/solr_functions_document.o src/php7/.libs/solr_functions_client.o src/php7/.libs/solr_functions_helpers.o src/php7/.libs/solr_functions_params.o src/php7/.libs/solr_functions_response.o src/php7/.libs/solr_functions_debug.o /usr/lib/libcurl.so -L/usr/lib /usr/lib/libcares.so -lnghttp2 /usr/lib/librtmp.so /usr/lib/libgnutls.so -lp11-kit /usr/lib/libidn2.so /usr/lib/libunistring.so /usr/lib/libtasn1.so -lhogweed -lnettle /usr/lib/libgmp.so /usr/lib/libssh2.so -lpsl /usr/lib/libldap.so /usr/lib/libsasl2.so /usr/lib/libgssapi.so /usr/lib/libheimntlm.so /usr/lib/libkrb5.so /usr/lib/libhx509.so /usr/lib/libwind.so /usr/lib/libsqlite3.so /usr/lib/libhcrypto.so /usr/lib/libheimbase.so /usr/lib/libasn1.so /usr/lib/libroken.so -lcrypt -lpthread -lcom_err -lssl -lcrypto /usr/lib/liblber.so -lresolv /usr/lib/libbrotlidec.so /usr/lib/libbrotlicommon.so /usr/lib/libxml2.so -ldl -lz /usr/lib/liblzma.so -lm -Wl,-soname -Wl,solr.so -o .libs/solr.so libtool: link: ( cd ".libs" && rm -f "solr.la" && ln -s "../solr.la" "solr.la" ) /bin/sh /tmp/B.GLV3PE/BUILD/php74-pecl-solr-2.5.0/libtool --mode=install cp ./solr.la /tmp/B.GLV3PE/BUILD/php74-pecl-solr-2.5.0/modules libtool: install: cp ./.libs/solr.so /tmp/B.GLV3PE/BUILD/php74-pecl-solr-2.5.0/modules/solr.so libtool: install: cp ./.libs/solr.lai /tmp/B.GLV3PE/BUILD/php74-pecl-solr-2.5.0/modules/solr.la libtool: finish: PATH="/home/users/builder/GNUstep/Tools:/usr/local/bin:/usr/bin:/bin:/home/users/builder/bin:/sbin" ldconfig -n /tmp/B.GLV3PE/BUILD/php74-pecl-solr-2.5.0/modules ---------------------------------------------------------------------- Libraries have been installed in: /tmp/B.GLV3PE/BUILD/php74-pecl-solr-2.5.0/modules If you ever happen to want to link against installed libraries in a given directory, LIBDIR, you must either use libtool, and specify the full pathname of the library, or use the '-LLIBDIR' flag during linking and do at least one of the following: - add LIBDIR to the 'LD_LIBRARY_PATH' environment variable during execution - add LIBDIR to the 'LD_RUN_PATH' environment variable during linking - use the '-Wl,-rpath -Wl,LIBDIR' linker flag - have your system administrator add LIBDIR to '/etc/ld.so.conf' See any operating system documentation about shared libraries for more information, such as the ld(1) and ld.so(8) manual pages. ---------------------------------------------------------------------- Build complete. Don't forget to run 'make test'. + >modules.log + /usr/bin/php74 -n -q -d 'extension_dir=modules' -d 'extension=/usr/lib/php74/curl.so' -d 'extension=/usr/lib/php74/json.so' -d 'extension=solr.so' -m + grep solr modules.log solr + ./run-tests.sh --show-diff Build complete. Don't forget to run 'make test'. PHP Warning: PHP Startup: Unable to load dynamic library '/usr/lib/php74/pcre.so' (tried: /usr/lib/php74/pcre.so (/usr/lib/php74/pcre.so: cannot open shared object file: No such file or directory), /tmp/B.GLV3PE/BUILD/php74-pecl-solr-2.5.0/modules///usr/lib/php74/pcre.so.so (/tmp/B.GLV3PE/BUILD/php74-pecl-solr-2.5.0/modules///usr/lib/php74/pcre.so.so: cannot open shared object file: No such file or directory)) in Unknown on line 0 PHP Warning: PHP Startup: Unable to load dynamic library '/usr/lib/php74/pcre.so' (tried: /usr/lib/php74/pcre.so (/usr/lib/php74/pcre.so: cannot open shared object file: No such file or directory), /tmp/B.GLV3PE/BUILD/php74-pecl-solr-2.5.0/modules///usr/lib/php74/pcre.so.so (/tmp/B.GLV3PE/BUILD/php74-pecl-solr-2.5.0/modules///usr/lib/php74/pcre.so.so: cannot open shared object file: No such file or directory)) in Unknown on line 0 PHP Warning: PHP Startup: Unable to load dynamic library '/usr/lib/php74/pcre.so' (tried: /usr/lib/php74/pcre.so (/usr/lib/php74/pcre.so: cannot open shared object file: No such file or directory), /tmp/B.GLV3PE/BUILD/php74-pecl-solr-2.5.0/modules///usr/lib/php74/pcre.so.so (/tmp/B.GLV3PE/BUILD/php74-pecl-solr-2.5.0/modules///usr/lib/php74/pcre.so.so: cannot open shared object file: No such file or directory)) in Unknown on line 0 ===================================================================== PHP : /usr/bin/php74 Warning: PHP Startup: Unable to load dynamic library '/usr/lib/php74/pcre.so' (tried: /usr/lib/php74/pcre.so (/usr/lib/php74/pcre.so: cannot open shared object file: No such file or directory), /tmp/B.GLV3PE/BUILD/php74-pecl-solr-2.5.0/modules///usr/lib/php74/pcre.so.so (/tmp/B.GLV3PE/BUILD/php74-pecl-solr-2.5.0/modules///usr/lib/php74/pcre.so.so: cannot open shared object file: No such file or directory)) in Unknown on line 0 PHP_SAPI : cli PHP_VERSION : 7.4.0alpha1 ZEND_VERSION: 3.4.0-dev PHP_OS : Linux - Linux nereid-builder 4.9.181-1 #1 SMP Wed Jun 12 14:04:16 CEST 2019 i686 INI actual : /tmp/B.GLV3PE/BUILD/php74-pecl-solr-2.5.0/tmp-php.ini More .INIs : CWD : /tmp/B.GLV3PE/BUILD/php74-pecl-solr-2.5.0 Extra dirs : VALGRIND : Not used ===================================================================== TIME START 2019-08-06 14:23:01 ===================================================================== TEST 1/151 [tests/000.solr_server_compat.phpt] SKIP Solr Server 4+ Compatibility Test [tests/000.solr_server_compat.phpt] reason: Solr server is not set up TEST 2/151 [tests/000.solrclient_ping.phpt] SKIP SolrClient::ping() - Ping Solr Server [tests/000.solrclient_ping.phpt] reason: Solr server is not set up TEST 3/151 [tests/001.solrclient_addDocument.phpt] SKIP SolrClient::addDocument() - sending document to the Solr server [tests/001.solrclient_addDocument.phpt] reason: Solr server is not set up TEST 4/151 [tests/001.solrclient_addDocument_partial.phpt] SKIP SolrClient::addDocumnt() - Partial Update (integration) [tests/001.solrclient_addDocument_partial.phpt] reason: Solr server is not set up TEST 5/151 [tests/002.solrclient_addDocuments.phpt] SKIP SolrClient::addDocuments() - sending multiple documents to the Solr server [tests/002.solrclient_addDocuments.phpt] reason: Solr server is not set up TEST 6/151 [tests/003.solrclient_addDocument_no_overwrite.phpt] SKIP SolrClient::addDocument() - Overwrite an existing document [tests/003.solrclient_addDocument_no_overwrite.phpt] reason: Solr server is not set up TEST 7/151 [tests/003.solrclient_addDocuments_commitwithin.phpt] SKIP SolrClient::addDocuments() - sending multiple documents to the Solr server [tests/003.solrclient_addDocuments_commitwithin.phpt] reason: Solr server is not set up TEST 8/151 [tests/003.solrclient_options.phpt] SKIP SolrClient::__construct() - Test options [tests/003.solrclient_options.phpt] reason: Solr server is not set up TEST 9/151 [tests/004.solrclient_query_response.phpt] SKIP SolrClient::query() - Sending a chained query request [tests/004.solrclient_query_response.phpt] reason: Solr server is not set up TEST 10/151 [tests/004.solrclient_query_terms.phpt] SKIP SolrClient::query() - Terms component [tests/004.solrclient_query_terms.phpt] reason: Solr server is not set up TEST 11/151 [tests/005.solrclient_query_error.phpt] SKIP SolrClient::query() - throw SolrClientException on Solr Server exception [tests/005.solrclient_query_error.phpt] reason: Solr server is not set up TEST 12/151 [tests/006.solrclient_system.phpt] SKIP SolrClient::system() - Retrieve Solr Server/System Info [tests/006.solrclient_system.phpt] reason: Solr server is not set up TEST 13/151 [tests/007.solrclient_deleteById.phpt] SKIP SolrClient::deleteById() - Testing deleting a document by ID [tests/007.solrclient_deleteById.phpt] reason: Solr server is not set up TEST 14/151 [tests/007.solrclient_deleteByIds.phpt] SKIP SolrClient::deleteByIds() - Test deleting documents by an array of IDS [tests/007.solrclient_deleteByIds.phpt] reason: Solr server is not set up TEST 15/151 [tests/008.solrclient_commit.phpt] SKIP SolrClient::commit() - Testing commit [tests/008.solrclient_commit.phpt] reason: Solr server is not set up TEST 16/151 [tests/008.solrclient_rollback.phpt] SKIP SolrClient::rollback() - Testing rollback [tests/008.solrclient_rollback.phpt] reason: Solr server is not set up TEST 17/151 [tests/009.solrclient_optimize.phpt] SKIP SolrClient::optimize() - Testing optimize [tests/009.solrclient_optimize.phpt] reason: Solr server is not set up TEST 18/151 [tests/010.solrclient_getOptions.phpt] ========DIFF======== 001+ PHP Warning: PHP Startup: Unable to load dynamic library '/usr/lib/php74/pcre.so' (tried: /usr/lib/php74/pcre.so (/usr/lib/php74/pcre.so: cannot open shared object file: No such file or directory), /tmp/B.GLV3PE/BUILD/php74-pecl-solr-2.5.0/modules///usr/lib/php74/pcre.so.so (/tmp/B.GLV3PE/BUILD/php74-pecl-solr-2.5.0/modules///usr/lib/php74/pcre.so.so: cannot open shared object file: No such file or directory)) in Unknown on line 0 002+ 003+ Warning: PHP Startup: Unable to load dynamic library '/usr/lib/php74/pcre.so' (tried: /usr/lib/php74/pcre.so (/usr/lib/php74/pcre.so: cannot open shared object file: No such file or directory), /tmp/B.GLV3PE/BUILD/php74-pecl-solr-2.5.0/modules///usr/lib/php74/pcre.so.so (/tmp/B.GLV3PE/BUILD/php74-pecl-solr-2.5.0/modules///usr/lib/php74/pcre.so.so: cannot open shared object file: No such file or directory)) in Unknown on line 0 ========DONE======== FAIL SolrClient::getOptions - Returning all the default options [tests/010.solrclient_getOptions.phpt] TEST 19/151 [tests/011.solrclient_phps_response.phpt] ========DIFF======== 001+ PHP Warning: PHP Startup: Unable to load dynamic library '/usr/lib/php74/pcre.so' (tried: /usr/lib/php74/pcre.so (/usr/lib/php74/pcre.so: cannot open shared object file: No such file or directory), /tmp/B.GLV3PE/BUILD/php74-pecl-solr-2.5.0/modules///usr/lib/php74/pcre.so.so (/tmp/B.GLV3PE/BUILD/php74-pecl-solr-2.5.0/modules///usr/lib/php74/pcre.so.so: cannot open shared object file: No such file or directory)) in Unknown on line 0 002+ 003+ Warning: PHP Startup: Unable to load dynamic library '/usr/lib/php74/pcre.so' (tried: /usr/lib/php74/pcre.so (/usr/lib/php74/pcre.so: cannot open shared object file: No such file or directory), /tmp/B.GLV3PE/BUILD/php74-pecl-solr-2.5.0/modules///usr/lib/php74/pcre.so.so (/tmp/B.GLV3PE/BUILD/php74-pecl-solr-2.5.0/modules///usr/lib/php74/pcre.so.so: cannot open shared object file: No such file or directory)) in Unknown on line 0 ========DONE======== FAIL SolrClient - PHPS response writer support [tests/011.solrclient_phps_response.phpt] TEST 20/151 [tests/012.solrclient_getById.phpt] SKIP SolrClient::getById() - Testing Real Time Get by id [tests/012.solrclient_getById.phpt] reason: Solr server is not set up TEST 21/151 [tests/013.solrclient_getByIds.phpt] SKIP SolrClient::getByIds() - Testing Real Time Get by ids [tests/013.solrclient_getByIds.phpt] reason: Solr server is not set up TEST 22/151 [tests/014.solrclient_addDocument_nested_document.phpt] SKIP SolrClient::addDocument() - Sending a document with child documents [tests/014.solrclient_addDocument_nested_document.phpt] reason: Solr server is not set up TEST 23/151 [tests/015.solrclient_addDocuments_nested_document.phpt] SKIP SolrClient::addDocuments() - Sending multiple documents with child documents [tests/015.solrclient_addDocuments_nested_document.phpt] reason: Solr server is not set up TEST 24/151 [tests/016.solrclient_request.phpt] SKIP SolrClient::Request() - Sending custom update request [tests/016.solrclient_request.phpt] reason: Solr server is not set up TEST 25/151 [tests/016.solrclient_sendUpdateStream_bin.phpt] SKIP SolrClient::sendUpdateStream - send SolrExtractRequest (bin) [tests/016.solrclient_sendUpdateStream_bin.phpt] reason: Solr server is not set up TEST 26/151 [tests/016.solrclient_sendUpdateStream_file.phpt] SKIP SolrClient::sendUpdateStream - send SolrExtractRequest (file) [tests/016.solrclient_sendUpdateStream_file.phpt] reason: Solr server is not set up TEST 27/151 [tests/017.solrclient_deletebyqueries.phpt] SKIP SolrClient::deleteByQueries() - delete by multiple queries [tests/017.solrclient_deletebyqueries.phpt] reason: Solr server is not set up TEST 28/151 [tests/017.solrclient_deletebyquery.phpt] SKIP SolrClient::deleteByQuery() - delete by query [tests/017.solrclient_deletebyquery.phpt] reason: Solr server is not set up TEST 29/151 [tests/017.solrclient_threads.phpt] SKIP SolrClient::threads() - Solr Threads Info [tests/017.solrclient_threads.phpt] reason: Solr server is not set up TEST 30/151 [tests/018.solrclient_setservlet.phpt] SKIP SolrClient::setServlet() - set different servlet for a certain request type [tests/018.solrclient_setservlet.phpt] reason: Solr server is not set up TEST 31/151 [tests/019.solrclient_clone.phpt] SKIP SolrClient::__clone() - expect exception on clone [tests/019.solrclient_clone.phpt] reason: Solr server is not set up TEST 32/151 [tests/019.solrclient_getdebug.phpt] SKIP SolrClient::getDebug() - Get request debug logs for the last request [tests/019.solrclient_getdebug.phpt] reason: Solr server is not set up TEST 33/151 [tests/019.solrclient_serialize.phpt] SKIP SolrClient - serialization [tests/019.solrclient_serialize.phpt] reason: Solr server is not set up TEST 34/151 [tests/020.solrdocument_adding_fields.phpt] ========DIFF======== 001+ PHP Warning: PHP Startup: Unable to load dynamic library '/usr/lib/php74/pcre.so' (tried: /usr/lib/php74/pcre.so (/usr/lib/php74/pcre.so: cannot open shared object file: No such file or directory), /tmp/B.GLV3PE/BUILD/php74-pecl-solr-2.5.0/modules///usr/lib/php74/pcre.so.so (/tmp/B.GLV3PE/BUILD/php74-pecl-solr-2.5.0/modules///usr/lib/php74/pcre.so.so: cannot open shared object file: No such file or directory)) in Unknown on line 0 002+ 003+ Warning: PHP Startup: Unable to load dynamic library '/usr/lib/php74/pcre.so' (tried: /usr/lib/php74/pcre.so (/usr/lib/php74/pcre.so: cannot open shared object file: No such file or directory), /tmp/B.GLV3PE/BUILD/php74-pecl-solr-2.5.0/modules///usr/lib/php74/pcre.so.so (/tmp/B.GLV3PE/BUILD/php74-pecl-solr-2.5.0/modules///usr/lib/php74/pcre.so.so: cannot open shared object file: No such file or directory)) in Unknown on line 0 ========DONE======== FAIL SolrDocument - checking dimension and magic property sets. [tests/020.solrdocument_adding_fields.phpt] TEST 35/151 [tests/020.solrdocument_update_field.phpt] ========DIFF======== 001+ PHP Warning: PHP Startup: Unable to load dynamic library '/usr/lib/php74/pcre.so' (tried: /usr/lib/php74/pcre.so (/usr/lib/php74/pcre.so: cannot open shared object file: No such file or directory), /tmp/B.GLV3PE/BUILD/php74-pecl-solr-2.5.0/modules///usr/lib/php74/pcre.so.so (/tmp/B.GLV3PE/BUILD/php74-pecl-solr-2.5.0/modules///usr/lib/php74/pcre.so.so: cannot open shared object file: No such file or directory)) in Unknown on line 0 002+ 003+ Warning: PHP Startup: Unable to load dynamic library '/usr/lib/php74/pcre.so' (tried: /usr/lib/php74/pcre.so (/usr/lib/php74/pcre.so: cannot open shared object file: No such file or directory), /tmp/B.GLV3PE/BUILD/php74-pecl-solr-2.5.0/modules///usr/lib/php74/pcre.so.so (/tmp/B.GLV3PE/BUILD/php74-pecl-solr-2.5.0/modules///usr/lib/php74/pcre.so.so: cannot open shared object file: No such file or directory)) in Unknown on line 0 ========DONE======== FAIL SolrInputDocument::updateField [tests/020.solrdocument_update_field.phpt] TEST 36/151 [tests/021.solrdocument_iterator.phpt] ========DIFF======== 001+ PHP Warning: PHP Startup: Unable to load dynamic library '/usr/lib/php74/pcre.so' (tried: /usr/lib/php74/pcre.so (/usr/lib/php74/pcre.so: cannot open shared object file: No such file or directory), /tmp/B.GLV3PE/BUILD/php74-pecl-solr-2.5.0/modules///usr/lib/php74/pcre.so.so (/tmp/B.GLV3PE/BUILD/php74-pecl-solr-2.5.0/modules///usr/lib/php74/pcre.so.so: cannot open shared object file: No such file or directory)) in Unknown on line 0 002+ 003+ Warning: PHP Startup: Unable to load dynamic library '/usr/lib/php74/pcre.so' (tried: /usr/lib/php74/pcre.so (/usr/lib/php74/pcre.so: cannot open shared object file: No such file or directory), /tmp/B.GLV3PE/BUILD/php74-pecl-solr-2.5.0/modules///usr/lib/php74/pcre.so.so (/tmp/B.GLV3PE/BUILD/php74-pecl-solr-2.5.0/modules///usr/lib/php74/pcre.so.so: cannot open shared object file: No such file or directory)) in Unknown on line 0 ========DONE======== FAIL SolrDocument - checking Iterator interface implementation [tests/021.solrdocument_iterator.phpt] TEST 37/151 [tests/022.solrdocument_getInputDocument.phpt] ========DIFF======== 001+ PHP Warning: PHP Startup: Unable to load dynamic library '/usr/lib/php74/pcre.so' (tried: /usr/lib/php74/pcre.so (/usr/lib/php74/pcre.so: cannot open shared object file: No such file or directory), /tmp/B.GLV3PE/BUILD/php74-pecl-solr-2.5.0/modules///usr/lib/php74/pcre.so.so (/tmp/B.GLV3PE/BUILD/php74-pecl-solr-2.5.0/modules///usr/lib/php74/pcre.so.so: cannot open shared object file: No such file or directory)) in Unknown on line 0 002+ 003+ Warning: PHP Startup: Unable to load dynamic library '/usr/lib/php74/pcre.so' (tried: /usr/lib/php74/pcre.so (/usr/lib/php74/pcre.so: cannot open shared object file: No such file or directory), /tmp/B.GLV3PE/BUILD/php74-pecl-solr-2.5.0/modules///usr/lib/php74/pcre.so.so (/tmp/B.GLV3PE/BUILD/php74-pecl-solr-2.5.0/modules///usr/lib/php74/pcre.so.so: cannot open shared object file: No such file or directory)) in Unknown on line 0 ========DONE======== FAIL SolrDocument::getInputDocument() - creating SolrInputDocument from SolrDocument [tests/022.solrdocument_getInputDocument.phpt] TEST 38/151 [tests/023.solrdocument_merge.phpt] ========DIFF======== 001+ PHP Warning: PHP Startup: Unable to load dynamic library '/usr/lib/php74/pcre.so' (tried: /usr/lib/php74/pcre.so (/usr/lib/php74/pcre.so: cannot open shared object file: No such file or directory), /tmp/B.GLV3PE/BUILD/php74-pecl-solr-2.5.0/modules///usr/lib/php74/pcre.so.so (/tmp/B.GLV3PE/BUILD/php74-pecl-solr-2.5.0/modules///usr/lib/php74/pcre.so.so: cannot open shared object file: No such file or directory)) in Unknown on line 0 002+ 003+ Warning: PHP Startup: Unable to load dynamic library '/usr/lib/php74/pcre.so' (tried: /usr/lib/php74/pcre.so (/usr/lib/php74/pcre.so: cannot open shared object file: No such file or directory), /tmp/B.GLV3PE/BUILD/php74-pecl-solr-2.5.0/modules///usr/lib/php74/pcre.so.so (/tmp/B.GLV3PE/BUILD/php74-pecl-solr-2.5.0/modules///usr/lib/php74/pcre.so.so: cannot open shared object file: No such file or directory)) in Unknown on line 0 ========DONE======== FAIL SolrDocument::merge() - merging source document into current document [tests/023.solrdocument_merge.phpt] TEST 39/151 [tests/023.solrdocument_merge_no_overwrite.phpt] ========DIFF======== 001+ PHP Warning: PHP Startup: Unable to load dynamic library '/usr/lib/php74/pcre.so' (tried: /usr/lib/php74/pcre.so (/usr/lib/php74/pcre.so: cannot open shared object file: No such file or directory), /tmp/B.GLV3PE/BUILD/php74-pecl-solr-2.5.0/modules///usr/lib/php74/pcre.so.so (/tmp/B.GLV3PE/BUILD/php74-pecl-solr-2.5.0/modules///usr/lib/php74/pcre.so.so: cannot open shared object file: No such file or directory)) in Unknown on line 0 002+ 003+ Warning: PHP Startup: Unable to load dynamic library '/usr/lib/php74/pcre.so' (tried: /usr/lib/php74/pcre.so (/usr/lib/php74/pcre.so: cannot open shared object file: No such file or directory), /tmp/B.GLV3PE/BUILD/php74-pecl-solr-2.5.0/modules///usr/lib/php74/pcre.so.so (/tmp/B.GLV3PE/BUILD/php74-pecl-solr-2.5.0/modules///usr/lib/php74/pcre.so.so: cannot open shared object file: No such file or directory)) in Unknown on line 0 ========DONE======== FAIL SolrDocument::merge() - merging source document into current document without overwrite [tests/023.solrdocument_merge_no_overwrite.phpt] TEST 40/151 [tests/024.solrdocument_child_fetch.phpt] SKIP SolrClient::query() - Query child documents SolrObject (Integ) [tests/024.solrdocument_child_fetch.phpt] reason: Solr server is not set up TEST 41/151 [tests/025.solrdocument_haschilddocuments.phpt] ========DIFF======== 001+ PHP Warning: PHP Startup: Unable to load dynamic library '/usr/lib/php74/pcre.so' (tried: /usr/lib/php74/pcre.so (/usr/lib/php74/pcre.so: cannot open shared object file: No such file or directory), /tmp/B.GLV3PE/BUILD/php74-pecl-solr-2.5.0/modules///usr/lib/php74/pcre.so.so (/tmp/B.GLV3PE/BUILD/php74-pecl-solr-2.5.0/modules///usr/lib/php74/pcre.so.so: cannot open shared object file: No such file or directory)) in Unknown on line 0 002+ 003+ Warning: PHP Startup: Unable to load dynamic library '/usr/lib/php74/pcre.so' (tried: /usr/lib/php74/pcre.so (/usr/lib/php74/pcre.so: cannot open shared object file: No such file or directory), /tmp/B.GLV3PE/BUILD/php74-pecl-solr-2.5.0/modules///usr/lib/php74/pcre.so.so (/tmp/B.GLV3PE/BUILD/php74-pecl-solr-2.5.0/modules///usr/lib/php74/pcre.so.so: cannot open shared object file: No such file or directory)) in Unknown on line 0 ========DONE======== FAIL SolrDocument::hasChildDocuments() - Method test [tests/025.solrdocument_haschilddocuments.phpt] TEST 42/151 [tests/026.solrdocument_getchilddocscount.phpt] ========DIFF======== 001+ PHP Warning: PHP Startup: Unable to load dynamic library '/usr/lib/php74/pcre.so' (tried: /usr/lib/php74/pcre.so (/usr/lib/php74/pcre.so: cannot open shared object file: No such file or directory), /tmp/B.GLV3PE/BUILD/php74-pecl-solr-2.5.0/modules///usr/lib/php74/pcre.so.so (/tmp/B.GLV3PE/BUILD/php74-pecl-solr-2.5.0/modules///usr/lib/php74/pcre.so.so: cannot open shared object file: No such file or directory)) in Unknown on line 0 002+ 003+ Warning: PHP Startup: Unable to load dynamic library '/usr/lib/php74/pcre.so' (tried: /usr/lib/php74/pcre.so (/usr/lib/php74/pcre.so: cannot open shared object file: No such file or directory), /tmp/B.GLV3PE/BUILD/php74-pecl-solr-2.5.0/modules///usr/lib/php74/pcre.so.so (/tmp/B.GLV3PE/BUILD/php74-pecl-solr-2.5.0/modules///usr/lib/php74/pcre.so.so: cannot open shared object file: No such file or directory)) in Unknown on line 0 ========DONE======== FAIL SolrDocument::getChildDocumentsCount() - Method test [tests/026.solrdocument_getchilddocscount.phpt] TEST 43/151 [tests/027.solrdocument_getinputdocument_children.phpt] ========DIFF======== 001+ PHP Warning: PHP Startup: Unable to load dynamic library '/usr/lib/php74/pcre.so' (tried: /usr/lib/php74/pcre.so (/usr/lib/php74/pcre.so: cannot open shared object file: No such file or directory), /tmp/B.GLV3PE/BUILD/php74-pecl-solr-2.5.0/modules///usr/lib/php74/pcre.so.so (/tmp/B.GLV3PE/BUILD/php74-pecl-solr-2.5.0/modules///usr/lib/php74/pcre.so.so: cannot open shared object file: No such file or directory)) in Unknown on line 0 002+ 003+ Warning: PHP Startup: Unable to load dynamic library '/usr/lib/php74/pcre.so' (tried: /usr/lib/php74/pcre.so (/usr/lib/php74/pcre.so: cannot open shared object file: No such file or directory), /tmp/B.GLV3PE/BUILD/php74-pecl-solr-2.5.0/modules///usr/lib/php74/pcre.so.so (/tmp/B.GLV3PE/BUILD/php74-pecl-solr-2.5.0/modules///usr/lib/php74/pcre.so.so: cannot open shared object file: No such file or directory)) in Unknown on line 0 ========DONE======== FAIL SolrDocument::getInputDocument() - Where document has child docs [tests/027.solrdocument_getinputdocument_children.phpt] TEST 44/151 [tests/028.solrdocument_clone.phpt] ========DIFF======== 001+ PHP Warning: PHP Startup: Unable to load dynamic library '/usr/lib/php74/pcre.so' (tried: /usr/lib/php74/pcre.so (/usr/lib/php74/pcre.so: cannot open shared object file: No such file or directory), /tmp/B.GLV3PE/BUILD/php74-pecl-solr-2.5.0/modules///usr/lib/php74/pcre.so.so (/tmp/B.GLV3PE/BUILD/php74-pecl-solr-2.5.0/modules///usr/lib/php74/pcre.so.so: cannot open shared object file: No such file or directory)) in Unknown on line 0 002+ 003+ Warning: PHP Startup: Unable to load dynamic library '/usr/lib/php74/pcre.so' (tried: /usr/lib/php74/pcre.so (/usr/lib/php74/pcre.so: cannot open shared object file: No such file or directory), /tmp/B.GLV3PE/BUILD/php74-pecl-solr-2.5.0/modules///usr/lib/php74/pcre.so.so (/tmp/B.GLV3PE/BUILD/php74-pecl-solr-2.5.0/modules///usr/lib/php74/pcre.so.so: cannot open shared object file: No such file or directory)) in Unknown on line 0 ========DONE======== FAIL SolrDocument - clone [tests/028.solrdocument_clone.phpt] TEST 45/151 [tests/029.solrdocument_serialize.phpt] ========DIFF======== 001+ PHP Warning: PHP Startup: Unable to load dynamic library '/usr/lib/php74/pcre.so' (tried: /usr/lib/php74/pcre.so (/usr/lib/php74/pcre.so: cannot open shared object file: No such file or directory), /tmp/B.GLV3PE/BUILD/php74-pecl-solr-2.5.0/modules///usr/lib/php74/pcre.so.so (/tmp/B.GLV3PE/BUILD/php74-pecl-solr-2.5.0/modules///usr/lib/php74/pcre.so.so: cannot open shared object file: No such file or directory)) in Unknown on line 0 002+ 003+ Warning: PHP Startup: Unable to load dynamic library '/usr/lib/php74/pcre.so' (tried: /usr/lib/php74/pcre.so (/usr/lib/php74/pcre.so: cannot open shared object file: No such file or directory), /tmp/B.GLV3PE/BUILD/php74-pecl-solr-2.5.0/modules///usr/lib/php74/pcre.so.so (/tmp/B.GLV3PE/BUILD/php74-pecl-solr-2.5.0/modules///usr/lib/php74/pcre.so.so: cannot open shared object file: No such file or directory)) in Unknown on line 0 ========DONE======== FAIL SolrDocument - clone [tests/029.solrdocument_serialize.phpt] TEST 46/151 [tests/030.solrdocument_magic.phpt] ========DIFF======== 001+ PHP Warning: PHP Startup: Unable to load dynamic library '/usr/lib/php74/pcre.so' (tried: /usr/lib/php74/pcre.so (/usr/lib/php74/pcre.so: cannot open shared object file: No such file or directory), /tmp/B.GLV3PE/BUILD/php74-pecl-solr-2.5.0/modules///usr/lib/php74/pcre.so.so (/tmp/B.GLV3PE/BUILD/php74-pecl-solr-2.5.0/modules///usr/lib/php74/pcre.so.so: cannot open shared object file: No such file or directory)) in Unknown on line 0 002+ 003+ Warning: PHP Startup: Unable to load dynamic library '/usr/lib/php74/pcre.so' (tried: /usr/lib/php74/pcre.so (/usr/lib/php74/pcre.so: cannot open shared object file: No such file or directory), /tmp/B.GLV3PE/BUILD/php74-pecl-solr-2.5.0/modules///usr/lib/php74/pcre.so.so (/tmp/B.GLV3PE/BUILD/php74-pecl-solr-2.5.0/modules///usr/lib/php74/pcre.so.so: cannot open shared object file: No such file or directory)) in Unknown on line 0 ========DONE======== FAIL SolrDocument - magic __isset/__unset/__get/__set [tests/030.solrdocument_magic.phpt] TEST 47/151 [tests/031.solrdocument_clear.phpt] ========DIFF======== 001+ PHP Warning: PHP Startup: Unable to load dynamic library '/usr/lib/php74/pcre.so' (tried: /usr/lib/php74/pcre.so (/usr/lib/php74/pcre.so: cannot open shared object file: No such file or directory), /tmp/B.GLV3PE/BUILD/php74-pecl-solr-2.5.0/modules///usr/lib/php74/pcre.so.so (/tmp/B.GLV3PE/BUILD/php74-pecl-solr-2.5.0/modules///usr/lib/php74/pcre.so.so: cannot open shared object file: No such file or directory)) in Unknown on line 0 002+ 003+ Warning: PHP Startup: Unable to load dynamic library '/usr/lib/php74/pcre.so' (tried: /usr/lib/php74/pcre.so (/usr/lib/php74/pcre.so: cannot open shared object file: No such file or directory), /tmp/B.GLV3PE/BUILD/php74-pecl-solr-2.5.0/modules///usr/lib/php74/pcre.so.so (/tmp/B.GLV3PE/BUILD/php74-pecl-solr-2.5.0/modules///usr/lib/php74/pcre.so.so: cannot open shared object file: No such file or directory)) in Unknown on line 0 ========DONE======== FAIL SolrDocument::clear - Remove all fields from the document [tests/031.solrdocument_clear.phpt] TEST 48/151 [tests/032.solrdocument_fieldexists.phpt] ========DIFF======== 001+ PHP Warning: PHP Startup: Unable to load dynamic library '/usr/lib/php74/pcre.so' (tried: /usr/lib/php74/pcre.so (/usr/lib/php74/pcre.so: cannot open shared object file: No such file or directory), /tmp/B.GLV3PE/BUILD/php74-pecl-solr-2.5.0/modules///usr/lib/php74/pcre.so.so (/tmp/B.GLV3PE/BUILD/php74-pecl-solr-2.5.0/modules///usr/lib/php74/pcre.so.so: cannot open shared object file: No such file or directory)) in Unknown on line 0 002+ 003+ Warning: PHP Startup: Unable to load dynamic library '/usr/lib/php74/pcre.so' (tried: /usr/lib/php74/pcre.so (/usr/lib/php74/pcre.so: cannot open shared object file: No such file or directory), /tmp/B.GLV3PE/BUILD/php74-pecl-solr-2.5.0/modules///usr/lib/php74/pcre.so.so (/tmp/B.GLV3PE/BUILD/php74-pecl-solr-2.5.0/modules///usr/lib/php74/pcre.so.so: cannot open shared object file: No such file or directory)) in Unknown on line 0 ========DONE======== FAIL SolrDocument::fieldExists [tests/032.solrdocument_fieldexists.phpt] TEST 49/151 [tests/033.solrdocument_sort.phpt] ========DIFF======== 001+ PHP Warning: PHP Startup: Unable to load dynamic library '/usr/lib/php74/pcre.so' (tried: /usr/lib/php74/pcre.so (/usr/lib/php74/pcre.so: cannot open shared object file: No such file or directory), /tmp/B.GLV3PE/BUILD/php74-pecl-solr-2.5.0/modules///usr/lib/php74/pcre.so.so (/tmp/B.GLV3PE/BUILD/php74-pecl-solr-2.5.0/modules///usr/lib/php74/pcre.so.so: cannot open shared object file: No such file or directory)) in Unknown on line 0 002+ 003+ Warning: PHP Startup: Unable to load dynamic library '/usr/lib/php74/pcre.so' (tried: /usr/lib/php74/pcre.so (/usr/lib/php74/pcre.so: cannot open shared object file: No such file or directory), /tmp/B.GLV3PE/BUILD/php74-pecl-solr-2.5.0/modules///usr/lib/php74/pcre.so.so (/tmp/B.GLV3PE/BUILD/php74-pecl-solr-2.5.0/modules///usr/lib/php74/pcre.so.so: cannot open shared object file: No such file or directory)) in Unknown on line 0 ========DONE======== FAIL SolrDocument::sort - Sort Document fields [tests/033.solrdocument_sort.phpt] TEST 50/151 [tests/034.solrdocument_deletefield.phpt] ========DIFF======== 001+ PHP Warning: PHP Startup: Unable to load dynamic library '/usr/lib/php74/pcre.so' (tried: /usr/lib/php74/pcre.so (/usr/lib/php74/pcre.so: cannot open shared object file: No such file or directory), /tmp/B.GLV3PE/BUILD/php74-pecl-solr-2.5.0/modules///usr/lib/php74/pcre.so.so (/tmp/B.GLV3PE/BUILD/php74-pecl-solr-2.5.0/modules///usr/lib/php74/pcre.so.so: cannot open shared object file: No such file or directory)) in Unknown on line 0 002+ 003+ Warning: PHP Startup: Unable to load dynamic library '/usr/lib/php74/pcre.so' (tried: /usr/lib/php74/pcre.so (/usr/lib/php74/pcre.so: cannot open shared object file: No such file or directory), /tmp/B.GLV3PE/BUILD/php74-pecl-solr-2.5.0/modules///usr/lib/php74/pcre.so.so (/tmp/B.GLV3PE/BUILD/php74-pecl-solr-2.5.0/modules///usr/lib/php74/pcre.so.so: cannot open shared object file: No such file or directory)) in Unknown on line 0 ========DONE======== FAIL SolrDocument::deleteField [tests/034.solrdocument_deletefield.phpt] TEST 51/151 [tests/035.solrdocument_getfieldnames.phpt] ========DIFF======== 001+ PHP Warning: PHP Startup: Unable to load dynamic library '/usr/lib/php74/pcre.so' (tried: /usr/lib/php74/pcre.so (/usr/lib/php74/pcre.so: cannot open shared object file: No such file or directory), /tmp/B.GLV3PE/BUILD/php74-pecl-solr-2.5.0/modules///usr/lib/php74/pcre.so.so (/tmp/B.GLV3PE/BUILD/php74-pecl-solr-2.5.0/modules///usr/lib/php74/pcre.so.so: cannot open shared object file: No such file or directory)) in Unknown on line 0 002+ 003+ Warning: PHP Startup: Unable to load dynamic library '/usr/lib/php74/pcre.so' (tried: /usr/lib/php74/pcre.so (/usr/lib/php74/pcre.so: cannot open shared object file: No such file or directory), /tmp/B.GLV3PE/BUILD/php74-pecl-solr-2.5.0/modules///usr/lib/php74/pcre.so.so (/tmp/B.GLV3PE/BUILD/php74-pecl-solr-2.5.0/modules///usr/lib/php74/pcre.so.so: cannot open shared object file: No such file or directory)) in Unknown on line 0 ========DONE======== FAIL SolrDocument::getFieldNames [tests/035.solrdocument_getfieldnames.phpt] TEST 52/151 [tests/036.solrdocument_array_access.phpt] ========DIFF======== 001+ PHP Warning: PHP Startup: Unable to load dynamic library '/usr/lib/php74/pcre.so' (tried: /usr/lib/php74/pcre.so (/usr/lib/php74/pcre.so: cannot open shared object file: No such file or directory), /tmp/B.GLV3PE/BUILD/php74-pecl-solr-2.5.0/modules///usr/lib/php74/pcre.so.so (/tmp/B.GLV3PE/BUILD/php74-pecl-solr-2.5.0/modules///usr/lib/php74/pcre.so.so: cannot open shared object file: No such file or directory)) in Unknown on line 0 002+ 003+ Warning: PHP Startup: Unable to load dynamic library '/usr/lib/php74/pcre.so' (tried: /usr/lib/php74/pcre.so (/usr/lib/php74/pcre.so: cannot open shared object file: No such file or directory), /tmp/B.GLV3PE/BUILD/php74-pecl-solr-2.5.0/modules///usr/lib/php74/pcre.so.so (/tmp/B.GLV3PE/BUILD/php74-pecl-solr-2.5.0/modules///usr/lib/php74/pcre.so.so: cannot open shared object file: No such file or directory)) in Unknown on line 0 ========DONE======== FAIL SolrDocument - Array Access [tests/036.solrdocument_array_access.phpt] TEST 53/151 [tests/037.solrdocument_getfield.phpt] ========DIFF======== 001+ PHP Warning: PHP Startup: Unable to load dynamic library '/usr/lib/php74/pcre.so' (tried: /usr/lib/php74/pcre.so (/usr/lib/php74/pcre.so: cannot open shared object file: No such file or directory), /tmp/B.GLV3PE/BUILD/php74-pecl-solr-2.5.0/modules///usr/lib/php74/pcre.so.so (/tmp/B.GLV3PE/BUILD/php74-pecl-solr-2.5.0/modules///usr/lib/php74/pcre.so.so: cannot open shared object file: No such file or directory)) in Unknown on line 0 002+ 003+ Warning: PHP Startup: Unable to load dynamic library '/usr/lib/php74/pcre.so' (tried: /usr/lib/php74/pcre.so (/usr/lib/php74/pcre.so: cannot open shared object file: No such file or directory), /tmp/B.GLV3PE/BUILD/php74-pecl-solr-2.5.0/modules///usr/lib/php74/pcre.so.so (/tmp/B.GLV3PE/BUILD/php74-pecl-solr-2.5.0/modules///usr/lib/php74/pcre.so.so: cannot open shared object file: No such file or directory)) in Unknown on line 0 ========DONE======== FAIL SolrDocument::getField [tests/037.solrdocument_getfield.phpt] TEST 54/151 [tests/040.solrobject_xmlresponse.phpt] ========DIFF======== 001+ PHP Warning: PHP Startup: Unable to load dynamic library '/usr/lib/php74/pcre.so' (tried: /usr/lib/php74/pcre.so (/usr/lib/php74/pcre.so: cannot open shared object file: No such file or directory), /tmp/B.GLV3PE/BUILD/php74-pecl-solr-2.5.0/modules///usr/lib/php74/pcre.so.so (/tmp/B.GLV3PE/BUILD/php74-pecl-solr-2.5.0/modules///usr/lib/php74/pcre.so.so: cannot open shared object file: No such file or directory)) in Unknown on line 0 002+ 003+ Warning: PHP Startup: Unable to load dynamic library '/usr/lib/php74/pcre.so' (tried: /usr/lib/php74/pcre.so (/usr/lib/php74/pcre.so: cannot open shared object file: No such file or directory), /tmp/B.GLV3PE/BUILD/php74-pecl-solr-2.5.0/modules///usr/lib/php74/pcre.so.so (/tmp/B.GLV3PE/BUILD/php74-pecl-solr-2.5.0/modules///usr/lib/php74/pcre.so.so: cannot open shared object file: No such file or directory)) in Unknown on line 0 ========DONE======== FAIL SolrObject - checking xml response digest [tests/040.solrobject_xmlresponse.phpt] TEST 55/151 [tests/041.solrobject_illegal_operation.phpt] ========DIFF======== 001+ PHP Warning: PHP Startup: Unable to load dynamic library '/usr/lib/php74/pcre.so' (tried: /usr/lib/php74/pcre.so (/usr/lib/php74/pcre.so: cannot open shared object file: No such file or directory), /tmp/B.GLV3PE/BUILD/php74-pecl-solr-2.5.0/modules///usr/lib/php74/pcre.so.so (/tmp/B.GLV3PE/BUILD/php74-pecl-solr-2.5.0/modules///usr/lib/php74/pcre.so.so: cannot open shared object file: No such file or directory)) in Unknown on line 0 002+ 003+ Warning: PHP Startup: Unable to load dynamic library '/usr/lib/php74/pcre.so' (tried: /usr/lib/php74/pcre.so (/usr/lib/php74/pcre.so: cannot open shared object file: No such file or directory), /tmp/B.GLV3PE/BUILD/php74-pecl-solr-2.5.0/modules///usr/lib/php74/pcre.so.so (/tmp/B.GLV3PE/BUILD/php74-pecl-solr-2.5.0/modules///usr/lib/php74/pcre.so.so: cannot open shared object file: No such file or directory)) in Unknown on line 0 ========DONE======== FAIL SolrObject - checking illegal operation of modifying object [tests/041.solrobject_illegal_operation.phpt] TEST 56/151 [tests/042.solrobject_magic_property.phpt] ========DIFF======== 001+ PHP Warning: PHP Startup: Unable to load dynamic library '/usr/lib/php74/pcre.so' (tried: /usr/lib/php74/pcre.so (/usr/lib/php74/pcre.so: cannot open shared object file: No such file or directory), /tmp/B.GLV3PE/BUILD/php74-pecl-solr-2.5.0/modules///usr/lib/php74/pcre.so.so (/tmp/B.GLV3PE/BUILD/php74-pecl-solr-2.5.0/modules///usr/lib/php74/pcre.so.so: cannot open shared object file: No such file or directory)) in Unknown on line 0 002+ 003+ Warning: PHP Startup: Unable to load dynamic library '/usr/lib/php74/pcre.so' (tried: /usr/lib/php74/pcre.so (/usr/lib/php74/pcre.so: cannot open shared object file: No such file or directory), /tmp/B.GLV3PE/BUILD/php74-pecl-solr-2.5.0/modules///usr/lib/php74/pcre.so.so (/tmp/B.GLV3PE/BUILD/php74-pecl-solr-2.5.0/modules///usr/lib/php74/pcre.so.so: cannot open shared object file: No such file or directory)) in Unknown on line 0 ========DONE======== FAIL SolrObject - testing the magic property access [tests/042.solrobject_magic_property.phpt] TEST 57/151 [tests/043.solrobject_magic_properties.phpt] ========DIFF======== 001+ PHP Warning: PHP Startup: Unable to load dynamic library '/usr/lib/php74/pcre.so' (tried: /usr/lib/php74/pcre.so (/usr/lib/php74/pcre.so: cannot open shared object file: No such file or directory), /tmp/B.GLV3PE/BUILD/php74-pecl-solr-2.5.0/modules///usr/lib/php74/pcre.so.so (/tmp/B.GLV3PE/BUILD/php74-pecl-solr-2.5.0/modules///usr/lib/php74/pcre.so.so: cannot open shared object file: No such file or directory)) in Unknown on line 0 002+ 003+ Warning: PHP Startup: Unable to load dynamic library '/usr/lib/php74/pcre.so' (tried: /usr/lib/php74/pcre.so (/usr/lib/php74/pcre.so: cannot open shared object file: No such file or directory), /tmp/B.GLV3PE/BUILD/php74-pecl-solr-2.5.0/modules///usr/lib/php74/pcre.so.so (/tmp/B.GLV3PE/BUILD/php74-pecl-solr-2.5.0/modules///usr/lib/php74/pcre.so.so: cannot open shared object file: No such file or directory)) in Unknown on line 0 ========DONE======== FAIL SolrObject - test property access [tests/043.solrobject_magic_properties.phpt] TEST 58/151 [tests/044.solrobject_dimension_access_properties.phpt] ========DIFF======== 001+ PHP Warning: PHP Startup: Unable to load dynamic library '/usr/lib/php74/pcre.so' (tried: /usr/lib/php74/pcre.so (/usr/lib/php74/pcre.so: cannot open shared object file: No such file or directory), /tmp/B.GLV3PE/BUILD/php74-pecl-solr-2.5.0/modules///usr/lib/php74/pcre.so.so (/tmp/B.GLV3PE/BUILD/php74-pecl-solr-2.5.0/modules///usr/lib/php74/pcre.so.so: cannot open shared object file: No such file or directory)) in Unknown on line 0 002+ 003+ Warning: PHP Startup: Unable to load dynamic library '/usr/lib/php74/pcre.so' (tried: /usr/lib/php74/pcre.so (/usr/lib/php74/pcre.so: cannot open shared object file: No such file or directory), /tmp/B.GLV3PE/BUILD/php74-pecl-solr-2.5.0/modules///usr/lib/php74/pcre.so.so (/tmp/B.GLV3PE/BUILD/php74-pecl-solr-2.5.0/modules///usr/lib/php74/pcre.so.so: cannot open shared object file: No such file or directory)) in Unknown on line 0 ========DONE======== FAIL SolrObject - checking dimension access on properties. [tests/044.solrobject_dimension_access_properties.phpt] TEST 59/151 [tests/045.solrobject_array_access.phpt] ========DIFF======== 001+ PHP Warning: PHP Startup: Unable to load dynamic library '/usr/lib/php74/pcre.so' (tried: /usr/lib/php74/pcre.so (/usr/lib/php74/pcre.so: cannot open shared object file: No such file or directory), /tmp/B.GLV3PE/BUILD/php74-pecl-solr-2.5.0/modules///usr/lib/php74/pcre.so.so (/tmp/B.GLV3PE/BUILD/php74-pecl-solr-2.5.0/modules///usr/lib/php74/pcre.so.so: cannot open shared object file: No such file or directory)) in Unknown on line 0 002+ 003+ Warning: PHP Startup: Unable to load dynamic library '/usr/lib/php74/pcre.so' (tried: /usr/lib/php74/pcre.so (/usr/lib/php74/pcre.so: cannot open shared object file: No such file or directory), /tmp/B.GLV3PE/BUILD/php74-pecl-solr-2.5.0/modules///usr/lib/php74/pcre.so.so (/tmp/B.GLV3PE/BUILD/php74-pecl-solr-2.5.0/modules///usr/lib/php74/pcre.so.so: cannot open shared object file: No such file or directory)) in Unknown on line 0 ========DONE======== FAIL SolrObject - checking dimension access on properties. [tests/045.solrobject_array_access.phpt] TEST 60/151 [tests/046.solrobject_getpropertynames.phpt] ========DIFF======== 001+ PHP Warning: PHP Startup: Unable to load dynamic library '/usr/lib/php74/pcre.so' (tried: /usr/lib/php74/pcre.so (/usr/lib/php74/pcre.so: cannot open shared object file: No such file or directory), /tmp/B.GLV3PE/BUILD/php74-pecl-solr-2.5.0/modules///usr/lib/php74/pcre.so.so (/tmp/B.GLV3PE/BUILD/php74-pecl-solr-2.5.0/modules///usr/lib/php74/pcre.so.so: cannot open shared object file: No such file or directory)) in Unknown on line 0 002+ 003+ Warning: PHP Startup: Unable to load dynamic library '/usr/lib/php74/pcre.so' (tried: /usr/lib/php74/pcre.so (/usr/lib/php74/pcre.so: cannot open shared object file: No such file or directory), /tmp/B.GLV3PE/BUILD/php74-pecl-solr-2.5.0/modules///usr/lib/php74/pcre.so.so (/tmp/B.GLV3PE/BUILD/php74-pecl-solr-2.5.0/modules///usr/lib/php74/pcre.so.so: cannot open shared object file: No such file or directory)) in Unknown on line 0 ========DONE======== FAIL SolrObject - SolrObject::getPropertyNames() [tests/046.solrobject_getpropertynames.phpt] TEST 61/151 [tests/047.solrobject_offsetExists.phpt] ========DIFF======== 001+ PHP Warning: PHP Startup: Unable to load dynamic library '/usr/lib/php74/pcre.so' (tried: /usr/lib/php74/pcre.so (/usr/lib/php74/pcre.so: cannot open shared object file: No such file or directory), /tmp/B.GLV3PE/BUILD/php74-pecl-solr-2.5.0/modules///usr/lib/php74/pcre.so.so (/tmp/B.GLV3PE/BUILD/php74-pecl-solr-2.5.0/modules///usr/lib/php74/pcre.so.so: cannot open shared object file: No such file or directory)) in Unknown on line 0 002+ 003+ Warning: PHP Startup: Unable to load dynamic library '/usr/lib/php74/pcre.so' (tried: /usr/lib/php74/pcre.so (/usr/lib/php74/pcre.so: cannot open shared object file: No such file or directory), /tmp/B.GLV3PE/BUILD/php74-pecl-solr-2.5.0/modules///usr/lib/php74/pcre.so.so (/tmp/B.GLV3PE/BUILD/php74-pecl-solr-2.5.0/modules///usr/lib/php74/pcre.so.so: cannot open shared object file: No such file or directory)) in Unknown on line 0 ========DONE======== FAIL SolrObject::offsetExists [tests/047.solrobject_offsetExists.phpt] TEST 62/151 [tests/050.solrinputdocument_addchilddocument_01.phpt] ========DIFF======== 001+ PHP Warning: PHP Startup: Unable to load dynamic library '/usr/lib/php74/pcre.so' (tried: /usr/lib/php74/pcre.so (/usr/lib/php74/pcre.so: cannot open shared object file: No such file or directory), /tmp/B.GLV3PE/BUILD/php74-pecl-solr-2.5.0/modules///usr/lib/php74/pcre.so.so (/tmp/B.GLV3PE/BUILD/php74-pecl-solr-2.5.0/modules///usr/lib/php74/pcre.so.so: cannot open shared object file: No such file or directory)) in Unknown on line 0 002+ 003+ Warning: PHP Startup: Unable to load dynamic library '/usr/lib/php74/pcre.so' (tried: /usr/lib/php74/pcre.so (/usr/lib/php74/pcre.so: cannot open shared object file: No such file or directory), /tmp/B.GLV3PE/BUILD/php74-pecl-solr-2.5.0/modules///usr/lib/php74/pcre.so.so (/tmp/B.GLV3PE/BUILD/php74-pecl-solr-2.5.0/modules///usr/lib/php74/pcre.so.so: cannot open shared object file: No such file or directory)) in Unknown on line 0 ========DONE======== FAIL SolrInputDocument::addChildDocument() - add child document [tests/050.solrinputdocument_addchilddocument_01.phpt] TEST 63/151 [tests/050.solrinputdocument_addchilddocument_02_error.phpt] ========DIFF======== 001+ PHP Warning: PHP Startup: Unable to load dynamic library '/usr/lib/php74/pcre.so' (tried: /usr/lib/php74/pcre.so (/usr/lib/php74/pcre.so: cannot open shared object file: No such file or directory), /tmp/B.GLV3PE/BUILD/php74-pecl-solr-2.5.0/modules///usr/lib/php74/pcre.so.so (/tmp/B.GLV3PE/BUILD/php74-pecl-solr-2.5.0/modules///usr/lib/php74/pcre.so.so: cannot open shared object file: No such file or directory)) in Unknown on line 0 002+ 003+ Warning: PHP Startup: Unable to load dynamic library '/usr/lib/php74/pcre.so' (tried: /usr/lib/php74/pcre.so (/usr/lib/php74/pcre.so: cannot open shared object file: No such file or directory), /tmp/B.GLV3PE/BUILD/php74-pecl-solr-2.5.0/modules///usr/lib/php74/pcre.so.so (/tmp/B.GLV3PE/BUILD/php74-pecl-solr-2.5.0/modules///usr/lib/php74/pcre.so.so: cannot open shared object file: No such file or directory)) in Unknown on line 0 ========DONE======== FAIL SolrInputDocument::addChildDocument()/SolrInputDocument::addChildDocuments() - Expected SolrIllegalArgumentException [tests/050.solrinputdocument_addchilddocument_02_error.phpt] TEST 64/151 [tests/051.solrinputdocument_getchilddocuments.phpt] ========DIFF======== 001+ PHP Warning: PHP Startup: Unable to load dynamic library '/usr/lib/php74/pcre.so' (tried: /usr/lib/php74/pcre.so (/usr/lib/php74/pcre.so: cannot open shared object file: No such file or directory), /tmp/B.GLV3PE/BUILD/php74-pecl-solr-2.5.0/modules///usr/lib/php74/pcre.so.so (/tmp/B.GLV3PE/BUILD/php74-pecl-solr-2.5.0/modules///usr/lib/php74/pcre.so.so: cannot open shared object file: No such file or directory)) in Unknown on line 0 002+ 003+ Warning: PHP Startup: Unable to load dynamic library '/usr/lib/php74/pcre.so' (tried: /usr/lib/php74/pcre.so (/usr/lib/php74/pcre.so: cannot open shared object file: No such file or directory), /tmp/B.GLV3PE/BUILD/php74-pecl-solr-2.5.0/modules///usr/lib/php74/pcre.so.so (/tmp/B.GLV3PE/BUILD/php74-pecl-solr-2.5.0/modules///usr/lib/php74/pcre.so.so: cannot open shared object file: No such file or directory)) in Unknown on line 0 ========DONE======== FAIL SolrInputDocument::getChildDocuments() - test [tests/051.solrinputdocument_getchilddocuments.phpt] TEST 65/151 [tests/052.solrinputdocument_haschilddocuments.phpt] ========DIFF======== 001+ PHP Warning: PHP Startup: Unable to load dynamic library '/usr/lib/php74/pcre.so' (tried: /usr/lib/php74/pcre.so (/usr/lib/php74/pcre.so: cannot open shared object file: No such file or directory), /tmp/B.GLV3PE/BUILD/php74-pecl-solr-2.5.0/modules///usr/lib/php74/pcre.so.so (/tmp/B.GLV3PE/BUILD/php74-pecl-solr-2.5.0/modules///usr/lib/php74/pcre.so.so: cannot open shared object file: No such file or directory)) in Unknown on line 0 002+ 003+ Warning: PHP Startup: Unable to load dynamic library '/usr/lib/php74/pcre.so' (tried: /usr/lib/php74/pcre.so (/usr/lib/php74/pcre.so: cannot open shared object file: No such file or directory), /tmp/B.GLV3PE/BUILD/php74-pecl-solr-2.5.0/modules///usr/lib/php74/pcre.so.so (/tmp/B.GLV3PE/BUILD/php74-pecl-solr-2.5.0/modules///usr/lib/php74/pcre.so.so: cannot open shared object file: No such file or directory)) in Unknown on line 0 ========DONE======== FAIL SolrInputDocument::hasChildDocuments() - test [tests/052.solrinputdocument_haschilddocuments.phpt] TEST 66/151 [tests/053.solrinputdocument_getchilddocumentscount.phpt] ========DIFF======== 001+ PHP Warning: PHP Startup: Unable to load dynamic library '/usr/lib/php74/pcre.so' (tried: /usr/lib/php74/pcre.so (/usr/lib/php74/pcre.so: cannot open shared object file: No such file or directory), /tmp/B.GLV3PE/BUILD/php74-pecl-solr-2.5.0/modules///usr/lib/php74/pcre.so.so (/tmp/B.GLV3PE/BUILD/php74-pecl-solr-2.5.0/modules///usr/lib/php74/pcre.so.so: cannot open shared object file: No such file or directory)) in Unknown on line 0 002+ 003+ Warning: PHP Startup: Unable to load dynamic library '/usr/lib/php74/pcre.so' (tried: /usr/lib/php74/pcre.so (/usr/lib/php74/pcre.so: cannot open shared object file: No such file or directory), /tmp/B.GLV3PE/BUILD/php74-pecl-solr-2.5.0/modules///usr/lib/php74/pcre.so.so (/tmp/B.GLV3PE/BUILD/php74-pecl-solr-2.5.0/modules///usr/lib/php74/pcre.so.so: cannot open shared object file: No such file or directory)) in Unknown on line 0 ========DONE======== FAIL SolrInputDocument::getChildDocumentsCount() - test [tests/053.solrinputdocument_getchilddocumentscount.phpt] TEST 67/151 [tests/054.solrinputdocument_addchilddocuments.phpt] ========DIFF======== 001+ PHP Warning: PHP Startup: Unable to load dynamic library '/usr/lib/php74/pcre.so' (tried: /usr/lib/php74/pcre.so (/usr/lib/php74/pcre.so: cannot open shared object file: No such file or directory), /tmp/B.GLV3PE/BUILD/php74-pecl-solr-2.5.0/modules///usr/lib/php74/pcre.so.so (/tmp/B.GLV3PE/BUILD/php74-pecl-solr-2.5.0/modules///usr/lib/php74/pcre.so.so: cannot open shared object file: No such file or directory)) in Unknown on line 0 002+ 003+ Warning: PHP Startup: Unable to load dynamic library '/usr/lib/php74/pcre.so' (tried: /usr/lib/php74/pcre.so (/usr/lib/php74/pcre.so: cannot open shared object file: No such file or directory), /tmp/B.GLV3PE/BUILD/php74-pecl-solr-2.5.0/modules///usr/lib/php74/pcre.so.so (/tmp/B.GLV3PE/BUILD/php74-pecl-solr-2.5.0/modules///usr/lib/php74/pcre.so.so: cannot open shared object file: No such file or directory)) in Unknown on line 0 ========DONE======== FAIL SolrInputDocument::addChildDocuments() - add child documents [tests/054.solrinputdocument_addchilddocuments.phpt] TEST 68/151 [tests/055.solrinputdocument_serialization.phpt] ========DIFF======== 001+ PHP Warning: PHP Startup: Unable to load dynamic library '/usr/lib/php74/pcre.so' (tried: /usr/lib/php74/pcre.so (/usr/lib/php74/pcre.so: cannot open shared object file: No such file or directory), /tmp/B.GLV3PE/BUILD/php74-pecl-solr-2.5.0/modules///usr/lib/php74/pcre.so.so (/tmp/B.GLV3PE/BUILD/php74-pecl-solr-2.5.0/modules///usr/lib/php74/pcre.so.so: cannot open shared object file: No such file or directory)) in Unknown on line 0 002+ 003+ Warning: PHP Startup: Unable to load dynamic library '/usr/lib/php74/pcre.so' (tried: /usr/lib/php74/pcre.so (/usr/lib/php74/pcre.so: cannot open shared object file: No such file or directory), /tmp/B.GLV3PE/BUILD/php74-pecl-solr-2.5.0/modules///usr/lib/php74/pcre.so.so (/tmp/B.GLV3PE/BUILD/php74-pecl-solr-2.5.0/modules///usr/lib/php74/pcre.so.so: cannot open shared object file: No such file or directory)) in Unknown on line 0 ========DONE======== FAIL SolrInputDocument - serialize/unserialize Exception [tests/055.solrinputdocument_serialization.phpt] TEST 69/151 [tests/056.solrinputdocument_toArray.phpt] ========DIFF======== 001+ PHP Warning: PHP Startup: Unable to load dynamic library '/usr/lib/php74/pcre.so' (tried: /usr/lib/php74/pcre.so (/usr/lib/php74/pcre.so: cannot open shared object file: No such file or directory), /tmp/B.GLV3PE/BUILD/php74-pecl-solr-2.5.0/modules///usr/lib/php74/pcre.so.so (/tmp/B.GLV3PE/BUILD/php74-pecl-solr-2.5.0/modules///usr/lib/php74/pcre.so.so: cannot open shared object file: No such file or directory)) in Unknown on line 0 002+ 003+ Warning: PHP Startup: Unable to load dynamic library '/usr/lib/php74/pcre.so' (tried: /usr/lib/php74/pcre.so (/usr/lib/php74/pcre.so: cannot open shared object file: No such file or directory), /tmp/B.GLV3PE/BUILD/php74-pecl-solr-2.5.0/modules///usr/lib/php74/pcre.so.so (/tmp/B.GLV3PE/BUILD/php74-pecl-solr-2.5.0/modules///usr/lib/php74/pcre.so.so: cannot open shared object file: No such file or directory)) in Unknown on line 0 ========DONE======== FAIL SolrInputDocument::toArray - Array conversion [tests/056.solrinputdocument_toArray.phpt] TEST 70/151 [tests/057.solrinputdocument_clone.phpt] ========DIFF======== 001+ PHP Warning: PHP Startup: Unable to load dynamic library '/usr/lib/php74/pcre.so' (tried: /usr/lib/php74/pcre.so (/usr/lib/php74/pcre.so: cannot open shared object file: No such file or directory), /tmp/B.GLV3PE/BUILD/php74-pecl-solr-2.5.0/modules///usr/lib/php74/pcre.so.so (/tmp/B.GLV3PE/BUILD/php74-pecl-solr-2.5.0/modules///usr/lib/php74/pcre.so.so: cannot open shared object file: No such file or directory)) in Unknown on line 0 002+ 003+ Warning: PHP Startup: Unable to load dynamic library '/usr/lib/php74/pcre.so' (tried: /usr/lib/php74/pcre.so (/usr/lib/php74/pcre.so: cannot open shared object file: No such file or directory), /tmp/B.GLV3PE/BUILD/php74-pecl-solr-2.5.0/modules///usr/lib/php74/pcre.so.so (/tmp/B.GLV3PE/BUILD/php74-pecl-solr-2.5.0/modules///usr/lib/php74/pcre.so.so: cannot open shared object file: No such file or directory)) in Unknown on line 0 ========DONE======== FAIL SolrInputDocument - clone [tests/057.solrinputdocument_clone.phpt] TEST 71/151 [tests/058.solrinputdocument_deletefield.phpt] ========DIFF======== 001+ PHP Warning: PHP Startup: Unable to load dynamic library '/usr/lib/php74/pcre.so' (tried: /usr/lib/php74/pcre.so (/usr/lib/php74/pcre.so: cannot open shared object file: No such file or directory), /tmp/B.GLV3PE/BUILD/php74-pecl-solr-2.5.0/modules///usr/lib/php74/pcre.so.so (/tmp/B.GLV3PE/BUILD/php74-pecl-solr-2.5.0/modules///usr/lib/php74/pcre.so.so: cannot open shared object file: No such file or directory)) in Unknown on line 0 002+ 003+ Warning: PHP Startup: Unable to load dynamic library '/usr/lib/php74/pcre.so' (tried: /usr/lib/php74/pcre.so (/usr/lib/php74/pcre.so: cannot open shared object file: No such file or directory), /tmp/B.GLV3PE/BUILD/php74-pecl-solr-2.5.0/modules///usr/lib/php74/pcre.so.so (/tmp/B.GLV3PE/BUILD/php74-pecl-solr-2.5.0/modules///usr/lib/php74/pcre.so.so: cannot open shared object file: No such file or directory)) in Unknown on line 0 ========DONE======== FAIL SolrInputDocument::deleteField - Delete a field from SolrInputDocument [tests/058.solrinputdocument_deletefield.phpt] TEST 72/151 [tests/059.solrinputdocument_clear.phpt] ========DIFF======== 001+ PHP Warning: PHP Startup: Unable to load dynamic library '/usr/lib/php74/pcre.so' (tried: /usr/lib/php74/pcre.so (/usr/lib/php74/pcre.so: cannot open shared object file: No such file or directory), /tmp/B.GLV3PE/BUILD/php74-pecl-solr-2.5.0/modules///usr/lib/php74/pcre.so.so (/tmp/B.GLV3PE/BUILD/php74-pecl-solr-2.5.0/modules///usr/lib/php74/pcre.so.so: cannot open shared object file: No such file or directory)) in Unknown on line 0 002+ 003+ Warning: PHP Startup: Unable to load dynamic library '/usr/lib/php74/pcre.so' (tried: /usr/lib/php74/pcre.so (/usr/lib/php74/pcre.so: cannot open shared object file: No such file or directory), /tmp/B.GLV3PE/BUILD/php74-pecl-solr-2.5.0/modules///usr/lib/php74/pcre.so.so (/tmp/B.GLV3PE/BUILD/php74-pecl-solr-2.5.0/modules///usr/lib/php74/pcre.so.so: cannot open shared object file: No such file or directory)) in Unknown on line 0 ========DONE======== FAIL SolrInputDocument::clear - Clear document fields [tests/059.solrinputdocument_clear.phpt] TEST 73/151 [tests/059.solrinputdocument_fieldexists.phpt] ========DIFF======== 001+ PHP Warning: PHP Startup: Unable to load dynamic library '/usr/lib/php74/pcre.so' (tried: /usr/lib/php74/pcre.so (/usr/lib/php74/pcre.so: cannot open shared object file: No such file or directory), /tmp/B.GLV3PE/BUILD/php74-pecl-solr-2.5.0/modules///usr/lib/php74/pcre.so.so (/tmp/B.GLV3PE/BUILD/php74-pecl-solr-2.5.0/modules///usr/lib/php74/pcre.so.so: cannot open shared object file: No such file or directory)) in Unknown on line 0 002+ 003+ Warning: PHP Startup: Unable to load dynamic library '/usr/lib/php74/pcre.so' (tried: /usr/lib/php74/pcre.so (/usr/lib/php74/pcre.so: cannot open shared object file: No such file or directory), /tmp/B.GLV3PE/BUILD/php74-pecl-solr-2.5.0/modules///usr/lib/php74/pcre.so.so (/tmp/B.GLV3PE/BUILD/php74-pecl-solr-2.5.0/modules///usr/lib/php74/pcre.so.so: cannot open shared object file: No such file or directory)) in Unknown on line 0 ========DONE======== FAIL SolrInputDocument::fieldExists [tests/059.solrinputdocument_fieldexists.phpt] TEST 74/151 [tests/059.solrinputdocument_getboost.phpt] ========DIFF======== 001+ PHP Warning: PHP Startup: Unable to load dynamic library '/usr/lib/php74/pcre.so' (tried: /usr/lib/php74/pcre.so (/usr/lib/php74/pcre.so: cannot open shared object file: No such file or directory), /tmp/B.GLV3PE/BUILD/php74-pecl-solr-2.5.0/modules///usr/lib/php74/pcre.so.so (/tmp/B.GLV3PE/BUILD/php74-pecl-solr-2.5.0/modules///usr/lib/php74/pcre.so.so: cannot open shared object file: No such file or directory)) in Unknown on line 0 002+ 003+ Warning: PHP Startup: Unable to load dynamic library '/usr/lib/php74/pcre.so' (tried: /usr/lib/php74/pcre.so (/usr/lib/php74/pcre.so: cannot open shared object file: No such file or directory), /tmp/B.GLV3PE/BUILD/php74-pecl-solr-2.5.0/modules///usr/lib/php74/pcre.so.so (/tmp/B.GLV3PE/BUILD/php74-pecl-solr-2.5.0/modules///usr/lib/php74/pcre.so.so: cannot open shared object file: No such file or directory)) in Unknown on line 0 ========DONE======== FAIL SolrInputDocument::getBoost - Test document fieldnames [tests/059.solrinputdocument_getboost.phpt] TEST 75/151 [tests/059.solrinputdocument_getfield.phpt] ========DIFF======== 001+ PHP Warning: PHP Startup: Unable to load dynamic library '/usr/lib/php74/pcre.so' (tried: /usr/lib/php74/pcre.so (/usr/lib/php74/pcre.so: cannot open shared object file: No such file or directory), /tmp/B.GLV3PE/BUILD/php74-pecl-solr-2.5.0/modules///usr/lib/php74/pcre.so.so (/tmp/B.GLV3PE/BUILD/php74-pecl-solr-2.5.0/modules///usr/lib/php74/pcre.so.so: cannot open shared object file: No such file or directory)) in Unknown on line 0 002+ 003+ Warning: PHP Startup: Unable to load dynamic library '/usr/lib/php74/pcre.so' (tried: /usr/lib/php74/pcre.so (/usr/lib/php74/pcre.so: cannot open shared object file: No such file or directory), /tmp/B.GLV3PE/BUILD/php74-pecl-solr-2.5.0/modules///usr/lib/php74/pcre.so.so (/tmp/B.GLV3PE/BUILD/php74-pecl-solr-2.5.0/modules///usr/lib/php74/pcre.so.so: cannot open shared object file: No such file or directory)) in Unknown on line 0 ========DONE======== FAIL SolrInputDocument::getField [tests/059.solrinputdocument_getfield.phpt] TEST 76/151 [tests/059.solrinputdocument_getfieldcount.phpt] ========DIFF======== 001+ PHP Warning: PHP Startup: Unable to load dynamic library '/usr/lib/php74/pcre.so' (tried: /usr/lib/php74/pcre.so (/usr/lib/php74/pcre.so: cannot open shared object file: No such file or directory), /tmp/B.GLV3PE/BUILD/php74-pecl-solr-2.5.0/modules///usr/lib/php74/pcre.so.so (/tmp/B.GLV3PE/BUILD/php74-pecl-solr-2.5.0/modules///usr/lib/php74/pcre.so.so: cannot open shared object file: No such file or directory)) in Unknown on line 0 002+ 003+ Warning: PHP Startup: Unable to load dynamic library '/usr/lib/php74/pcre.so' (tried: /usr/lib/php74/pcre.so (/usr/lib/php74/pcre.so: cannot open shared object file: No such file or directory), /tmp/B.GLV3PE/BUILD/php74-pecl-solr-2.5.0/modules///usr/lib/php74/pcre.so.so (/tmp/B.GLV3PE/BUILD/php74-pecl-solr-2.5.0/modules///usr/lib/php74/pcre.so.so: cannot open shared object file: No such file or directory)) in Unknown on line 0 ========DONE======== FAIL SolrInputDocument::getFieldCount [tests/059.solrinputdocument_getfieldcount.phpt] TEST 77/151 [tests/059.solrinputdocument_getfieldnames.phpt] ========DIFF======== 001+ PHP Warning: PHP Startup: Unable to load dynamic library '/usr/lib/php74/pcre.so' (tried: /usr/lib/php74/pcre.so (/usr/lib/php74/pcre.so: cannot open shared object file: No such file or directory), /tmp/B.GLV3PE/BUILD/php74-pecl-solr-2.5.0/modules///usr/lib/php74/pcre.so.so (/tmp/B.GLV3PE/BUILD/php74-pecl-solr-2.5.0/modules///usr/lib/php74/pcre.so.so: cannot open shared object file: No such file or directory)) in Unknown on line 0 002+ 003+ Warning: PHP Startup: Unable to load dynamic library '/usr/lib/php74/pcre.so' (tried: /usr/lib/php74/pcre.so (/usr/lib/php74/pcre.so: cannot open shared object file: No such file or directory), /tmp/B.GLV3PE/BUILD/php74-pecl-solr-2.5.0/modules///usr/lib/php74/pcre.so.so (/tmp/B.GLV3PE/BUILD/php74-pecl-solr-2.5.0/modules///usr/lib/php74/pcre.so.so: cannot open shared object file: No such file or directory)) in Unknown on line 0 ========DONE======== FAIL SolrInputDocument::getFieldNames - Test document fieldnames [tests/059.solrinputdocument_getfieldnames.phpt] TEST 78/151 [tests/059.solrinputdocument_merge.phpt] ========DIFF======== 001+ PHP Warning: PHP Startup: Unable to load dynamic library '/usr/lib/php74/pcre.so' (tried: /usr/lib/php74/pcre.so (/usr/lib/php74/pcre.so: cannot open shared object file: No such file or directory), /tmp/B.GLV3PE/BUILD/php74-pecl-solr-2.5.0/modules///usr/lib/php74/pcre.so.so (/tmp/B.GLV3PE/BUILD/php74-pecl-solr-2.5.0/modules///usr/lib/php74/pcre.so.so: cannot open shared object file: No such file or directory)) in Unknown on line 0 002+ 003+ Warning: PHP Startup: Unable to load dynamic library '/usr/lib/php74/pcre.so' (tried: /usr/lib/php74/pcre.so (/usr/lib/php74/pcre.so: cannot open shared object file: No such file or directory), /tmp/B.GLV3PE/BUILD/php74-pecl-solr-2.5.0/modules///usr/lib/php74/pcre.so.so (/tmp/B.GLV3PE/BUILD/php74-pecl-solr-2.5.0/modules///usr/lib/php74/pcre.so.so: cannot open shared object file: No such file or directory)) in Unknown on line 0 ========DONE======== FAIL SolrInputDocument::merge - Merge 2 docs [tests/059.solrinputdocument_merge.phpt] TEST 79/151 [tests/059.solrinputdocument_set_getfieldboost.phpt] ========DIFF======== 001+ PHP Warning: PHP Startup: Unable to load dynamic library '/usr/lib/php74/pcre.so' (tried: /usr/lib/php74/pcre.so (/usr/lib/php74/pcre.so: cannot open shared object file: No such file or directory), /tmp/B.GLV3PE/BUILD/php74-pecl-solr-2.5.0/modules///usr/lib/php74/pcre.so.so (/tmp/B.GLV3PE/BUILD/php74-pecl-solr-2.5.0/modules///usr/lib/php74/pcre.so.so: cannot open shared object file: No such file or directory)) in Unknown on line 0 002+ 003+ Warning: PHP Startup: Unable to load dynamic library '/usr/lib/php74/pcre.so' (tried: /usr/lib/php74/pcre.so (/usr/lib/php74/pcre.so: cannot open shared object file: No such file or directory), /tmp/B.GLV3PE/BUILD/php74-pecl-solr-2.5.0/modules///usr/lib/php74/pcre.so.so (/tmp/B.GLV3PE/BUILD/php74-pecl-solr-2.5.0/modules///usr/lib/php74/pcre.so.so: cannot open shared object file: No such file or directory)) in Unknown on line 0 ========DONE======== FAIL SolrInputDocument::getFieldBoost [tests/059.solrinputdocument_set_getfieldboost.phpt] TEST 80/151 [tests/059.solrinputdocument_setversion.phpt] SKIP SolrInputDocument::setVersion - Set document version [tests/059.solrinputdocument_setversion.phpt] reason: Solr server is not set up TEST 81/151 [tests/059.solrinputdocument_sort.phpt] ========DIFF======== 001+ PHP Warning: PHP Startup: Unable to load dynamic library '/usr/lib/php74/pcre.so' (tried: /usr/lib/php74/pcre.so (/usr/lib/php74/pcre.so: cannot open shared object file: No such file or directory), /tmp/B.GLV3PE/BUILD/php74-pecl-solr-2.5.0/modules///usr/lib/php74/pcre.so.so (/tmp/B.GLV3PE/BUILD/php74-pecl-solr-2.5.0/modules///usr/lib/php74/pcre.so.so: cannot open shared object file: No such file or directory)) in Unknown on line 0 002+ 003+ Warning: PHP Startup: Unable to load dynamic library '/usr/lib/php74/pcre.so' (tried: /usr/lib/php74/pcre.so (/usr/lib/php74/pcre.so: cannot open shared object file: No such file or directory), /tmp/B.GLV3PE/BUILD/php74-pecl-solr-2.5.0/modules///usr/lib/php74/pcre.so.so (/tmp/B.GLV3PE/BUILD/php74-pecl-solr-2.5.0/modules///usr/lib/php74/pcre.so.so: cannot open shared object file: No such file or directory)) in Unknown on line 0 ========DONE======== FAIL SolrInputDocument::sort - Sort Document fields [tests/059.solrinputdocument_sort.phpt] TEST 82/151 [tests/060.solrquery_comon_query_params.phpt] ========DIFF======== 001+ PHP Warning: PHP Startup: Unable to load dynamic library '/usr/lib/php74/pcre.so' (tried: /usr/lib/php74/pcre.so (/usr/lib/php74/pcre.so: cannot open shared object file: No such file or directory), /tmp/B.GLV3PE/BUILD/php74-pecl-solr-2.5.0/modules///usr/lib/php74/pcre.so.so (/tmp/B.GLV3PE/BUILD/php74-pecl-solr-2.5.0/modules///usr/lib/php74/pcre.so.so: cannot open shared object file: No such file or directory)) in Unknown on line 0 002+ 003+ Warning: PHP Startup: Unable to load dynamic library '/usr/lib/php74/pcre.so' (tried: /usr/lib/php74/pcre.so (/usr/lib/php74/pcre.so: cannot open shared object file: No such file or directory), /tmp/B.GLV3PE/BUILD/php74-pecl-solr-2.5.0/modules///usr/lib/php74/pcre.so.so (/tmp/B.GLV3PE/BUILD/php74-pecl-solr-2.5.0/modules///usr/lib/php74/pcre.so.so: cannot open shared object file: No such file or directory)) in Unknown on line 0 ========DONE======== FAIL SolrQuery - testing CommonQueryParameters [tests/060.solrquery_comon_query_params.phpt] TEST 83/151 [tests/061.solrquery_simpleFacetParameters.phpt] ========DIFF======== 001+ PHP Warning: PHP Startup: Unable to load dynamic library '/usr/lib/php74/pcre.so' (tried: /usr/lib/php74/pcre.so (/usr/lib/php74/pcre.so: cannot open shared object file: No such file or directory), /tmp/B.GLV3PE/BUILD/php74-pecl-solr-2.5.0/modules///usr/lib/php74/pcre.so.so (/tmp/B.GLV3PE/BUILD/php74-pecl-solr-2.5.0/modules///usr/lib/php74/pcre.so.so: cannot open shared object file: No such file or directory)) in Unknown on line 0 002+ 003+ Warning: PHP Startup: Unable to load dynamic library '/usr/lib/php74/pcre.so' (tried: /usr/lib/php74/pcre.so (/usr/lib/php74/pcre.so: cannot open shared object file: No such file or directory), /tmp/B.GLV3PE/BUILD/php74-pecl-solr-2.5.0/modules///usr/lib/php74/pcre.so.so (/tmp/B.GLV3PE/BUILD/php74-pecl-solr-2.5.0/modules///usr/lib/php74/pcre.so.so: cannot open shared object file: No such file or directory)) in Unknown on line 0 ========DONE======== FAIL SolrQuery - testing SimpleFacetParameters [tests/061.solrquery_simpleFacetParameters.phpt] TEST 84/151 [tests/062.solrquery_date_facet_parameters.phpt] ========DIFF======== 001+ PHP Warning: PHP Startup: Unable to load dynamic library '/usr/lib/php74/pcre.so' (tried: /usr/lib/php74/pcre.so (/usr/lib/php74/pcre.so: cannot open shared object file: No such file or directory), /tmp/B.GLV3PE/BUILD/php74-pecl-solr-2.5.0/modules///usr/lib/php74/pcre.so.so (/tmp/B.GLV3PE/BUILD/php74-pecl-solr-2.5.0/modules///usr/lib/php74/pcre.so.so: cannot open shared object file: No such file or directory)) in Unknown on line 0 002+ 003+ Warning: PHP Startup: Unable to load dynamic library '/usr/lib/php74/pcre.so' (tried: /usr/lib/php74/pcre.so (/usr/lib/php74/pcre.so: cannot open shared object file: No such file or directory), /tmp/B.GLV3PE/BUILD/php74-pecl-solr-2.5.0/modules///usr/lib/php74/pcre.so.so (/tmp/B.GLV3PE/BUILD/php74-pecl-solr-2.5.0/modules///usr/lib/php74/pcre.so.so: cannot open shared object file: No such file or directory)) in Unknown on line 0 ========DONE======== FAIL SolrQuery - Testing Date facet parameters [tests/062.solrquery_date_facet_parameters.phpt] TEST 85/151 [tests/063.solrquery_HighlightingParameters.phpt] ========DIFF======== 001+ PHP Warning: PHP Startup: Unable to load dynamic library '/usr/lib/php74/pcre.so' (tried: /usr/lib/php74/pcre.so (/usr/lib/php74/pcre.so: cannot open shared object file: No such file or directory), /tmp/B.GLV3PE/BUILD/php74-pecl-solr-2.5.0/modules///usr/lib/php74/pcre.so.so (/tmp/B.GLV3PE/BUILD/php74-pecl-solr-2.5.0/modules///usr/lib/php74/pcre.so.so: cannot open shared object file: No such file or directory)) in Unknown on line 0 002+ 003+ Warning: PHP Startup: Unable to load dynamic library '/usr/lib/php74/pcre.so' (tried: /usr/lib/php74/pcre.so (/usr/lib/php74/pcre.so: cannot open shared object file: No such file or directory), /tmp/B.GLV3PE/BUILD/php74-pecl-solr-2.5.0/modules///usr/lib/php74/pcre.so.so (/tmp/B.GLV3PE/BUILD/php74-pecl-solr-2.5.0/modules///usr/lib/php74/pcre.so.so: cannot open shared object file: No such file or directory)) in Unknown on line 0 ========DONE======== FAIL SolrQuery - testing HighlightingParameters [tests/063.solrquery_HighlightingParameters.phpt] TEST 86/151 [tests/064.solrquery_StatsComponent.phpt] ========DIFF======== 001+ PHP Warning: PHP Startup: Unable to load dynamic library '/usr/lib/php74/pcre.so' (tried: /usr/lib/php74/pcre.so (/usr/lib/php74/pcre.so: cannot open shared object file: No such file or directory), /tmp/B.GLV3PE/BUILD/php74-pecl-solr-2.5.0/modules///usr/lib/php74/pcre.so.so (/tmp/B.GLV3PE/BUILD/php74-pecl-solr-2.5.0/modules///usr/lib/php74/pcre.so.so: cannot open shared object file: No such file or directory)) in Unknown on line 0 002+ 003+ Warning: PHP Startup: Unable to load dynamic library '/usr/lib/php74/pcre.so' (tried: /usr/lib/php74/pcre.so (/usr/lib/php74/pcre.so: cannot open shared object file: No such file or directory), /tmp/B.GLV3PE/BUILD/php74-pecl-solr-2.5.0/modules///usr/lib/php74/pcre.so.so (/tmp/B.GLV3PE/BUILD/php74-pecl-solr-2.5.0/modules///usr/lib/php74/pcre.so.so: cannot open shared object file: No such file or directory)) in Unknown on line 0 ========DONE======== FAIL SolrQuery - testing StatsComponent [tests/064.solrquery_StatsComponent.phpt] TEST 87/151 [tests/065.solrquery_MoreLikeThis.phpt] ========DIFF======== 001+ PHP Warning: PHP Startup: Unable to load dynamic library '/usr/lib/php74/pcre.so' (tried: /usr/lib/php74/pcre.so (/usr/lib/php74/pcre.so: cannot open shared object file: No such file or directory), /tmp/B.GLV3PE/BUILD/php74-pecl-solr-2.5.0/modules///usr/lib/php74/pcre.so.so (/tmp/B.GLV3PE/BUILD/php74-pecl-solr-2.5.0/modules///usr/lib/php74/pcre.so.so: cannot open shared object file: No such file or directory)) in Unknown on line 0 002+ 003+ Warning: PHP Startup: Unable to load dynamic library '/usr/lib/php74/pcre.so' (tried: /usr/lib/php74/pcre.so (/usr/lib/php74/pcre.so: cannot open shared object file: No such file or directory), /tmp/B.GLV3PE/BUILD/php74-pecl-solr-2.5.0/modules///usr/lib/php74/pcre.so.so (/tmp/B.GLV3PE/BUILD/php74-pecl-solr-2.5.0/modules///usr/lib/php74/pcre.so.so: cannot open shared object file: No such file or directory)) in Unknown on line 0 ========DONE======== FAIL SolrQuery - testing MoreLikeThis component [tests/065.solrquery_MoreLikeThis.phpt] TEST 88/151 [tests/066.solrquery_TermsComponent.phpt] ========DIFF======== 001+ PHP Warning: PHP Startup: Unable to load dynamic library '/usr/lib/php74/pcre.so' (tried: /usr/lib/php74/pcre.so (/usr/lib/php74/pcre.so: cannot open shared object file: No such file or directory), /tmp/B.GLV3PE/BUILD/php74-pecl-solr-2.5.0/modules///usr/lib/php74/pcre.so.so (/tmp/B.GLV3PE/BUILD/php74-pecl-solr-2.5.0/modules///usr/lib/php74/pcre.so.so: cannot open shared object file: No such file or directory)) in Unknown on line 0 002+ 003+ Warning: PHP Startup: Unable to load dynamic library '/usr/lib/php74/pcre.so' (tried: /usr/lib/php74/pcre.so (/usr/lib/php74/pcre.so: cannot open shared object file: No such file or directory), /tmp/B.GLV3PE/BUILD/php74-pecl-solr-2.5.0/modules///usr/lib/php74/pcre.so.so (/tmp/B.GLV3PE/BUILD/php74-pecl-solr-2.5.0/modules///usr/lib/php74/pcre.so.so: cannot open shared object file: No such file or directory)) in Unknown on line 0 ========DONE======== FAIL SolrQuery - testing TermsComponent [tests/066.solrquery_TermsComponent.phpt] TEST 89/151 [tests/067.solrquery__construct.phpt] ========DIFF======== 001+ PHP Warning: PHP Startup: Unable to load dynamic library '/usr/lib/php74/pcre.so' (tried: /usr/lib/php74/pcre.so (/usr/lib/php74/pcre.so: cannot open shared object file: No such file or directory), /tmp/B.GLV3PE/BUILD/php74-pecl-solr-2.5.0/modules///usr/lib/php74/pcre.so.so (/tmp/B.GLV3PE/BUILD/php74-pecl-solr-2.5.0/modules///usr/lib/php74/pcre.so.so: cannot open shared object file: No such file or directory)) in Unknown on line 0 002+ 003+ Warning: PHP Startup: Unable to load dynamic library '/usr/lib/php74/pcre.so' (tried: /usr/lib/php74/pcre.so (/usr/lib/php74/pcre.so: cannot open shared object file: No such file or directory), /tmp/B.GLV3PE/BUILD/php74-pecl-solr-2.5.0/modules///usr/lib/php74/pcre.so.so (/tmp/B.GLV3PE/BUILD/php74-pecl-solr-2.5.0/modules///usr/lib/php74/pcre.so.so: cannot open shared object file: No such file or directory)) in Unknown on line 0 ========DONE======== FAIL SolrQuery::_construct - Throws exception on illegal Argument [tests/067.solrquery__construct.phpt] TEST 90/151 [tests/068.solrquery_parameters_error.phpt] ========DIFF======== 001+ PHP Warning: PHP Startup: Unable to load dynamic library '/usr/lib/php74/pcre.so' (tried: /usr/lib/php74/pcre.so (/usr/lib/php74/pcre.so: cannot open shared object file: No such file or directory), /tmp/B.GLV3PE/BUILD/php74-pecl-solr-2.5.0/modules///usr/lib/php74/pcre.so.so (/tmp/B.GLV3PE/BUILD/php74-pecl-solr-2.5.0/modules///usr/lib/php74/pcre.so.so: cannot open shared object file: No such file or directory)) in Unknown on line 0 002+ 003+ Warning: PHP Startup: Unable to load dynamic library '/usr/lib/php74/pcre.so' (tried: /usr/lib/php74/pcre.so (/usr/lib/php74/pcre.so: cannot open shared object file: No such file or directory), /tmp/B.GLV3PE/BUILD/php74-pecl-solr-2.5.0/modules///usr/lib/php74/pcre.so.so (/tmp/B.GLV3PE/BUILD/php74-pecl-solr-2.5.0/modules///usr/lib/php74/pcre.so.so: cannot open shared object file: No such file or directory)) in Unknown on line 0 ========DONE======== FAIL SolrQuery - Invalid Parameters thorws exception Throws exception on illegal Argument [tests/068.solrquery_parameters_error.phpt] TEST 91/151 [tests/069.solrquery_GroupParameters.phpt] ========DIFF======== 001+ PHP Warning: PHP Startup: Unable to load dynamic library '/usr/lib/php74/pcre.so' (tried: /usr/lib/php74/pcre.so (/usr/lib/php74/pcre.so: cannot open shared object file: No such file or directory), /tmp/B.GLV3PE/BUILD/php74-pecl-solr-2.5.0/modules///usr/lib/php74/pcre.so.so (/tmp/B.GLV3PE/BUILD/php74-pecl-solr-2.5.0/modules///usr/lib/php74/pcre.so.so: cannot open shared object file: No such file or directory)) in Unknown on line 0 002+ 003+ Warning: PHP Startup: Unable to load dynamic library '/usr/lib/php74/pcre.so' (tried: /usr/lib/php74/pcre.so (/usr/lib/php74/pcre.so: cannot open shared object file: No such file or directory), /tmp/B.GLV3PE/BUILD/php74-pecl-solr-2.5.0/modules///usr/lib/php74/pcre.so.so (/tmp/B.GLV3PE/BUILD/php74-pecl-solr-2.5.0/modules///usr/lib/php74/pcre.so.so: cannot open shared object file: No such file or directory)) in Unknown on line 0 004+ ========DONE======== FAIL SolrQuery - Result Grouping (Group Parameters) [tests/069.solrquery_GroupParameters.phpt] TEST 92/151 [tests/070.solrquery_collapse.phpt] ========DIFF======== 001+ PHP Warning: PHP Startup: Unable to load dynamic library '/usr/lib/php74/pcre.so' (tried: /usr/lib/php74/pcre.so (/usr/lib/php74/pcre.so: cannot open shared object file: No such file or directory), /tmp/B.GLV3PE/BUILD/php74-pecl-solr-2.5.0/modules///usr/lib/php74/pcre.so.so (/tmp/B.GLV3PE/BUILD/php74-pecl-solr-2.5.0/modules///usr/lib/php74/pcre.so.so: cannot open shared object file: No such file or directory)) in Unknown on line 0 002+ 003+ Warning: PHP Startup: Unable to load dynamic library '/usr/lib/php74/pcre.so' (tried: /usr/lib/php74/pcre.so (/usr/lib/php74/pcre.so: cannot open shared object file: No such file or directory), /tmp/B.GLV3PE/BUILD/php74-pecl-solr-2.5.0/modules///usr/lib/php74/pcre.so.so (/tmp/B.GLV3PE/BUILD/php74-pecl-solr-2.5.0/modules///usr/lib/php74/pcre.so.so: cannot open shared object file: No such file or directory)) in Unknown on line 0 ========DONE======== FAIL SolrQuery::collapse - Collapse Using a SolrCollapseFunction [tests/070.solrquery_collapse.phpt] TEST 93/151 [tests/071.solrquery_collapse_exception.phpt] ========DIFF======== 001+ PHP Warning: PHP Startup: Unable to load dynamic library '/usr/lib/php74/pcre.so' (tried: /usr/lib/php74/pcre.so (/usr/lib/php74/pcre.so: cannot open shared object file: No such file or directory), /tmp/B.GLV3PE/BUILD/php74-pecl-solr-2.5.0/modules///usr/lib/php74/pcre.so.so (/tmp/B.GLV3PE/BUILD/php74-pecl-solr-2.5.0/modules///usr/lib/php74/pcre.so.so: cannot open shared object file: No such file or directory)) in Unknown on line 0 002+ 003+ Warning: PHP Startup: Unable to load dynamic library '/usr/lib/php74/pcre.so' (tried: /usr/lib/php74/pcre.so (/usr/lib/php74/pcre.so: cannot open shared object file: No such file or directory), /tmp/B.GLV3PE/BUILD/php74-pecl-solr-2.5.0/modules///usr/lib/php74/pcre.so.so (/tmp/B.GLV3PE/BUILD/php74-pecl-solr-2.5.0/modules///usr/lib/php74/pcre.so.so: cannot open shared object file: No such file or directory)) in Unknown on line 0 004+ ========DONE======== FAIL SolrQuery::collapse - throws SolrMissingMandatoryParameterException [tests/071.solrquery_collapse_exception.phpt] TEST 94/151 [tests/072.solrquery_expand.phpt] ========DIFF======== 001+ PHP Warning: PHP Startup: Unable to load dynamic library '/usr/lib/php74/pcre.so' (tried: /usr/lib/php74/pcre.so (/usr/lib/php74/pcre.so: cannot open shared object file: No such file or directory), /tmp/B.GLV3PE/BUILD/php74-pecl-solr-2.5.0/modules///usr/lib/php74/pcre.so.so (/tmp/B.GLV3PE/BUILD/php74-pecl-solr-2.5.0/modules///usr/lib/php74/pcre.so.so: cannot open shared object file: No such file or directory)) in Unknown on line 0 002+ 003+ Warning: PHP Startup: Unable to load dynamic library '/usr/lib/php74/pcre.so' (tried: /usr/lib/php74/pcre.so (/usr/lib/php74/pcre.so: cannot open shared object file: No such file or directory), /tmp/B.GLV3PE/BUILD/php74-pecl-solr-2.5.0/modules///usr/lib/php74/pcre.so.so (/tmp/B.GLV3PE/BUILD/php74-pecl-solr-2.5.0/modules///usr/lib/php74/pcre.so.so: cannot open shared object file: No such file or directory)) in Unknown on line 0 ========DONE======== FAIL SolrQuery - Expand Component [tests/072.solrquery_expand.phpt] TEST 95/151 [tests/080.solrutils_escapequerychars.phpt] ========DIFF======== 001+ PHP Warning: PHP Startup: Unable to load dynamic library '/usr/lib/php74/pcre.so' (tried: /usr/lib/php74/pcre.so (/usr/lib/php74/pcre.so: cannot open shared object file: No such file or directory), /tmp/B.GLV3PE/BUILD/php74-pecl-solr-2.5.0/modules///usr/lib/php74/pcre.so.so (/tmp/B.GLV3PE/BUILD/php74-pecl-solr-2.5.0/modules///usr/lib/php74/pcre.so.so: cannot open shared object file: No such file or directory)) in Unknown on line 0 002+ 003+ Warning: PHP Startup: Unable to load dynamic library '/usr/lib/php74/pcre.so' (tried: /usr/lib/php74/pcre.so (/usr/lib/php74/pcre.so: cannot open shared object file: No such file or directory), /tmp/B.GLV3PE/BUILD/php74-pecl-solr-2.5.0/modules///usr/lib/php74/pcre.so.so (/tmp/B.GLV3PE/BUILD/php74-pecl-solr-2.5.0/modules///usr/lib/php74/pcre.so.so: cannot open shared object file: No such file or directory)) in Unknown on line 0 ========DONE======== FAIL SolrUtils::escapeQueryChars() - Testing Lucene Reserved Characters [tests/080.solrutils_escapequerychars.phpt] TEST 96/151 [tests/081.solrutils_digest_json_response.phpt] ========DIFF======== 001+ PHP Warning: PHP Startup: Unable to load dynamic library '/usr/lib/php74/pcre.so' (tried: /usr/lib/php74/pcre.so (/usr/lib/php74/pcre.so: cannot open shared object file: No such file or directory), /tmp/B.GLV3PE/BUILD/php74-pecl-solr-2.5.0/modules///usr/lib/php74/pcre.so.so (/tmp/B.GLV3PE/BUILD/php74-pecl-solr-2.5.0/modules///usr/lib/php74/pcre.so.so: cannot open shared object file: No such file or directory)) in Unknown on line 0 002+ 003+ Warning: PHP Startup: Unable to load dynamic library '/usr/lib/php74/pcre.so' (tried: /usr/lib/php74/pcre.so (/usr/lib/php74/pcre.so: cannot open shared object file: No such file or directory), /tmp/B.GLV3PE/BUILD/php74-pecl-solr-2.5.0/modules///usr/lib/php74/pcre.so.so (/tmp/B.GLV3PE/BUILD/php74-pecl-solr-2.5.0/modules///usr/lib/php74/pcre.so.so: cannot open shared object file: No such file or directory)) in Unknown on line 0 ========DONE======== FAIL SolrUtils::digestJsonResponse() - Digest JSON Response [tests/081.solrutils_digest_json_response.phpt] TEST 97/151 [tests/082.solrutils_getsolrversion.phpt] ========DIFF======== 001+ PHP Warning: PHP Startup: Unable to load dynamic library '/usr/lib/php74/pcre.so' (tried: /usr/lib/php74/pcre.so (/usr/lib/php74/pcre.so: cannot open shared object file: No such file or directory), /tmp/B.GLV3PE/BUILD/php74-pecl-solr-2.5.0/modules///usr/lib/php74/pcre.so.so (/tmp/B.GLV3PE/BUILD/php74-pecl-solr-2.5.0/modules///usr/lib/php74/pcre.so.so: cannot open shared object file: No such file or directory)) in Unknown on line 0 002+ 003+ Warning: PHP Startup: Unable to load dynamic library '/usr/lib/php74/pcre.so' (tried: /usr/lib/php74/pcre.so (/usr/lib/php74/pcre.so: cannot open shared object file: No such file or directory), /tmp/B.GLV3PE/BUILD/php74-pecl-solr-2.5.0/modules///usr/lib/php74/pcre.so.so (/tmp/B.GLV3PE/BUILD/php74-pecl-solr-2.5.0/modules///usr/lib/php74/pcre.so.so: cannot open shared object file: No such file or directory)) in Unknown on line 0 ========DONE======== FAIL SolrUtils::getSolrVersion() - Returns solr dotted version [tests/082.solrutils_getsolrversion.phpt] TEST 98/151 [tests/083.solrutils_getsolrstats.phpt] ========DIFF======== 001+ PHP Warning: PHP Startup: Unable to load dynamic library '/usr/lib/php74/pcre.so' (tried: /usr/lib/php74/pcre.so (/usr/lib/php74/pcre.so: cannot open shared object file: No such file or directory), /tmp/B.GLV3PE/BUILD/php74-pecl-solr-2.5.0/modules///usr/lib/php74/pcre.so.so (/tmp/B.GLV3PE/BUILD/php74-pecl-solr-2.5.0/modules///usr/lib/php74/pcre.so.so: cannot open shared object file: No such file or directory)) in Unknown on line 0 002+ 003+ Warning: PHP Startup: Unable to load dynamic library '/usr/lib/php74/pcre.so' (tried: /usr/lib/php74/pcre.so (/usr/lib/php74/pcre.so: cannot open shared object file: No such file or directory), /tmp/B.GLV3PE/BUILD/php74-pecl-solr-2.5.0/modules///usr/lib/php74/pcre.so.so (/tmp/B.GLV3PE/BUILD/php74-pecl-solr-2.5.0/modules///usr/lib/php74/pcre.so.so: cannot open shared object file: No such file or directory)) in Unknown on line 0 ========DONE======== FAIL SolrUtils::getSolrStats() - Get Statistics about number of documents/clients..etc [tests/083.solrutils_getsolrstats.phpt] TEST 99/151 [tests/084.solrutils_queryphrase.phpt] ========DIFF======== 001+ PHP Warning: PHP Startup: Unable to load dynamic library '/usr/lib/php74/pcre.so' (tried: /usr/lib/php74/pcre.so (/usr/lib/php74/pcre.so: cannot open shared object file: No such file or directory), /tmp/B.GLV3PE/BUILD/php74-pecl-solr-2.5.0/modules///usr/lib/php74/pcre.so.so (/tmp/B.GLV3PE/BUILD/php74-pecl-solr-2.5.0/modules///usr/lib/php74/pcre.so.so: cannot open shared object file: No such file or directory)) in Unknown on line 0 002+ 003+ Warning: PHP Startup: Unable to load dynamic library '/usr/lib/php74/pcre.so' (tried: /usr/lib/php74/pcre.so (/usr/lib/php74/pcre.so: cannot open shared object file: No such file or directory), /tmp/B.GLV3PE/BUILD/php74-pecl-solr-2.5.0/modules///usr/lib/php74/pcre.so.so (/tmp/B.GLV3PE/BUILD/php74-pecl-solr-2.5.0/modules///usr/lib/php74/pcre.so.so: cannot open shared object file: No such file or directory)) in Unknown on line 0 ========DONE======== FAIL SolrUtils::queryPhrase() - Escapes a query phrase [tests/084.solrutils_queryphrase.phpt] TEST 100/151 [tests/090.solrserverexception_xml.phpt] SKIP SolrServerException (xml) - Throw Exception on solr server exception using xml response writer [tests/090.solrserverexception_xml.phpt] reason: Solr server is not set up TEST 101/151 [tests/091.solrserverexception_json.phpt] SKIP SolrServerException (json) - Throw Exception on solr server exception using json response writer [tests/091.solrserverexception_json.phpt] reason: Solr server is not set up TEST 102/151 [tests/092.solrserverexception_php.phpt] SKIP SolrServerException (phps) - Throw Exception on solr server exception using phps response writer [tests/092.solrserverexception_php.phpt] reason: Solr server is not set up TEST 103/151 [tests/100.solrresponse_json.phpt] SKIP SolrResponse::getResponse - JSON response writer [tests/100.solrresponse_json.phpt] reason: Solr server is not set up TEST 104/151 [tests/101.solrresponse_parseMode.phpt] SKIP SolrResponse - ParseMode [tests/101.solrresponse_parseMode.phpt] reason: Solr server is not set up TEST 105/151 [tests/102.solrresponse_phps.phpt] SKIP SolrResponse::getResponse - PHPS response writer [tests/102.solrresponse_phps.phpt] reason: Solr server is not set up TEST 106/151 [tests/103.solrresponse_get_array_response.phpt] SKIP SolrResponse::getArrayResponse - For All response writers [tests/103.solrresponse_get_array_response.phpt] reason: Solr server is not set up TEST 107/151 [tests/104.solrresponse_get_response_maxscore.phpt] SKIP SolrResponse::getResponse() - maxScore [tests/104.solrresponse_get_response_maxscore.phpt] reason: Solr server is not set up TEST 108/151 [tests/105.solrresponse_child_doc_response.phpt] ========DIFF======== 001+ PHP Warning: PHP Startup: Unable to load dynamic library '/usr/lib/php74/pcre.so' (tried: /usr/lib/php74/pcre.so (/usr/lib/php74/pcre.so: cannot open shared object file: No such file or directory), /tmp/B.GLV3PE/BUILD/php74-pecl-solr-2.5.0/modules///usr/lib/php74/pcre.so.so (/tmp/B.GLV3PE/BUILD/php74-pecl-solr-2.5.0/modules///usr/lib/php74/pcre.so.so: cannot open shared object file: No such file or directory)) in Unknown on line 0 002+ 003+ Warning: PHP Startup: Unable to load dynamic library '/usr/lib/php74/pcre.so' (tried: /usr/lib/php74/pcre.so (/usr/lib/php74/pcre.so: cannot open shared object file: No such file or directory), /tmp/B.GLV3PE/BUILD/php74-pecl-solr-2.5.0/modules///usr/lib/php74/pcre.so.so (/tmp/B.GLV3PE/BUILD/php74-pecl-solr-2.5.0/modules///usr/lib/php74/pcre.so.so: cannot open shared object file: No such file or directory)) in Unknown on line 0 ========DONE======== FAIL Response - Response with child documents [tests/105.solrresponse_child_doc_response.phpt] TEST 109/151 [tests/106.solrresponse_child_doc_response_solrdoc.phpt] ========DIFF======== 001+ PHP Warning: PHP Startup: Unable to load dynamic library '/usr/lib/php74/pcre.so' (tried: /usr/lib/php74/pcre.so (/usr/lib/php74/pcre.so: cannot open shared object file: No such file or directory), /tmp/B.GLV3PE/BUILD/php74-pecl-solr-2.5.0/modules///usr/lib/php74/pcre.so.so (/tmp/B.GLV3PE/BUILD/php74-pecl-solr-2.5.0/modules///usr/lib/php74/pcre.so.so: cannot open shared object file: No such file or directory)) in Unknown on line 0 002+ 003+ Warning: PHP Startup: Unable to load dynamic library '/usr/lib/php74/pcre.so' (tried: /usr/lib/php74/pcre.so (/usr/lib/php74/pcre.so: cannot open shared object file: No such file or directory), /tmp/B.GLV3PE/BUILD/php74-pecl-solr-2.5.0/modules///usr/lib/php74/pcre.so.so (/tmp/B.GLV3PE/BUILD/php74-pecl-solr-2.5.0/modules///usr/lib/php74/pcre.so.so: cannot open shared object file: No such file or directory)) in Unknown on line 0 ========DONE======== FAIL SolrDocument - Response parsed as SolrDocument with child documents [tests/106.solrresponse_child_doc_response_solrdoc.phpt] TEST 110/151 [tests/107.solrresponse_getrawresponseheaders.phpt] SKIP SolrResponse::getRawResponseHeaders() - Get Raw Response Headers [tests/107.solrresponse_getrawresponseheaders.phpt] reason: Solr server is not set up TEST 111/151 [tests/108.solrresponse_getdigestedresponse.phpt] SKIP SolrResponse::getDigestedResponse() - Get Raw Response Headers [tests/108.solrresponse_getdigestedresponse.phpt] reason: Solr server is not set up TEST 112/151 [tests/109.solrresponse_gethttpstatus.phpt] SKIP SolrResponse::getHttpStatus() - getHttpStatusMessage() [tests/109.solrresponse_gethttpstatus.phpt] reason: Solr server is not set up TEST 113/151 [tests/109.solrresponse_getrequesturl.phpt] SKIP SolrResponse::getRequestUrl() - Get Raw Response Headers [tests/109.solrresponse_getrequesturl.phpt] reason: Solr server is not set up TEST 114/151 [tests/109.solrresponse_success.phpt] SKIP SolrResponse::success() - Was the request successful [tests/109.solrresponse_success.phpt] reason: Solr server is not set up TEST 115/151 [tests/110.solrdismaxquery.phpt] ========DIFF======== 001+ PHP Warning: PHP Startup: Unable to load dynamic library '/usr/lib/php74/pcre.so' (tried: /usr/lib/php74/pcre.so (/usr/lib/php74/pcre.so: cannot open shared object file: No such file or directory), /tmp/B.GLV3PE/BUILD/php74-pecl-solr-2.5.0/modules///usr/lib/php74/pcre.so.so (/tmp/B.GLV3PE/BUILD/php74-pecl-solr-2.5.0/modules///usr/lib/php74/pcre.so.so: cannot open shared object file: No such file or directory)) in Unknown on line 0 002+ 003+ Warning: PHP Startup: Unable to load dynamic library '/usr/lib/php74/pcre.so' (tried: /usr/lib/php74/pcre.so (/usr/lib/php74/pcre.so: cannot open shared object file: No such file or directory), /tmp/B.GLV3PE/BUILD/php74-pecl-solr-2.5.0/modules///usr/lib/php74/pcre.so.so (/tmp/B.GLV3PE/BUILD/php74-pecl-solr-2.5.0/modules///usr/lib/php74/pcre.so.so: cannot open shared object file: No such file or directory)) in Unknown on line 0 ========DONE======== FAIL SolrDisMaxQuery - Methods [tests/110.solrdismaxquery.phpt] TEST 116/151 [tests/111.solrdismaxquery_boostquery.phpt] ========DIFF======== 001+ PHP Warning: PHP Startup: Unable to load dynamic library '/usr/lib/php74/pcre.so' (tried: /usr/lib/php74/pcre.so (/usr/lib/php74/pcre.so: cannot open shared object file: No such file or directory), /tmp/B.GLV3PE/BUILD/php74-pecl-solr-2.5.0/modules///usr/lib/php74/pcre.so.so (/tmp/B.GLV3PE/BUILD/php74-pecl-solr-2.5.0/modules///usr/lib/php74/pcre.so.so: cannot open shared object file: No such file or directory)) in Unknown on line 0 002+ 003+ Warning: PHP Startup: Unable to load dynamic library '/usr/lib/php74/pcre.so' (tried: /usr/lib/php74/pcre.so (/usr/lib/php74/pcre.so: cannot open shared object file: No such file or directory), /tmp/B.GLV3PE/BUILD/php74-pecl-solr-2.5.0/modules///usr/lib/php74/pcre.so.so (/tmp/B.GLV3PE/BUILD/php74-pecl-solr-2.5.0/modules///usr/lib/php74/pcre.so.so: cannot open shared object file: No such file or directory)) in Unknown on line 0 ========DONE======== FAIL SolrDisMaxQuery - Boost Query [tests/111.solrdismaxquery_boostquery.phpt] TEST 117/151 [tests/112.solrdismaxquery_query_parser.phpt] ========DIFF======== 001+ PHP Warning: PHP Startup: Unable to load dynamic library '/usr/lib/php74/pcre.so' (tried: /usr/lib/php74/pcre.so (/usr/lib/php74/pcre.so: cannot open shared object file: No such file or directory), /tmp/B.GLV3PE/BUILD/php74-pecl-solr-2.5.0/modules///usr/lib/php74/pcre.so.so (/tmp/B.GLV3PE/BUILD/php74-pecl-solr-2.5.0/modules///usr/lib/php74/pcre.so.so: cannot open shared object file: No such file or directory)) in Unknown on line 0 002+ 003+ Warning: PHP Startup: Unable to load dynamic library '/usr/lib/php74/pcre.so' (tried: /usr/lib/php74/pcre.so (/usr/lib/php74/pcre.so: cannot open shared object file: No such file or directory), /tmp/B.GLV3PE/BUILD/php74-pecl-solr-2.5.0/modules///usr/lib/php74/pcre.so.so (/tmp/B.GLV3PE/BUILD/php74-pecl-solr-2.5.0/modules///usr/lib/php74/pcre.so.so: cannot open shared object file: No such file or directory)) in Unknown on line 0 ========DONE======== FAIL SolrDisMaxQuery - QueryParser Switch [tests/112.solrdismaxquery_query_parser.phpt] TEST 118/151 [tests/113.solrdismaxquery_bigramfields.phpt] ========DIFF======== 001+ PHP Warning: PHP Startup: Unable to load dynamic library '/usr/lib/php74/pcre.so' (tried: /usr/lib/php74/pcre.so (/usr/lib/php74/pcre.so: cannot open shared object file: No such file or directory), /tmp/B.GLV3PE/BUILD/php74-pecl-solr-2.5.0/modules///usr/lib/php74/pcre.so.so (/tmp/B.GLV3PE/BUILD/php74-pecl-solr-2.5.0/modules///usr/lib/php74/pcre.so.so: cannot open shared object file: No such file or directory)) in Unknown on line 0 002+ 003+ Warning: PHP Startup: Unable to load dynamic library '/usr/lib/php74/pcre.so' (tried: /usr/lib/php74/pcre.so (/usr/lib/php74/pcre.so: cannot open shared object file: No such file or directory), /tmp/B.GLV3PE/BUILD/php74-pecl-solr-2.5.0/modules///usr/lib/php74/pcre.so.so (/tmp/B.GLV3PE/BUILD/php74-pecl-solr-2.5.0/modules///usr/lib/php74/pcre.so.so: cannot open shared object file: No such file or directory)) in Unknown on line 0 ========DONE======== FAIL SolrDisMaxQuery - BigramFields and slop (addBigramPhraseField, removeBigramPhraseField, setBigramPhraseFields) [tests/113.solrdismaxquery_bigramfields.phpt] TEST 119/151 [tests/114.solrdismaxquery_trigramfields.phpt] ========DIFF======== 001+ PHP Warning: PHP Startup: Unable to load dynamic library '/usr/lib/php74/pcre.so' (tried: /usr/lib/php74/pcre.so (/usr/lib/php74/pcre.so: cannot open shared object file: No such file or directory), /tmp/B.GLV3PE/BUILD/php74-pecl-solr-2.5.0/modules///usr/lib/php74/pcre.so.so (/tmp/B.GLV3PE/BUILD/php74-pecl-solr-2.5.0/modules///usr/lib/php74/pcre.so.so: cannot open shared object file: No such file or directory)) in Unknown on line 0 002+ 003+ Warning: PHP Startup: Unable to load dynamic library '/usr/lib/php74/pcre.so' (tried: /usr/lib/php74/pcre.so (/usr/lib/php74/pcre.so: cannot open shared object file: No such file or directory), /tmp/B.GLV3PE/BUILD/php74-pecl-solr-2.5.0/modules///usr/lib/php74/pcre.so.so (/tmp/B.GLV3PE/BUILD/php74-pecl-solr-2.5.0/modules///usr/lib/php74/pcre.so.so: cannot open shared object file: No such file or directory)) in Unknown on line 0 ========DONE======== FAIL SolrDisMaxQuery - TrigramFields and slop (addTrigramPhraseField, removeTrigramPhraseField, setTrigramPhraseFields) [tests/114.solrdismaxquery_trigramfields.phpt] TEST 120/151 [tests/115.solrdismaxquery_userfields.phpt] ========DIFF======== 001+ PHP Warning: PHP Startup: Unable to load dynamic library '/usr/lib/php74/pcre.so' (tried: /usr/lib/php74/pcre.so (/usr/lib/php74/pcre.so: cannot open shared object file: No such file or directory), /tmp/B.GLV3PE/BUILD/php74-pecl-solr-2.5.0/modules///usr/lib/php74/pcre.so.so (/tmp/B.GLV3PE/BUILD/php74-pecl-solr-2.5.0/modules///usr/lib/php74/pcre.so.so: cannot open shared object file: No such file or directory)) in Unknown on line 0 002+ 003+ Warning: PHP Startup: Unable to load dynamic library '/usr/lib/php74/pcre.so' (tried: /usr/lib/php74/pcre.so (/usr/lib/php74/pcre.so: cannot open shared object file: No such file or directory), /tmp/B.GLV3PE/BUILD/php74-pecl-solr-2.5.0/modules///usr/lib/php74/pcre.so.so (/tmp/B.GLV3PE/BUILD/php74-pecl-solr-2.5.0/modules///usr/lib/php74/pcre.so.so: cannot open shared object file: No such file or directory)) in Unknown on line 0 ========DONE======== FAIL SolrDisMaxQuery - UserFields (uf parameter) (addUserField) [tests/115.solrdismaxquery_userfields.phpt] TEST 121/151 [tests/116.solrdismaxquery_boostfunction.phpt] ========DIFF======== 001+ PHP Warning: PHP Startup: Unable to load dynamic library '/usr/lib/php74/pcre.so' (tried: /usr/lib/php74/pcre.so (/usr/lib/php74/pcre.so: cannot open shared object file: No such file or directory), /tmp/B.GLV3PE/BUILD/php74-pecl-solr-2.5.0/modules///usr/lib/php74/pcre.so.so (/tmp/B.GLV3PE/BUILD/php74-pecl-solr-2.5.0/modules///usr/lib/php74/pcre.so.so: cannot open shared object file: No such file or directory)) in Unknown on line 0 002+ 003+ Warning: PHP Startup: Unable to load dynamic library '/usr/lib/php74/pcre.so' (tried: /usr/lib/php74/pcre.so (/usr/lib/php74/pcre.so: cannot open shared object file: No such file or directory), /tmp/B.GLV3PE/BUILD/php74-pecl-solr-2.5.0/modules///usr/lib/php74/pcre.so.so (/tmp/B.GLV3PE/BUILD/php74-pecl-solr-2.5.0/modules///usr/lib/php74/pcre.so.so: cannot open shared object file: No such file or directory)) in Unknown on line 0 ========DONE======== FAIL SolrDisMaxQuery - setBoostFunction [tests/116.solrdismaxquery_boostfunction.phpt] TEST 122/151 [tests/130.parameters_simple_list_separator.phpt] ========DIFF======== 001+ PHP Warning: PHP Startup: Unable to load dynamic library '/usr/lib/php74/pcre.so' (tried: /usr/lib/php74/pcre.so (/usr/lib/php74/pcre.so: cannot open shared object file: No such file or directory), /tmp/B.GLV3PE/BUILD/php74-pecl-solr-2.5.0/modules///usr/lib/php74/pcre.so.so (/tmp/B.GLV3PE/BUILD/php74-pecl-solr-2.5.0/modules///usr/lib/php74/pcre.so.so: cannot open shared object file: No such file or directory)) in Unknown on line 0 002+ 003+ Warning: PHP Startup: Unable to load dynamic library '/usr/lib/php74/pcre.so' (tried: /usr/lib/php74/pcre.so (/usr/lib/php74/pcre.so: cannot open shared object file: No such file or directory), /tmp/B.GLV3PE/BUILD/php74-pecl-solr-2.5.0/modules///usr/lib/php74/pcre.so.so (/tmp/B.GLV3PE/BUILD/php74-pecl-solr-2.5.0/modules///usr/lib/php74/pcre.so.so: cannot open shared object file: No such file or directory)) in Unknown on line 0 ========DONE======== FAIL simple_list_parameter type - Use of default, non-default separator [tests/130.parameters_simple_list_separator.phpt] TEST 123/151 [tests/150.solrcollapsefunction.phpt] ========DIFF======== 001+ PHP Warning: PHP Startup: Unable to load dynamic library '/usr/lib/php74/pcre.so' (tried: /usr/lib/php74/pcre.so (/usr/lib/php74/pcre.so: cannot open shared object file: No such file or directory), /tmp/B.GLV3PE/BUILD/php74-pecl-solr-2.5.0/modules///usr/lib/php74/pcre.so.so (/tmp/B.GLV3PE/BUILD/php74-pecl-solr-2.5.0/modules///usr/lib/php74/pcre.so.so: cannot open shared object file: No such file or directory)) in Unknown on line 0 002+ 003+ Warning: PHP Startup: Unable to load dynamic library '/usr/lib/php74/pcre.so' (tried: /usr/lib/php74/pcre.so (/usr/lib/php74/pcre.so: cannot open shared object file: No such file or directory), /tmp/B.GLV3PE/BUILD/php74-pecl-solr-2.5.0/modules///usr/lib/php74/pcre.so.so (/tmp/B.GLV3PE/BUILD/php74-pecl-solr-2.5.0/modules///usr/lib/php74/pcre.so.so: cannot open shared object file: No such file or directory)) in Unknown on line 0 ========DONE======== FAIL SolrCollapseFunction - string conversion [tests/150.solrcollapsefunction.phpt] TEST 124/151 [tests/151.solrcollapsefunction_illegal_operations.phpt] ========DIFF======== 001+ PHP Warning: PHP Startup: Unable to load dynamic library '/usr/lib/php74/pcre.so' (tried: /usr/lib/php74/pcre.so (/usr/lib/php74/pcre.so: cannot open shared object file: No such file or directory), /tmp/B.GLV3PE/BUILD/php74-pecl-solr-2.5.0/modules///usr/lib/php74/pcre.so.so (/tmp/B.GLV3PE/BUILD/php74-pecl-solr-2.5.0/modules///usr/lib/php74/pcre.so.so: cannot open shared object file: No such file or directory)) in Unknown on line 0 002+ 003+ Warning: PHP Startup: Unable to load dynamic library '/usr/lib/php74/pcre.so' (tried: /usr/lib/php74/pcre.so (/usr/lib/php74/pcre.so: cannot open shared object file: No such file or directory), /tmp/B.GLV3PE/BUILD/php74-pecl-solr-2.5.0/modules///usr/lib/php74/pcre.so.so (/tmp/B.GLV3PE/BUILD/php74-pecl-solr-2.5.0/modules///usr/lib/php74/pcre.so.so: cannot open shared object file: No such file or directory)) in Unknown on line 0 004+ ========DONE======== FAIL SolrCollapseFunction - Illegal Operations [tests/151.solrcollapsefunction_illegal_operations.phpt] TEST 125/151 [tests/160.solr_update_document_block.phpt] SKIP Solr - Fetch and Update nested documents [tests/160.solr_update_document_block.phpt] reason: Solr server is not set up TEST 126/151 [tests/180.solrdocumentfield_construct.phpt] ========DIFF======== 001+ PHP Warning: PHP Startup: Unable to load dynamic library '/usr/lib/php74/pcre.so' (tried: /usr/lib/php74/pcre.so (/usr/lib/php74/pcre.so: cannot open shared object file: No such file or directory), /tmp/B.GLV3PE/BUILD/php74-pecl-solr-2.5.0/modules///usr/lib/php74/pcre.so.so (/tmp/B.GLV3PE/BUILD/php74-pecl-solr-2.5.0/modules///usr/lib/php74/pcre.so.so: cannot open shared object file: No such file or directory)) in Unknown on line 0 002+ 003+ Warning: PHP Startup: Unable to load dynamic library '/usr/lib/php74/pcre.so' (tried: /usr/lib/php74/pcre.so (/usr/lib/php74/pcre.so: cannot open shared object file: No such file or directory), /tmp/B.GLV3PE/BUILD/php74-pecl-solr-2.5.0/modules///usr/lib/php74/pcre.so.so (/tmp/B.GLV3PE/BUILD/php74-pecl-solr-2.5.0/modules///usr/lib/php74/pcre.so.so: cannot open shared object file: No such file or directory)) in Unknown on line 0 ========DONE======== FAIL SolrDocumentField::__construct [tests/180.solrdocumentfield_construct.phpt] TEST 127/151 [tests/181.solrdocumentfield_write_property.phpt] ========DIFF======== 001+ PHP Warning: PHP Startup: Unable to load dynamic library '/usr/lib/php74/pcre.so' (tried: /usr/lib/php74/pcre.so (/usr/lib/php74/pcre.so: cannot open shared object file: No such file or directory), /tmp/B.GLV3PE/BUILD/php74-pecl-solr-2.5.0/modules///usr/lib/php74/pcre.so.so (/tmp/B.GLV3PE/BUILD/php74-pecl-solr-2.5.0/modules///usr/lib/php74/pcre.so.so: cannot open shared object file: No such file or directory)) in Unknown on line 0 002+ 003+ Warning: PHP Startup: Unable to load dynamic library '/usr/lib/php74/pcre.so' (tried: /usr/lib/php74/pcre.so (/usr/lib/php74/pcre.so: cannot open shared object file: No such file or directory), /tmp/B.GLV3PE/BUILD/php74-pecl-solr-2.5.0/modules///usr/lib/php74/pcre.so.so (/tmp/B.GLV3PE/BUILD/php74-pecl-solr-2.5.0/modules///usr/lib/php74/pcre.so.so: cannot open shared object file: No such file or directory)) in Unknown on line 0 ========DONE======== FAIL SolrDocumentField - exception - on write property [tests/181.solrdocumentfield_write_property.phpt] TEST 128/151 [tests/182.solrdocumentfield_unset_property.phpt] ========DIFF======== 001+ PHP Warning: PHP Startup: Unable to load dynamic library '/usr/lib/php74/pcre.so' (tried: /usr/lib/php74/pcre.so (/usr/lib/php74/pcre.so: cannot open shared object file: No such file or directory), /tmp/B.GLV3PE/BUILD/php74-pecl-solr-2.5.0/modules///usr/lib/php74/pcre.so.so (/tmp/B.GLV3PE/BUILD/php74-pecl-solr-2.5.0/modules///usr/lib/php74/pcre.so.so: cannot open shared object file: No such file or directory)) in Unknown on line 0 002+ 003+ Warning: PHP Startup: Unable to load dynamic library '/usr/lib/php74/pcre.so' (tried: /usr/lib/php74/pcre.so (/usr/lib/php74/pcre.so: cannot open shared object file: No such file or directory), /tmp/B.GLV3PE/BUILD/php74-pecl-solr-2.5.0/modules///usr/lib/php74/pcre.so.so (/tmp/B.GLV3PE/BUILD/php74-pecl-solr-2.5.0/modules///usr/lib/php74/pcre.so.so: cannot open shared object file: No such file or directory)) in Unknown on line 0 ========DONE======== FAIL SolrDocumentField - exception - on unset property [tests/182.solrdocumentfield_unset_property.phpt] TEST 129/151 [tests/190.solrparams_setparam.phpt] ========DIFF======== 001+ PHP Warning: PHP Startup: Unable to load dynamic library '/usr/lib/php74/pcre.so' (tried: /usr/lib/php74/pcre.so (/usr/lib/php74/pcre.so: cannot open shared object file: No such file or directory), /tmp/B.GLV3PE/BUILD/php74-pecl-solr-2.5.0/modules///usr/lib/php74/pcre.so.so (/tmp/B.GLV3PE/BUILD/php74-pecl-solr-2.5.0/modules///usr/lib/php74/pcre.so.so: cannot open shared object file: No such file or directory)) in Unknown on line 0 002+ 003+ Warning: PHP Startup: Unable to load dynamic library '/usr/lib/php74/pcre.so' (tried: /usr/lib/php74/pcre.so (/usr/lib/php74/pcre.so: cannot open shared object file: No such file or directory), /tmp/B.GLV3PE/BUILD/php74-pecl-solr-2.5.0/modules///usr/lib/php74/pcre.so.so (/tmp/B.GLV3PE/BUILD/php74-pecl-solr-2.5.0/modules///usr/lib/php74/pcre.so.so: cannot open shared object file: No such file or directory)) in Unknown on line 0 ========DONE======== FAIL SolrParams::setParam() [tests/190.solrparams_setparam.phpt] TEST 130/151 [tests/191.solrparams_addparam.phpt] ========DIFF======== 001+ PHP Warning: PHP Startup: Unable to load dynamic library '/usr/lib/php74/pcre.so' (tried: /usr/lib/php74/pcre.so (/usr/lib/php74/pcre.so: cannot open shared object file: No such file or directory), /tmp/B.GLV3PE/BUILD/php74-pecl-solr-2.5.0/modules///usr/lib/php74/pcre.so.so (/tmp/B.GLV3PE/BUILD/php74-pecl-solr-2.5.0/modules///usr/lib/php74/pcre.so.so: cannot open shared object file: No such file or directory)) in Unknown on line 0 002+ 003+ Warning: PHP Startup: Unable to load dynamic library '/usr/lib/php74/pcre.so' (tried: /usr/lib/php74/pcre.so (/usr/lib/php74/pcre.so: cannot open shared object file: No such file or directory), /tmp/B.GLV3PE/BUILD/php74-pecl-solr-2.5.0/modules///usr/lib/php74/pcre.so.so (/tmp/B.GLV3PE/BUILD/php74-pecl-solr-2.5.0/modules///usr/lib/php74/pcre.so.so: cannot open shared object file: No such file or directory)) in Unknown on line 0 ========DONE======== FAIL SolrParams::addParam() [tests/191.solrparams_addparam.phpt] TEST 131/151 [tests/192.solrparams_getparam.phpt] ========DIFF======== 001+ PHP Warning: PHP Startup: Unable to load dynamic library '/usr/lib/php74/pcre.so' (tried: /usr/lib/php74/pcre.so (/usr/lib/php74/pcre.so: cannot open shared object file: No such file or directory), /tmp/B.GLV3PE/BUILD/php74-pecl-solr-2.5.0/modules///usr/lib/php74/pcre.so.so (/tmp/B.GLV3PE/BUILD/php74-pecl-solr-2.5.0/modules///usr/lib/php74/pcre.so.so: cannot open shared object file: No such file or directory)) in Unknown on line 0 002+ 003+ Warning: PHP Startup: Unable to load dynamic library '/usr/lib/php74/pcre.so' (tried: /usr/lib/php74/pcre.so (/usr/lib/php74/pcre.so: cannot open shared object file: No such file or directory), /tmp/B.GLV3PE/BUILD/php74-pecl-solr-2.5.0/modules///usr/lib/php74/pcre.so.so (/tmp/B.GLV3PE/BUILD/php74-pecl-solr-2.5.0/modules///usr/lib/php74/pcre.so.so: cannot open shared object file: No such file or directory)) in Unknown on line 0 ========DONE======== FAIL SolrParams::getParam() [tests/192.solrparams_getparam.phpt] TEST 132/151 [tests/193.solrparams_getparams.phpt] ========DIFF======== 001+ PHP Warning: PHP Startup: Unable to load dynamic library '/usr/lib/php74/pcre.so' (tried: /usr/lib/php74/pcre.so (/usr/lib/php74/pcre.so: cannot open shared object file: No such file or directory), /tmp/B.GLV3PE/BUILD/php74-pecl-solr-2.5.0/modules///usr/lib/php74/pcre.so.so (/tmp/B.GLV3PE/BUILD/php74-pecl-solr-2.5.0/modules///usr/lib/php74/pcre.so.so: cannot open shared object file: No such file or directory)) in Unknown on line 0 002+ 003+ Warning: PHP Startup: Unable to load dynamic library '/usr/lib/php74/pcre.so' (tried: /usr/lib/php74/pcre.so (/usr/lib/php74/pcre.so: cannot open shared object file: No such file or directory), /tmp/B.GLV3PE/BUILD/php74-pecl-solr-2.5.0/modules///usr/lib/php74/pcre.so.so (/tmp/B.GLV3PE/BUILD/php74-pecl-solr-2.5.0/modules///usr/lib/php74/pcre.so.so: cannot open shared object file: No such file or directory)) in Unknown on line 0 ========DONE======== FAIL SolrParams::getParams() [tests/193.solrparams_getparams.phpt] TEST 133/151 [tests/194.solrparams_getpreparedparams.phpt] ========DIFF======== 001+ PHP Warning: PHP Startup: Unable to load dynamic library '/usr/lib/php74/pcre.so' (tried: /usr/lib/php74/pcre.so (/usr/lib/php74/pcre.so: cannot open shared object file: No such file or directory), /tmp/B.GLV3PE/BUILD/php74-pecl-solr-2.5.0/modules///usr/lib/php74/pcre.so.so (/tmp/B.GLV3PE/BUILD/php74-pecl-solr-2.5.0/modules///usr/lib/php74/pcre.so.so: cannot open shared object file: No such file or directory)) in Unknown on line 0 002+ 003+ Warning: PHP Startup: Unable to load dynamic library '/usr/lib/php74/pcre.so' (tried: /usr/lib/php74/pcre.so (/usr/lib/php74/pcre.so: cannot open shared object file: No such file or directory), /tmp/B.GLV3PE/BUILD/php74-pecl-solr-2.5.0/modules///usr/lib/php74/pcre.so.so (/tmp/B.GLV3PE/BUILD/php74-pecl-solr-2.5.0/modules///usr/lib/php74/pcre.so.so: cannot open shared object file: No such file or directory)) in Unknown on line 0 ========DONE======== FAIL SolrParams::getPreparedParams() [tests/194.solrparams_getpreparedparams.phpt] TEST 134/151 [tests/195.solrparams_tostring.phpt] ========DIFF======== 001+ PHP Warning: PHP Startup: Unable to load dynamic library '/usr/lib/php74/pcre.so' (tried: /usr/lib/php74/pcre.so (/usr/lib/php74/pcre.so: cannot open shared object file: No such file or directory), /tmp/B.GLV3PE/BUILD/php74-pecl-solr-2.5.0/modules///usr/lib/php74/pcre.so.so (/tmp/B.GLV3PE/BUILD/php74-pecl-solr-2.5.0/modules///usr/lib/php74/pcre.so.so: cannot open shared object file: No such file or directory)) in Unknown on line 0 002+ 003+ Warning: PHP Startup: Unable to load dynamic library '/usr/lib/php74/pcre.so' (tried: /usr/lib/php74/pcre.so (/usr/lib/php74/pcre.so: cannot open shared object file: No such file or directory), /tmp/B.GLV3PE/BUILD/php74-pecl-solr-2.5.0/modules///usr/lib/php74/pcre.so.so (/tmp/B.GLV3PE/BUILD/php74-pecl-solr-2.5.0/modules///usr/lib/php74/pcre.so.so: cannot open shared object file: No such file or directory)) in Unknown on line 0 ========DONE======== FAIL SolrParams::toString() [tests/195.solrparams_tostring.phpt] TEST 135/151 [tests/196.solrparams_serialize.phpt] ========DIFF======== 001+ PHP Warning: PHP Startup: Unable to load dynamic library '/usr/lib/php74/pcre.so' (tried: /usr/lib/php74/pcre.so (/usr/lib/php74/pcre.so: cannot open shared object file: No such file or directory), /tmp/B.GLV3PE/BUILD/php74-pecl-solr-2.5.0/modules///usr/lib/php74/pcre.so.so (/tmp/B.GLV3PE/BUILD/php74-pecl-solr-2.5.0/modules///usr/lib/php74/pcre.so.so: cannot open shared object file: No such file or directory)) in Unknown on line 0 002+ 003+ Warning: PHP Startup: Unable to load dynamic library '/usr/lib/php74/pcre.so' (tried: /usr/lib/php74/pcre.so (/usr/lib/php74/pcre.so: cannot open shared object file: No such file or directory), /tmp/B.GLV3PE/BUILD/php74-pecl-solr-2.5.0/modules///usr/lib/php74/pcre.so.so (/tmp/B.GLV3PE/BUILD/php74-pecl-solr-2.5.0/modules///usr/lib/php74/pcre.so.so: cannot open shared object file: No such file or directory)) in Unknown on line 0 ========DONE======== FAIL SolrParams::serialize() - serialize params [tests/196.solrparams_serialize.phpt] TEST 136/151 [tests/197.solrparams_unserialize.phpt] ========DIFF======== 001+ PHP Warning: PHP Startup: Unable to load dynamic library '/usr/lib/php74/pcre.so' (tried: /usr/lib/php74/pcre.so (/usr/lib/php74/pcre.so: cannot open shared object file: No such file or directory), /tmp/B.GLV3PE/BUILD/php74-pecl-solr-2.5.0/modules///usr/lib/php74/pcre.so.so (/tmp/B.GLV3PE/BUILD/php74-pecl-solr-2.5.0/modules///usr/lib/php74/pcre.so.so: cannot open shared object file: No such file or directory)) in Unknown on line 0 002+ 003+ Warning: PHP Startup: Unable to load dynamic library '/usr/lib/php74/pcre.so' (tried: /usr/lib/php74/pcre.so (/usr/lib/php74/pcre.so: cannot open shared object file: No such file or directory), /tmp/B.GLV3PE/BUILD/php74-pecl-solr-2.5.0/modules///usr/lib/php74/pcre.so.so (/tmp/B.GLV3PE/BUILD/php74-pecl-solr-2.5.0/modules///usr/lib/php74/pcre.so.so: cannot open shared object file: No such file or directory)) in Unknown on line 0 ========DONE======== FAIL SolrParams::unserialize() [tests/197.solrparams_unserialize.phpt] TEST 137/151 [tests/198.solrparams_clone.phpt] ========DIFF======== 001+ PHP Warning: PHP Startup: Unable to load dynamic library '/usr/lib/php74/pcre.so' (tried: /usr/lib/php74/pcre.so (/usr/lib/php74/pcre.so: cannot open shared object file: No such file or directory), /tmp/B.GLV3PE/BUILD/php74-pecl-solr-2.5.0/modules///usr/lib/php74/pcre.so.so (/tmp/B.GLV3PE/BUILD/php74-pecl-solr-2.5.0/modules///usr/lib/php74/pcre.so.so: cannot open shared object file: No such file or directory)) in Unknown on line 0 002+ 003+ Warning: PHP Startup: Unable to load dynamic library '/usr/lib/php74/pcre.so' (tried: /usr/lib/php74/pcre.so (/usr/lib/php74/pcre.so: cannot open shared object file: No such file or directory), /tmp/B.GLV3PE/BUILD/php74-pecl-solr-2.5.0/modules///usr/lib/php74/pcre.so.so (/tmp/B.GLV3PE/BUILD/php74-pecl-solr-2.5.0/modules///usr/lib/php74/pcre.so.so: cannot open shared object file: No such file or directory)) in Unknown on line 0 ========DONE======== FAIL SolrParams - clone [exception] [tests/198.solrparams_clone.phpt] TEST 138/151 [tests/200.solrextractrequest_clone.phpt] ========DIFF======== 001+ PHP Warning: PHP Startup: Unable to load dynamic library '/usr/lib/php74/pcre.so' (tried: /usr/lib/php74/pcre.so (/usr/lib/php74/pcre.so: cannot open shared object file: No such file or directory), /tmp/B.GLV3PE/BUILD/php74-pecl-solr-2.5.0/modules///usr/lib/php74/pcre.so.so (/tmp/B.GLV3PE/BUILD/php74-pecl-solr-2.5.0/modules///usr/lib/php74/pcre.so.so: cannot open shared object file: No such file or directory)) in Unknown on line 0 002+ 003+ Warning: PHP Startup: Unable to load dynamic library '/usr/lib/php74/pcre.so' (tried: /usr/lib/php74/pcre.so (/usr/lib/php74/pcre.so: cannot open shared object file: No such file or directory), /tmp/B.GLV3PE/BUILD/php74-pecl-solr-2.5.0/modules///usr/lib/php74/pcre.so.so (/tmp/B.GLV3PE/BUILD/php74-pecl-solr-2.5.0/modules///usr/lib/php74/pcre.so.so: cannot open shared object file: No such file or directory)) in Unknown on line 0 ========DONE======== FAIL SolrExtractRequest - clone [exception] [tests/200.solrextractrequest_clone.phpt] TEST 139/151 [tests/201.solrextractrequest_serialize.phpt] ========DIFF======== 001+ PHP Warning: PHP Startup: Unable to load dynamic library '/usr/lib/php74/pcre.so' (tried: /usr/lib/php74/pcre.so (/usr/lib/php74/pcre.so: cannot open shared object file: No such file or directory), /tmp/B.GLV3PE/BUILD/php74-pecl-solr-2.5.0/modules///usr/lib/php74/pcre.so.so (/tmp/B.GLV3PE/BUILD/php74-pecl-solr-2.5.0/modules///usr/lib/php74/pcre.so.so: cannot open shared object file: No such file or directory)) in Unknown on line 0 002+ 003+ Warning: PHP Startup: Unable to load dynamic library '/usr/lib/php74/pcre.so' (tried: /usr/lib/php74/pcre.so (/usr/lib/php74/pcre.so: cannot open shared object file: No such file or directory), /tmp/B.GLV3PE/BUILD/php74-pecl-solr-2.5.0/modules///usr/lib/php74/pcre.so.so (/tmp/B.GLV3PE/BUILD/php74-pecl-solr-2.5.0/modules///usr/lib/php74/pcre.so.so: cannot open shared object file: No such file or directory)) in Unknown on line 0 ========DONE======== FAIL SolrExtractRequest - serialize [exception] [tests/201.solrextractrequest_serialize.phpt] TEST 140/151 [tests/bug_59511_error.phpt] SKIP Solr bug #59511 - SolrClient::query() Timeout shall throw a SolrClientException [tests/bug_59511_error.phpt] reason: Solr server is not set up TEST 141/151 [tests/bug_61836_error.phpt] SKIP Solr bug #61836 - Extending SolrDocument [tests/bug_61836_error.phpt] reason: Solr server is not set up TEST 142/151 [tests/bug_67394.phpt] ========DIFF======== 001+ PHP Warning: PHP Startup: Unable to load dynamic library '/usr/lib/php74/pcre.so' (tried: /usr/lib/php74/pcre.so (/usr/lib/php74/pcre.so: cannot open shared object file: No such file or directory), /tmp/B.GLV3PE/BUILD/php74-pecl-solr-2.5.0/modules///usr/lib/php74/pcre.so.so (/tmp/B.GLV3PE/BUILD/php74-pecl-solr-2.5.0/modules///usr/lib/php74/pcre.so.so: cannot open shared object file: No such file or directory)) in Unknown on line 0 002+ 003+ Warning: PHP Startup: Unable to load dynamic library '/usr/lib/php74/pcre.so' (tried: /usr/lib/php74/pcre.so (/usr/lib/php74/pcre.so: cannot open shared object file: No such file or directory), /tmp/B.GLV3PE/BUILD/php74-pecl-solr-2.5.0/modules///usr/lib/php74/pcre.so.so (/tmp/B.GLV3PE/BUILD/php74-pecl-solr-2.5.0/modules///usr/lib/php74/pcre.so.so: cannot open shared object file: No such file or directory)) in Unknown on line 0 ========DONE======== FAIL Solr Bug #67394 - Unable to parse response with NaN [tests/bug_67394.phpt] TEST 143/151 [tests/bug_68179.phpt] ========DIFF======== 001+ PHP Warning: PHP Startup: Unable to load dynamic library '/usr/lib/php74/pcre.so' (tried: /usr/lib/php74/pcre.so (/usr/lib/php74/pcre.so: cannot open shared object file: No such file or directory), /tmp/B.GLV3PE/BUILD/php74-pecl-solr-2.5.0/modules///usr/lib/php74/pcre.so.so (/tmp/B.GLV3PE/BUILD/php74-pecl-solr-2.5.0/modules///usr/lib/php74/pcre.so.so: cannot open shared object file: No such file or directory)) in Unknown on line 0 002+ 003+ Warning: PHP Startup: Unable to load dynamic library '/usr/lib/php74/pcre.so' (tried: /usr/lib/php74/pcre.so (/usr/lib/php74/pcre.so: cannot open shared object file: No such file or directory), /tmp/B.GLV3PE/BUILD/php74-pecl-solr-2.5.0/modules///usr/lib/php74/pcre.so.so (/tmp/B.GLV3PE/BUILD/php74-pecl-solr-2.5.0/modules///usr/lib/php74/pcre.so.so: cannot open shared object file: No such file or directory)) in Unknown on line 0 ========DONE======== FAIL Solr Bug #68179 - Solr Params (Argument list) separator disappears [tests/bug_68179.phpt] TEST 144/151 [tests/bug_68181.phpt] ========DIFF======== 001+ PHP Warning: PHP Startup: Unable to load dynamic library '/usr/lib/php74/pcre.so' (tried: /usr/lib/php74/pcre.so (/usr/lib/php74/pcre.so: cannot open shared object file: No such file or directory), /tmp/B.GLV3PE/BUILD/php74-pecl-solr-2.5.0/modules///usr/lib/php74/pcre.so.so (/tmp/B.GLV3PE/BUILD/php74-pecl-solr-2.5.0/modules///usr/lib/php74/pcre.so.so: cannot open shared object file: No such file or directory)) in Unknown on line 0 002+ 003+ Warning: PHP Startup: Unable to load dynamic library '/usr/lib/php74/pcre.so' (tried: /usr/lib/php74/pcre.so (/usr/lib/php74/pcre.so: cannot open shared object file: No such file or directory), /tmp/B.GLV3PE/BUILD/php74-pecl-solr-2.5.0/modules///usr/lib/php74/pcre.so.so (/tmp/B.GLV3PE/BUILD/php74-pecl-solr-2.5.0/modules///usr/lib/php74/pcre.so.so: cannot open shared object file: No such file or directory)) in Unknown on line 0 004+ ========DONE======== FAIL Solr Bug #68181 - Conflict occurs when using SolrDisMax::addBoostQuery and setBoostQuery [tests/bug_68181.phpt] TEST 145/151 [tests/bug_69156.phpt] SKIP Solr Bug #69156 - segfault on 500 response from Solr [tests/bug_69156.phpt] reason: Solr server is not set up TEST 146/151 [tests/bug_70482.phpt] SKIP Solr Bug #70482 - Segmentation fault on server 500 response with no msg field XML RW [tests/bug_70482.phpt] reason: Solr server is not set up TEST 147/151 [tests/bug_70495.phpt] SKIP Solr Bug #70495 - Failed to parse 500 error response when Solr it lacks msg JSON RW [tests/bug_70495.phpt] reason: Solr server is not set up TEST 148/151 [tests/bug_70496.phpt] SKIP Solr Bug #70496 - Failed to parse 500 error response when Solr it lacks msg PHPS RW [tests/bug_70496.phpt] reason: Solr server is not set up TEST 149/151 [tests/bug_72033.phpt] SKIP Solr Bug #72033 - Real Time Get requests fails if it wasn't the first request [tests/bug_72033.phpt] reason: Solr server is not set up TEST 150/151 [tests/bug_72740.phpt] SKIP Solr Bug #72740 - addQueryField return wrong query [tests/bug_72740.phpt] reason: Solr server is not set up TEST 151/151 [tests/bug_unknown.phpt] SKIP Solr Bug #70496 - Failed to parse 500 error response when Solr it lacks msg PHPS RW [tests/bug_unknown.phpt] reason: Solr server is not set up ===================================================================== TIME END 2019-08-06 14:23:04 ===================================================================== TEST RESULT SUMMARY --------------------------------------------------------------------- Exts skipped : 0 Exts tested : 11 --------------------------------------------------------------------- Number of tests : 151 95 Tests skipped : 56 ( 37.1%) -------- Tests warned : 0 ( 0.0%) ( 0.0%) Tests failed : 95 ( 62.9%) (100.0%) Tests passed : 0 ( 0.0%) ( 0.0%) --------------------------------------------------------------------- Time taken : 3 seconds ===================================================================== ===================================================================== FAILED TEST SUMMARY --------------------------------------------------------------------- SolrClient::getOptions - Returning all the default options [tests/010.solrclient_getOptions.phpt] SolrClient - PHPS response writer support [tests/011.solrclient_phps_response.phpt] SolrDocument - checking dimension and magic property sets. [tests/020.solrdocument_adding_fields.phpt] SolrInputDocument::updateField [tests/020.solrdocument_update_field.phpt] SolrDocument - checking Iterator interface implementation [tests/021.solrdocument_iterator.phpt] SolrDocument::getInputDocument() - creating SolrInputDocument from SolrDocument [tests/022.solrdocument_getInputDocument.phpt] SolrDocument::merge() - merging source document into current document [tests/023.solrdocument_merge.phpt] SolrDocument::merge() - merging source document into current document without overwrite [tests/023.solrdocument_merge_no_overwrite.phpt] SolrDocument::hasChildDocuments() - Method test [tests/025.solrdocument_haschilddocuments.phpt] SolrDocument::getChildDocumentsCount() - Method test [tests/026.solrdocument_getchilddocscount.phpt] SolrDocument::getInputDocument() - Where document has child docs [tests/027.solrdocument_getinputdocument_children.phpt] SolrDocument - clone [tests/028.solrdocument_clone.phpt] SolrDocument - clone [tests/029.solrdocument_serialize.phpt] SolrDocument - magic __isset/__unset/__get/__set [tests/030.solrdocument_magic.phpt] SolrDocument::clear - Remove all fields from the document [tests/031.solrdocument_clear.phpt] SolrDocument::fieldExists [tests/032.solrdocument_fieldexists.phpt] SolrDocument::sort - Sort Document fields [tests/033.solrdocument_sort.phpt] SolrDocument::deleteField [tests/034.solrdocument_deletefield.phpt] SolrDocument::getFieldNames [tests/035.solrdocument_getfieldnames.phpt] SolrDocument - Array Access [tests/036.solrdocument_array_access.phpt] SolrDocument::getField [tests/037.solrdocument_getfield.phpt] SolrObject - checking xml response digest [tests/040.solrobject_xmlresponse.phpt] SolrObject - checking illegal operation of modifying object [tests/041.solrobject_illegal_operation.phpt] SolrObject - testing the magic property access [tests/042.solrobject_magic_property.phpt] SolrObject - test property access [tests/043.solrobject_magic_properties.phpt] SolrObject - checking dimension access on properties. [tests/044.solrobject_dimension_access_properties.phpt] SolrObject - checking dimension access on properties. [tests/045.solrobject_array_access.phpt] SolrObject - SolrObject::getPropertyNames() [tests/046.solrobject_getpropertynames.phpt] SolrObject::offsetExists [tests/047.solrobject_offsetExists.phpt] SolrInputDocument::addChildDocument() - add child document [tests/050.solrinputdocument_addchilddocument_01.phpt] SolrInputDocument::addChildDocument()/SolrInputDocument::addChildDocuments() - Expected SolrIllegalArgumentException [tests/050.solrinputdocument_addchilddocument_02_error.phpt] SolrInputDocument::getChildDocuments() - test [tests/051.solrinputdocument_getchilddocuments.phpt] SolrInputDocument::hasChildDocuments() - test [tests/052.solrinputdocument_haschilddocuments.phpt] SolrInputDocument::getChildDocumentsCount() - test [tests/053.solrinputdocument_getchilddocumentscount.phpt] SolrInputDocument::addChildDocuments() - add child documents [tests/054.solrinputdocument_addchilddocuments.phpt] SolrInputDocument - serialize/unserialize Exception [tests/055.solrinputdocument_serialization.phpt] SolrInputDocument::toArray - Array conversion [tests/056.solrinputdocument_toArray.phpt] SolrInputDocument - clone [tests/057.solrinputdocument_clone.phpt] SolrInputDocument::deleteField - Delete a field from SolrInputDocument [tests/058.solrinputdocument_deletefield.phpt] SolrInputDocument::clear - Clear document fields [tests/059.solrinputdocument_clear.phpt] SolrInputDocument::fieldExists [tests/059.solrinputdocument_fieldexists.phpt] SolrInputDocument::getBoost - Test document fieldnames [tests/059.solrinputdocument_getboost.phpt] SolrInputDocument::getField [tests/059.solrinputdocument_getfield.phpt] SolrInputDocument::getFieldCount [tests/059.solrinputdocument_getfieldcount.phpt] SolrInputDocument::getFieldNames - Test document fieldnames [tests/059.solrinputdocument_getfieldnames.phpt] SolrInputDocument::merge - Merge 2 docs [tests/059.solrinputdocument_merge.phpt] SolrInputDocument::getFieldBoost [tests/059.solrinputdocument_set_getfieldboost.phpt] SolrInputDocument::sort - Sort Document fields [tests/059.solrinputdocument_sort.phpt] SolrQuery - testing CommonQueryParameters [tests/060.solrquery_comon_query_params.phpt] SolrQuery - testing SimpleFacetParameters [tests/061.solrquery_simpleFacetParameters.phpt] SolrQuery - Testing Date facet parameters [tests/062.solrquery_date_facet_parameters.phpt] SolrQuery - testing HighlightingParameters [tests/063.solrquery_HighlightingParameters.phpt] SolrQuery - testing StatsComponent [tests/064.solrquery_StatsComponent.phpt] SolrQuery - testing MoreLikeThis component [tests/065.solrquery_MoreLikeThis.phpt] SolrQuery - testing TermsComponent [tests/066.solrquery_TermsComponent.phpt] SolrQuery::_construct - Throws exception on illegal Argument [tests/067.solrquery__construct.phpt] SolrQuery - Invalid Parameters thorws exception Throws exception on illegal Argument [tests/068.solrquery_parameters_error.phpt] SolrQuery - Result Grouping (Group Parameters) [tests/069.solrquery_GroupParameters.phpt] SolrQuery::collapse - Collapse Using a SolrCollapseFunction [tests/070.solrquery_collapse.phpt] SolrQuery::collapse - throws SolrMissingMandatoryParameterException [tests/071.solrquery_collapse_exception.phpt] SolrQuery - Expand Component [tests/072.solrquery_expand.phpt] SolrUtils::escapeQueryChars() - Testing Lucene Reserved Characters [tests/080.solrutils_escapequerychars.phpt] SolrUtils::digestJsonResponse() - Digest JSON Response [tests/081.solrutils_digest_json_response.phpt] SolrUtils::getSolrVersion() - Returns solr dotted version [tests/082.solrutils_getsolrversion.phpt] SolrUtils::getSolrStats() - Get Statistics about number of documents/clients..etc [tests/083.solrutils_getsolrstats.phpt] SolrUtils::queryPhrase() - Escapes a query phrase [tests/084.solrutils_queryphrase.phpt] Response - Response with child documents [tests/105.solrresponse_child_doc_response.phpt] SolrDocument - Response parsed as SolrDocument with child documents [tests/106.solrresponse_child_doc_response_solrdoc.phpt] SolrDisMaxQuery - Methods [tests/110.solrdismaxquery.phpt] SolrDisMaxQuery - Boost Query [tests/111.solrdismaxquery_boostquery.phpt] SolrDisMaxQuery - QueryParser Switch [tests/112.solrdismaxquery_query_parser.phpt] SolrDisMaxQuery - BigramFields and slop (addBigramPhraseField, removeBigramPhraseField, setBigramPhraseFields) [tests/113.solrdismaxquery_bigramfields.phpt] SolrDisMaxQuery - TrigramFields and slop (addTrigramPhraseField, removeTrigramPhraseField, setTrigramPhraseFields) [tests/114.solrdismaxquery_trigramfields.phpt] SolrDisMaxQuery - UserFields (uf parameter) (addUserField) [tests/115.solrdismaxquery_userfields.phpt] SolrDisMaxQuery - setBoostFunction [tests/116.solrdismaxquery_boostfunction.phpt] simple_list_parameter type - Use of default, non-default separator [tests/130.parameters_simple_list_separator.phpt] SolrCollapseFunction - string conversion [tests/150.solrcollapsefunction.phpt] SolrCollapseFunction - Illegal Operations [tests/151.solrcollapsefunction_illegal_operations.phpt] SolrDocumentField::__construct [tests/180.solrdocumentfield_construct.phpt] SolrDocumentField - exception - on write property [tests/181.solrdocumentfield_write_property.phpt] SolrDocumentField - exception - on unset property [tests/182.solrdocumentfield_unset_property.phpt] SolrParams::setParam() [tests/190.solrparams_setparam.phpt] SolrParams::addParam() [tests/191.solrparams_addparam.phpt] SolrParams::getParam() [tests/192.solrparams_getparam.phpt] SolrParams::getParams() [tests/193.solrparams_getparams.phpt] SolrParams::getPreparedParams() [tests/194.solrparams_getpreparedparams.phpt] SolrParams::toString() [tests/195.solrparams_tostring.phpt] SolrParams::serialize() - serialize params [tests/196.solrparams_serialize.phpt] SolrParams::unserialize() [tests/197.solrparams_unserialize.phpt] SolrParams - clone [exception] [tests/198.solrparams_clone.phpt] SolrExtractRequest - clone [exception] [tests/200.solrextractrequest_clone.phpt] SolrExtractRequest - serialize [exception] [tests/201.solrextractrequest_serialize.phpt] Solr Bug #67394 - Unable to parse response with NaN [tests/bug_67394.phpt] Solr Bug #68179 - Solr Params (Argument list) separator disappears [tests/bug_68179.phpt] Solr Bug #68181 - Conflict occurs when using SolrDisMax::addBoostQuery and setBoostQuery [tests/bug_68181.phpt] ===================================================================== make: *** [Makefile:150: test] Error 1 error: Bad exit status from /tmp/B.GLV3PE/BUILD/tmp/rpm-tmp.99878 (%build) RPM build errors: %changelog not in descending chronological order Bad exit status from /tmp/B.GLV3PE/BUILD/tmp/rpm-tmp.99878 (%build) ended at: Tue Aug 6 14:23:04 2019, done in 0:00:10.291413 error: No files produced. + chmod -R u+rwX /tmp/B.GLV3PE/BUILD + rm -rf /tmp/B.GLV3PE/tmp /tmp/B.GLV3PE/BUILD + rm -rf /tmp/B.GLV3PE Begin-PLD-Builder-Info Build-Time: user:26.30s sys:4.68s real:34.45s (faults io:1 non-io:1453201) End-PLD-Builder-Info
[Back to list of logs] [View rpm -qa of builder]