FailedOk

th/SRPMS[OK]
th/x32[OK]
th/i686[OK]
th/x86_64[OK]

ac/SRPMS[OK]
ac/i386[OK]
ac/i586[OK]
ac/i686[OK]
ac/alpha[OK]
ac/amd64[OK]
ac/athlon[OK]
ac/ppc[OK]
ac/sparc[OK]
ac/sparc64[OK]

Advanced Search
main()
Powered by PLD Linux
(c) 2002-2017 PLD Team
$Revision: 1.37 $
Powered by BOFH.
Your IP: 54.234.255.29

php-pecl-solr d75595bb-212e-4303-b9b9-be06686c29ac

Status:Failed
Source URL:ftp://buildlogs.pld-linux.org/th/i686/FAIL/php-pecl-solr,d75595bb-212e-4303-b9b9-be06686c29ac.bz2
text/plain URL:View!
full text:View!
rpm -qa of builder:View!
Date:2017/12/05 17:19:07
Runtime:0:00:06.376442

Toc:

  • error 1
  • rpm: error: Failed build dependencies:
  • error 2
  • rpm: error: Failed build dependencies:
  • prep
  • Executing(%prep): /bin/sh -e /tmp/B.qnXry_/BUILD/tmp/rpm-tmp.21039
  • build
  • Executing(%build): /bin/sh -e /tmp/B.qnXry_/BUILD/tmp/rpm-tmp.21039
  • error 3
  • /tmp/B.qnXry_/BUILD/php72-pecl-solr-2.4.0/src/php7/php_solr.c:560:56: error: 'ZEND_ACC_CLONE' undeclared here (not in a function); did you mean 'ZEND_AST_CLONE'?
  • error 4
  • /tmp/B.qnXry_/BUILD/php72-pecl-solr-2.4.0/src/php7/php_solr.c:603:59: error: invalid operands to binary | (have 'int' and 'zend_function_entry * {aka struct _zend_function_entry *}')
  • error 5
  • /usr/include/php/Zend/zend_compile.h:220:26: error: initializer element is not constant
  • error 6
  • /tmp/B.qnXry_/BUILD/php72-pecl-solr-2.4.0/src/php7/php_solr.c:636:52: error: invalid operands to binary | (have 'int' and 'zend_function_entry * {aka struct _zend_function_entry *}')
  • error 7
  • /usr/include/php/Zend/zend_compile.h:220:26: error: initializer element is not constant
  • error 8
  • /tmp/B.qnXry_/BUILD/php72-pecl-solr-2.4.0/src/php7/php_solr.c:713:52: error: invalid operands to binary | (have 'int' and 'zend_function_entry * {aka struct _zend_function_entry *}')
  • error 9
  • /usr/include/php/Zend/zend_compile.h:220:26: error: initializer element is not constant
  • error 10
  • error: Bad exit status from /tmp/B.qnXry_/BUILD/tmp/rpm-tmp.21039 (%build)
  • error 11
  • RPM build errors:
  • error 12
  • error: No files produced.

Content:

checking if we should skip the build
started at: Tue Dec  5 17:18:40 2017
fetching https://srcbuilder.pld-linux.org/th//srpms/d75595bb-212e-4303-b9b9-be06686c29ac/php72-pecl-solr-2.4.0-2.src.rpm
fetched 273193 bytes, 268.1 K/s
installing srpm: php72-pecl-solr-2.4.0-2.src.rpm
+ install -d /tmp/B.qnXry_/BUILD /tmp/B.qnXry_/RPMS
+ LC_ALL=en_US.UTF-8
+ rpm -qp --changelog php72-pecl-solr-2.4.0-2.src.rpm
* Tue Dec 05 2017 PLD Linux Team <feedback@pld-linux.org>
- For complete changelog see: http://git.pld-linux.org/?p=packages/php-pecl-solr.git;a=log;h=master
* Fri Nov 10 2017 Elan Ruusamäe <glen@pld-linux.org> 53f4a90
- need exts for -m test * Thu Nov 09 2017 Elan Ruusamäe <glen@pld-linux.org> eb3bdc6
- requires pcre ext; covered by tests * Thu Nov 09 2017 Elan Ruusamäe <glen@pld-linux.org> 5584ac4
- always test for module load * Thu Nov 09 2017 Elan Ruusamäe <glen@pld-linux.org> 19ad528
- up to 2.4.0; adds php7 support * Thu Nov 09 2017 Elan Ruusamäe <glen@pld-linux.org> d7ce20a
- requires php5.3 to build + rpm -Uhv --nodeps --define '_topdir /tmp/B.qnXry_' --define '_specdir %{_topdir}' --define '_sourcedir %{_specdir}' --define '_rpmdir %{_topdir}/RPMS' --define '_builddir %{_topdir}/BUILD' --define 'php_suffix 72' php72-pecl-solr-2.4.0-2.src.rpm Preparing... ################################################## php72-pecl-solr ################################################## + rm -f php72-pecl-solr-2.4.0-2.src.rpm + install -m 700 -d /tmp/B.qnXry_/BUILD/tmp + TMPDIR=/tmp/B.qnXry_/BUILD/tmp + exec nice -n 0 rpmbuild -bp --short-circuit --nodeps --define '_topdir /tmp/B.qnXry_' --define '_specdir %{_topdir}' --define '_sourcedir %{_specdir}' --define '_rpmdir %{_topdir}/RPMS' --define '_builddir %{_topdir}/BUILD' --target i686-pld-linux --define 'php_suffix 72' --define 'prep exit 0' /tmp/B.qnXry_/php-pecl-solr.spec sh: php-config: not found warning: %changelog not in descending chronological order Building target platforms: i686-pld-linux checking BuildConflict-ing packages no BuildConflicts found checking BR rpm: sh: php-config: not found rpm: warning: %changelog not in descending chronological order rpm: error: Failed build dependencies: rpm: php72-cli is needed by php72-pecl-solr-2.4.0-2.src rpm: php72-curl is needed by php72-pecl-solr-2.4.0-2.src rpm: php72-devel >= 4:5.3.0 is needed by php72-pecl-solr-2.4.0-2.src rpm: php72-json is needed by php72-pecl-solr-2.4.0-2.src rpm: php-packagexml2cl is needed by php72-pecl-solr-2.4.0-2.src rpm: php72-pcre is needed by php72-pecl-solr-2.4.0-2.src rpm: php72-xml is needed by php72-pecl-solr-2.4.0-2.src rpm: Building target platforms: i686-pld-linux updating poldek cache... ready is up to date Retrieving th::packages.ndir.md... th is up to date Retrieving th::packages.ndir.md... th is up to date Retrieving th-ready::packages.ndir.md... th-ready is up to date Retrieving th-ready::packages.ndir.md... th-ready is up to date Retrieving th-test::packages.ndir.md... th-test is up to date Retrieving th-test::packages.ndir.md... th-test is up to date checking conflicting packages in BRed packages poldek: Loading [pndir]ready... poldek: Loading [pndir]th-test... poldek: Loading [pndir]th-test... poldek: Loading [pndir]th-ready... poldek: Loading [pndir]th-ready... poldek: Loading [pndir]th... poldek: Loading [pndir]th... poldek: 28170 packages read poldek: Removed 1557 duplicate packages from available set poldek: Processing dependencies... poldek: php72-pcre-7.2.0-3.i686 marks php72-common-7.2.0-3.i686 (cap /etc/php72/conf.d) poldek: php-packagexml2cl-0.1-4.noarch marks php71-program-7.1.12-1.i686 (cap /usr/bin/php) poldek: php71-program-7.1.12-1.i686 marks php71-cli-7.1.12-1.i686 (cap php71-cli = 4:7.1.12-1) poldek: php71-cli-7.1.12-1.i686 marks php71-common-7.1.12-1.i686 (cap /etc/php71) poldek: php-packagexml2cl-0.1-4.noarch marks php71-simplexml-7.1.12-1.i686 (cap php(simplexml)) poldek: php71-simplexml-7.1.12-1.i686 marks php71-spl-7.1.12-1.i686 (cap php71-spl = 4:7.1.12-1) poldek: php71-spl-7.1.12-1.i686 marks php71-pcre-7.1.12-1.i686 (cap php71-pcre = 4:7.1.12-1) poldek: There are 14 packages to install (7 marked by dependencies): poldek: I php-packagexml2cl-0.1-4.noarch php72-cli-7.2.0-3.i686 poldek: I php72-curl-7.2.0-3.i686 php72-devel-7.2.0-3.i686 poldek: I php72-json-7.2.0-3.i686 php72-pcre-7.2.0-3.i686 poldek: I php72-xml-7.2.0-3.i686 poldek: D php71-cli-7.1.12-1.i686 php71-common-7.1.12-1.i686 poldek: D php71-pcre-7.1.12-1.i686 php71-program-7.1.12-1.i686 poldek: D php71-simplexml-7.1.12-1.i686 php71-spl-7.1.12-1.i686 poldek: D php72-common-7.2.0-3.i686 poldek: This operation will use 12.5MB of disk space. poldek: Need to get 2.9MB of archives (1.3MB to download). poldek: poldek: Retrieving [1/7] th::php71-common-7.1.12-1.i686.rpm... poldek: ..............................done poldek: Retrieving [2/7] th::php71-cli-7.1.12-1.i686.rpm... poldek: ..............................done poldek: Retrieving [3/7] th::php71-program-7.1.12-1.i686.rpm... poldek: ..............................done poldek: Retrieving [4/7] th::php71-pcre-7.1.12-1.i686.rpm... poldek: ..............................done poldek: Retrieving [5/7] th::php71-spl-7.1.12-1.i686.rpm... poldek: ..............................done poldek: Retrieving [6/7] th::php71-simplexml-7.1.12-1.i686.rpm... poldek: ..............................done poldek: Retrieving [7/7] th::php-packagexml2cl-0.1-4.noarch.rpm... poldek: ..............................done poldek: Executing pm-command.sh --upgrade -vh --test --root / --define _check_dirname_deps 1... poldek: Preparing... ################################################## no conflicts found checking BR rpm: sh: php-config: not found rpm: warning: %changelog not in descending chronological order rpm: error: Failed build dependencies: rpm: php72-cli is needed by php72-pecl-solr-2.4.0-2.src rpm: php72-curl is needed by php72-pecl-solr-2.4.0-2.src rpm: php72-devel >= 4:5.3.0 is needed by php72-pecl-solr-2.4.0-2.src rpm: php72-json is needed by php72-pecl-solr-2.4.0-2.src rpm: php-packagexml2cl is needed by php72-pecl-solr-2.4.0-2.src rpm: php72-pcre is needed by php72-pecl-solr-2.4.0-2.src rpm: php72-xml is needed by php72-pecl-solr-2.4.0-2.src rpm: Building target platforms: i686-pld-linux installing BR: php\-packagexml2cl php72\-devel php72\-xml php72\-pcre php72\-cli php72\-curl php72\-json + poldek --noask --caplookup -Q -v '--ignore=hhvm-*' '--ignore=php4-*' '--ignore=php52-*' '--ignore=php53-*' '--ignore=php54-*' '--ignore=php55-*' '--ignore=php56-*' '--ignore=php70-*' --upgrade php-packagexml2cl php72-devel php72-xml php72-pcre php72-cli php72-curl php72-json Loading [pndir]ready... Loading [pndir]th-test... Loading [pndir]th-test... Loading [pndir]th-ready... Loading [pndir]th-ready... Loading [pndir]th... Loading [pndir]th... 28170 packages read Removed 1557 duplicate packages from available set Processing dependencies... php72-pcre-7.2.0-3.i686 marks php72-common-7.2.0-3.i686 (cap /etc/php72/conf.d) There are 7 packages to install (1 marked by dependencies): I php72-cli-7.2.0-3.i686 php72-curl-7.2.0-3.i686 I php72-devel-7.2.0-3.i686 php72-json-7.2.0-3.i686 I php72-pcre-7.2.0-3.i686 php72-xml-7.2.0-3.i686 D php72-common-7.2.0-3.i686 This operation will use 8.5MB of disk space. Need to get 1.7MB of archives. Executing pm-command.sh --upgrade -vh --root / --define _check_dirname_deps 1... Preparing... ################################################## php72-common ################################################## php72-cli ################################################## php72-curl ################################################## php72-devel ################################################## php72-json ################################################## php72-pcre ################################################## php72-xml ################################################## Installing set #2 Processing dependencies... php-packagexml2cl-0.1-4.noarch marks php71-program-7.1.12-1.i686 (cap /usr/bin/php) php71-program-7.1.12-1.i686 marks php71-cli-7.1.12-1.i686 (cap php71-cli = 4:7.1.12-1) php71-cli-7.1.12-1.i686 marks php71-common-7.1.12-1.i686 (cap /etc/php71) php-packagexml2cl-0.1-4.noarch marks php71-simplexml-7.1.12-1.i686 (cap php(simplexml)) php71-simplexml-7.1.12-1.i686 marks php71-spl-7.1.12-1.i686 (cap php71-spl = 4:7.1.12-1) php71-spl-7.1.12-1.i686 marks php71-pcre-7.1.12-1.i686 (cap php71-pcre = 4:7.1.12-1) There are 7 packages to install (6 marked by dependencies): I php-packagexml2cl-0.1-4.noarch D php71-cli-7.1.12-1.i686 php71-common-7.1.12-1.i686 D php71-pcre-7.1.12-1.i686 php71-program-7.1.12-1.i686 D php71-simplexml-7.1.12-1.i686 php71-spl-7.1.12-1.i686 This operation will use 3.9MB of disk space. Need to get 1.3MB of archives. Executing pm-command.sh --upgrade -vh --root / --define _check_dirname_deps 1... Preparing... ################################################## php71-common ################################################## php71-cli ################################################## php71-pcre ################################################## php71-program ################################################## php-packagexml2cl ################################################## php71-simplexml ################################################## php71-spl ################################################## building RPM using: set -ex; : build-id: d75595bb-212e-4303-b9b9-be06686c29ac; TMPDIR=/tmp/B.qnXry_/BUILD/tmp exec nice -n 0 rpmbuild -bb --define '_smp_mflags -j9' --define '_make_opts -Otarget' --define '_pld_builder 1' --define '_topdir /tmp/B.qnXry_' --define '_specdir %{_topdir}' --define '_sourcedir %{_specdir}' --define '_rpmdir %{_topdir}/RPMS' --define '_builddir %{_topdir}/BUILD' --target i686-pld-linux --define 'php_suffix 72' /tmp/B.qnXry_/php-pecl-solr.spec + : build-id: d75595bb-212e-4303-b9b9-be06686c29ac + TMPDIR=/tmp/B.qnXry_/BUILD/tmp + exec nice -n 0 rpmbuild -bb --define '_smp_mflags -j9' --define '_make_opts -Otarget' --define '_pld_builder 1' --define '_topdir /tmp/B.qnXry_' --define '_specdir %{_topdir}' --define '_sourcedir %{_specdir}' --define '_rpmdir %{_topdir}/RPMS' --define '_builddir %{_topdir}/BUILD' --target i686-pld-linux --define 'php_suffix 72' /tmp/B.qnXry_/php-pecl-solr.spec warning: %changelog not in descending chronological order Building target platforms: i686-pld-linux Executing(%prep): /bin/sh -e /tmp/B.qnXry_/BUILD/tmp/rpm-tmp.21039 + umask 022 + cd /tmp/B.qnXry_/BUILD + cd /tmp/B.qnXry_/BUILD + rm -rf php72-pecl-solr-2.4.0 + /bin/mkdir -p php72-pecl-solr-2.4.0 + cd php72-pecl-solr-2.4.0 + /usr/bin/gzip -dc /tmp/B.qnXry_/solr-2.4.0.tgz + /bin/tar -xf - + STATUS=0 + '[' 0 -ne 0 ']' + /bin/id -u + '[' 1001 '=' 0 ']' + /bin/id -u + '[' 1001 '=' 0 ']' + /bin/chmod -Rf a+rX,u+w,g-w,o-w . + mv solr-2.4.0/CREDITS solr-2.4.0/LICENSE solr-2.4.0/README.ABOUT_SOLR_EXTENSION solr-2.4.0/README.CONTRIBUTORS solr-2.4.0/README.INSTALLATION solr-2.4.0/README.MEMORY_ALLOCATION solr-2.4.0/README.SUBMITTING_CONTRIBUTIONS solr-2.4.0/TODO solr-2.4.0/config.m4 solr-2.4.0/config.w32 solr-2.4.0/docs solr-2.4.0/examples solr-2.4.0/pecl-compat solr-2.4.0/solr.dsp solr-2.4.0/src solr-2.4.0/tests . + echo 'Patch #0 (tests-online.patch):' Patch #0 (tests-online.patch): + '[' -f /tmp/B.qnXry_/tests-online.patch ']' + /bin/cat /tmp/B.qnXry_/tests-online.patch + /usr/bin/patch -s -p1 + <<"EOF" + >run-tests.sh + cat + chmod +x run-tests.sh + exit 0 Executing(%build): /bin/sh -e /tmp/B.qnXry_/BUILD/tmp/rpm-tmp.21039 TMP=/home/users/builder/tmp HOME=/home/users/builder PATH=/home/users/builder/GNUstep/Tools:/usr/local/bin:/usr/bin:/bin:/home/users/builder/bin TMPDIR=/tmp/B.qnXry_/BUILD/tmp + umask 022 + cd /tmp/B.qnXry_/BUILD + cd php72-pecl-solr-2.4.0 + >ChangeLog + packagexml2cl package.xml + awk '-F"' '/define PHP_SOLR_VERSION / {print $2}' src/php7/php_solr_version.h + extver=2.4.0 + test x2.4.0 '!=' x2.4.0 + phpize Configuring for: PHP Api Version: 20170718 Zend Module Api No: 20170718 Zend Extension Api No: 320170718 + ./configure 'LDFLAGS=-Wl,--as-needed -Wl,--no-copy-dt-needed-entries -Wl,-z,relro -Wl,-z,combreloc ' 'CFLAGS=-O2 -fwrapv -pipe -Wformat -Werror=format-security -gdwarf-4 -fno-debug-types-section -fvar-tracking-assignments -g2 -Wp,-D_FORTIFY_SOURCE=2 -fstack-protector-strong --param=ssp-buffer-size=4 -fomit-frame-pointer -march=i686 -fasynchronous-unwind-tables -mtune=pentium4 -gdwarf-4 -fno-debug-types-section -fvar-tracking-assignments -g2 ' 'CXXFLAGS=-O2 -fwrapv -pipe -Wformat -Werror=format-security -gdwarf-4 -fno-debug-types-section -fvar-tracking-assignments -g2 -Wp,-D_FORTIFY_SOURCE=2 -fstack-protector-strong --param=ssp-buffer-size=4 -fomit-frame-pointer -march=i686 -fasynchronous-unwind-tables -mtune=pentium4 -gdwarf-4 -fno-debug-types-section -fvar-tracking-assignments -g2 ' 'FFLAGS=-O2 -fwrapv -pipe -Wformat -Werror=format-security -gdwarf-4 -fno-debug-types-section -fvar-tracking-assignments -g2 -Wp,-D_FORTIFY_SOURCE=2 -fstack-protector-strong --param=ssp-buffer-size=4 -fomit-frame-pointer -march=i686 -fasynchronous-unwind-tables -mtune=pentium4 -gdwarf-4 -fno-debug-types-section -fvar-tracking-assignments -g2 ' 'FCFLAGS=-O2 -fwrapv -pipe -Wformat -Werror=format-security -gdwarf-4 -fno-debug-types-section -fvar-tracking-assignments -g2 -Wp,-D_FORTIFY_SOURCE=2 -fstack-protector-strong --param=ssp-buffer-size=4 -fomit-frame-pointer -march=i686 -fasynchronous-unwind-tables -mtune=pentium4 -gdwarf-4 -fno-debug-types-section -fvar-tracking-assignments -g2 ' 'CPPFLAGS=' 'CC=i686-pld-linux-gcc' 'CXX=i686-pld-linux-g++' '--host=i686-pld-linux' '--build=i686-pld-linux' '--prefix=/usr' '--exec-prefix=/usr' '--bindir=/usr/bin' '--sbindir=/usr/sbin' '--sysconfdir=/etc' '--datadir=/usr/share' '--includedir=/usr/include' '--libdir=/usr/lib' '--libexecdir=/usr/libexec' '--localstatedir=/var' '--sharedstatedir=/var/lib' '--mandir=/usr/share/man' '--infodir=/usr/share/info' '--x-libraries=/usr/lib' checking for grep that handles long lines and -e... /bin/grep checking for egrep... /bin/grep -E checking for a sed that does not truncate output... /bin/sed checking for i686-pld-linux-cc... i686-pld-linux-gcc checking whether the C compiler works... yes checking for C compiler default output file name... a.out checking for suffix of executables... checking whether we are cross compiling... no checking for suffix of object files... o checking whether we are using the GNU C compiler... yes checking whether i686-pld-linux-gcc accepts -g... yes checking for i686-pld-linux-gcc option to accept ISO C89... none needed checking how to run the C preprocessor... i686-pld-linux-gcc -E checking for icc... no checking for suncc... no checking whether i686-pld-linux-gcc and cc understand -c and -o together... yes checking for system library directory... lib checking if compiler supports -R... no checking if compiler supports -Wl,-rpath,... yes checking build system type... i686-pld-linux-gnu checking host system type... i686-pld-linux-gnu checking target system type... i686-pld-linux-gnu checking for PHP prefix... /usr checking for PHP includes... -I/usr/include/php -I/usr/include/php/main -I/usr/include/php/TSRM -I/usr/include/php/Zend -I/usr/include/php/ext -I/usr/include/php/ext/date/lib checking for PHP extension directory... /usr/lib/php72 checking for PHP installed headers prefix... /usr/include/php checking if debug is enabled... no checking if zts is enabled... no checking for re2c... re2c checking for re2c version... 0.13.5 (ok) checking for gawk... gawk checking for cURL support... yes, shared checking for cURL in default path... found in /usr checking for cURL 7.15.0 or greater... libcurl 7.57.0 checking whether to enable the Solr extension... yes, shared checking whether to compile with solr in verbose mode... no checking libxml2 install dir... no checking whether to enable code coverage... no checking for curl_easy_perform in -lcurl... yes checking for JSON... Yes checking for xml2-config path... /usr/bin/xml2-config checking whether libxml build works... yes checking PHP version... PHP 7 checking how to print strings... print -r checking for a sed that does not truncate output... (cached) /bin/sed checking for fgrep... /bin/grep -F checking for ld used by i686-pld-linux-gcc... /usr/bin/ld checking if the linker (/usr/bin/ld) is GNU ld... yes checking for BSD- or MS-compatible name lister (nm)... /usr/bin/nm -B checking the name lister (/usr/bin/nm -B) interface... BSD nm checking whether ln -s works... yes checking the maximum length of command line arguments... 1572864 checking how to convert i686-pld-linux-gnu file names to i686-pld-linux-gnu format... func_convert_file_noop checking how to convert i686-pld-linux-gnu file names to toolchain format... func_convert_file_noop checking for /usr/bin/ld option to reload object files... -r checking for i686-pld-linux-objdump... no checking for objdump... objdump checking how to recognize dependent libraries... pass_all checking for i686-pld-linux-dlltool... no checking for dlltool... no checking how to associate runtime and link libraries... print -r -- checking for i686-pld-linux-ar... no checking for ar... ar checking for archiver @FILE support... @ checking for i686-pld-linux-strip... no checking for strip... strip checking for i686-pld-linux-ranlib... no checking for ranlib... ranlib checking for mawk... (cached) gawk checking command to parse /usr/bin/nm -B output from i686-pld-linux-gcc object... ok checking for sysroot... no checking for a working dd... /bin/dd checking how to truncate binary pipes... /bin/dd bs=4096 count=1 checking for i686-pld-linux-mt... no checking for mt... no checking if : is a manifest tool... no checking for ANSI C header files... yes checking for sys/types.h... yes checking for sys/stat.h... yes checking for stdlib.h... yes checking for string.h... yes checking for memory.h... yes checking for strings.h... yes checking for inttypes.h... yes checking for stdint.h... yes checking for unistd.h... yes checking for dlfcn.h... yes checking for objdir... .libs checking if i686-pld-linux-gcc supports -fno-rtti -fno-exceptions... no checking for i686-pld-linux-gcc option to produce PIC... -fPIC -DPIC checking if i686-pld-linux-gcc PIC flag -fPIC -DPIC works... yes checking if i686-pld-linux-gcc static flag -static works... yes checking if i686-pld-linux-gcc supports -c -o file.o... yes checking if i686-pld-linux-gcc supports -c -o file.o... (cached) yes checking whether the i686-pld-linux-gcc linker (/usr/bin/ld) supports shared libraries... yes checking whether -lc should be explicitly linked in... no checking dynamic linker characteristics... GNU/Linux ld.so checking how to hardcode library paths into programs... immediate checking whether stripping libraries is possible... yes checking if libtool supports shared libraries... yes checking whether to build shared libraries... yes checking whether to build static libraries... no configure: creating ./config.status config.status: creating config.h config.status: executing libtool commands + /usr/bin/make -Otarget -j9 /bin/sh /tmp/B.qnXry_/BUILD/php72-pecl-solr-2.4.0/libtool --mode=compile i686-pld-linux-gcc -I. -I/tmp/B.qnXry_/BUILD/php72-pecl-solr-2.4.0 -DPHP_ATOM_INC -I/tmp/B.qnXry_/BUILD/php72-pecl-solr-2.4.0/include -I/tmp/B.qnXry_/BUILD/php72-pecl-solr-2.4.0/main -I/tmp/B.qnXry_/BUILD/php72-pecl-solr-2.4.0 -I/usr/include/php -I/usr/include/php/main -I/usr/include/php/TSRM -I/usr/include/php/Zend -I/usr/include/php/ext -I/usr/include/php/ext/date/lib -I/usr/include/libxml2 -I/usr/include/php -I/usr/include/php/main -I/usr/include/php/TSRM -I/usr/include/php/Zend -I/usr/include/php/ext -I/usr/include/php/ext/date/lib -I/usr/include/libxml2 -DHAVE_CONFIG_H -O2 -fwrapv -pipe -Wformat -Werror=format-security -gdwarf-4 -fno-debug-types-section -fvar-tracking-assignments -g2 -Wp,-D_FORTIFY_SOURCE=2 -fstack-protector-strong --param=ssp-buffer-size=4 -fomit-frame-pointer -march=i686 -fasynchronous-unwind-tables -mtune=pentium4 -gdwarf-4 -fno-debug-types-section -fvar-tracking-assignments -g2 -c /tmp/B.qnXry_/BUILD/php72-pecl-solr-2.4.0/src/php7/php_solr.c -o src/php7/php_solr.lo libtool: compile: i686-pld-linux-gcc -I. -I/tmp/B.qnXry_/BUILD/php72-pecl-solr-2.4.0 -DPHP_ATOM_INC -I/tmp/B.qnXry_/BUILD/php72-pecl-solr-2.4.0/include -I/tmp/B.qnXry_/BUILD/php72-pecl-solr-2.4.0/main -I/tmp/B.qnXry_/BUILD/php72-pecl-solr-2.4.0 -I/usr/include/php -I/usr/include/php/main -I/usr/include/php/TSRM -I/usr/include/php/Zend -I/usr/include/php/ext -I/usr/include/php/ext/date/lib -I/usr/include/libxml2 -I/usr/include/php -I/usr/include/php/main -I/usr/include/php/TSRM -I/usr/include/php/Zend -I/usr/include/php/ext -I/usr/include/php/ext/date/lib -I/usr/include/libxml2 -DHAVE_CONFIG_H -O2 -fwrapv -pipe -Wformat -Werror=format-security -gdwarf-4 -fno-debug-types-section -fvar-tracking-assignments -g2 -Wp,-D_FORTIFY_SOURCE=2 -fstack-protector-strong --param=ssp-buffer-size=4 -fomit-frame-pointer -march=i686 -fasynchronous-unwind-tables -mtune=pentium4 -gdwarf-4 -fno-debug-types-section -fvar-tracking-assignments -g2 -c /tmp/B.qnXry_/BUILD/php72-pecl-solr-2.4.0/src/php7/php_solr.c -fPIC -DPIC -o src/php7/.libs/php_solr.o In file included from /usr/include/php/main/php.h:39:0, from /tmp/B.qnXry_/BUILD/php72-pecl-solr-2.4.0/src/php7/php_solr.h:28, from /tmp/B.qnXry_/BUILD/php72-pecl-solr-2.4.0/src/php7/php_solr.c:23: /tmp/B.qnXry_/BUILD/php72-pecl-solr-2.4.0/src/php7/php_solr.c:560:56: error: 'ZEND_ACC_CLONE' undeclared here (not in a function); did you mean 'ZEND_AST_CLONE'? PHP_ME(SolrDocument, __clone, NULL, ZEND_ACC_PUBLIC | ZEND_ACC_CLONE) ^ /usr/include/php/Zend/zend_API.h:70:157: note: in definition of macro 'ZEND_FENTRY' #define ZEND_FENTRY(zend_name, name, arg_info, flags) { #zend_name, name, arg_info, (uint32_t) (sizeof(arg_info)/sizeof(struct _zend_internal_arg_info)-1), flags }, ^~~~~ /usr/include/php/main/php.h:422:25: note: in expansion of macro 'ZEND_ME' #define PHP_ME ZEND_ME ^~~~~~~ /tmp/B.qnXry_/BUILD/php72-pecl-solr-2.4.0/src/php7/php_solr.c:560:2: note: in expansion of macro 'PHP_ME' PHP_ME(SolrDocument, __clone, NULL, ZEND_ACC_PUBLIC | ZEND_ACC_CLONE) ^~~~~~ /tmp/B.qnXry_/BUILD/php72-pecl-solr-2.4.0/src/php7/php_solr.c:603:59: error: invalid operands to binary | (have 'int' and 'zend_function_entry * {aka struct _zend_function_entry *}') PHP_ME(SolrInputDocument, __clone, NULL, ZEND_ACC_PUBLIC | ZEND_ACC_CLONE) ^ /usr/include/php/Zend/zend_API.h:70:157: note: in definition of macro 'ZEND_FENTRY' #define ZEND_FENTRY(zend_name, name, arg_info, flags) { #zend_name, name, arg_info, (uint32_t) (sizeof(arg_info)/sizeof(struct _zend_internal_arg_info)-1), flags }, ^~~~~ /usr/include/php/main/php.h:422:25: note: in expansion of macro 'ZEND_ME' #define PHP_ME ZEND_ME ^~~~~~~ /tmp/B.qnXry_/BUILD/php72-pecl-solr-2.4.0/src/php7/php_solr.c:603:2: note: in expansion of macro 'PHP_ME' PHP_ME(SolrInputDocument, __clone, NULL, ZEND_ACC_PUBLIC | ZEND_ACC_CLONE) ^~~~~~ /usr/include/php/Zend/zend_compile.h:220:26: warning: initialization makes integer from pointer without a cast [-Wint-conversion] #define ZEND_ACC_PUBLIC 0x100 ^ /usr/include/php/Zend/zend_API.h:70:157: note: in definition of macro 'ZEND_FENTRY' #define ZEND_FENTRY(zend_name, name, arg_info, flags) { #zend_name, name, arg_info, (uint32_t) (sizeof(arg_info)/sizeof(struct _zend_internal_arg_info)-1), flags }, ^~~~~ /usr/include/php/main/php.h:422:25: note: in expansion of macro 'ZEND_ME' #define PHP_ME ZEND_ME ^~~~~~~ /tmp/B.qnXry_/BUILD/php72-pecl-solr-2.4.0/src/php7/php_solr.c:603:43: note: in expansion of macro 'ZEND_ACC_PUBLIC' PHP_ME(SolrInputDocument, __clone, NULL, ZEND_ACC_PUBLIC | ZEND_ACC_CLONE) ^~~~~~~~~~~~~~~ /usr/include/php/Zend/zend_compile.h:220:26: note: (near initialization for 'solr_input_document_methods[2].flags') #define ZEND_ACC_PUBLIC 0x100 ^ /usr/include/php/Zend/zend_API.h:70:157: note: in definition of macro 'ZEND_FENTRY' #define ZEND_FENTRY(zend_name, name, arg_info, flags) { #zend_name, name, arg_info, (uint32_t) (sizeof(arg_info)/sizeof(struct _zend_internal_arg_info)-1), flags }, ^~~~~ /usr/include/php/main/php.h:422:25: note: in expansion of macro 'ZEND_ME' #define PHP_ME ZEND_ME ^~~~~~~ /tmp/B.qnXry_/BUILD/php72-pecl-solr-2.4.0/src/php7/php_solr.c:603:43: note: in expansion of macro 'ZEND_ACC_PUBLIC' PHP_ME(SolrInputDocument, __clone, NULL, ZEND_ACC_PUBLIC | ZEND_ACC_CLONE) ^~~~~~~~~~~~~~~ /usr/include/php/Zend/zend_compile.h:220:26: error: initializer element is not constant #define ZEND_ACC_PUBLIC 0x100 ^ /usr/include/php/Zend/zend_API.h:70:157: note: in definition of macro 'ZEND_FENTRY' #define ZEND_FENTRY(zend_name, name, arg_info, flags) { #zend_name, name, arg_info, (uint32_t) (sizeof(arg_info)/sizeof(struct _zend_internal_arg_info)-1), flags }, ^~~~~ /usr/include/php/main/php.h:422:25: note: in expansion of macro 'ZEND_ME' #define PHP_ME ZEND_ME ^~~~~~~ /tmp/B.qnXry_/BUILD/php72-pecl-solr-2.4.0/src/php7/php_solr.c:603:43: note: in expansion of macro 'ZEND_ACC_PUBLIC' PHP_ME(SolrInputDocument, __clone, NULL, ZEND_ACC_PUBLIC | ZEND_ACC_CLONE) ^~~~~~~~~~~~~~~ /usr/include/php/Zend/zend_compile.h:220:26: note: (near initialization for 'solr_input_document_methods[2].flags') #define ZEND_ACC_PUBLIC 0x100 ^ /usr/include/php/Zend/zend_API.h:70:157: note: in definition of macro 'ZEND_FENTRY' #define ZEND_FENTRY(zend_name, name, arg_info, flags) { #zend_name, name, arg_info, (uint32_t) (sizeof(arg_info)/sizeof(struct _zend_internal_arg_info)-1), flags }, ^~~~~ /usr/include/php/main/php.h:422:25: note: in expansion of macro 'ZEND_ME' #define PHP_ME ZEND_ME ^~~~~~~ /tmp/B.qnXry_/BUILD/php72-pecl-solr-2.4.0/src/php7/php_solr.c:603:43: note: in expansion of macro 'ZEND_ACC_PUBLIC' PHP_ME(SolrInputDocument, __clone, NULL, ZEND_ACC_PUBLIC | ZEND_ACC_CLONE) ^~~~~~~~~~~~~~~ /tmp/B.qnXry_/BUILD/php72-pecl-solr-2.4.0/src/php7/php_solr.c:636:52: error: invalid operands to binary | (have 'int' and 'zend_function_entry * {aka struct _zend_function_entry *}') PHP_ME(SolrClient, __clone, NULL, ZEND_ACC_PUBLIC | ZEND_ACC_CLONE) ^ /usr/include/php/Zend/zend_API.h:70:157: note: in definition of macro 'ZEND_FENTRY' #define ZEND_FENTRY(zend_name, name, arg_info, flags) { #zend_name, name, arg_info, (uint32_t) (sizeof(arg_info)/sizeof(struct _zend_internal_arg_info)-1), flags }, ^~~~~ /usr/include/php/main/php.h:422:25: note: in expansion of macro 'ZEND_ME' #define PHP_ME ZEND_ME ^~~~~~~ /tmp/B.qnXry_/BUILD/php72-pecl-solr-2.4.0/src/php7/php_solr.c:636:2: note: in expansion of macro 'PHP_ME' PHP_ME(SolrClient, __clone, NULL, ZEND_ACC_PUBLIC | ZEND_ACC_CLONE) ^~~~~~ /usr/include/php/Zend/zend_compile.h:220:26: warning: initialization makes integer from pointer without a cast [-Wint-conversion] #define ZEND_ACC_PUBLIC 0x100 ^ /usr/include/php/Zend/zend_API.h:70:157: note: in definition of macro 'ZEND_FENTRY' #define ZEND_FENTRY(zend_name, name, arg_info, flags) { #zend_name, name, arg_info, (uint32_t) (sizeof(arg_info)/sizeof(struct _zend_internal_arg_info)-1), flags }, ^~~~~ /usr/include/php/main/php.h:422:25: note: in expansion of macro 'ZEND_ME' #define PHP_ME ZEND_ME ^~~~~~~ /tmp/B.qnXry_/BUILD/php72-pecl-solr-2.4.0/src/php7/php_solr.c:636:36: note: in expansion of macro 'ZEND_ACC_PUBLIC' PHP_ME(SolrClient, __clone, NULL, ZEND_ACC_PUBLIC | ZEND_ACC_CLONE) ^~~~~~~~~~~~~~~ /usr/include/php/Zend/zend_compile.h:220:26: note: (near initialization for 'solr_client_methods[4].flags') #define ZEND_ACC_PUBLIC 0x100 ^ /usr/include/php/Zend/zend_API.h:70:157: note: in definition of macro 'ZEND_FENTRY' #define ZEND_FENTRY(zend_name, name, arg_info, flags) { #zend_name, name, arg_info, (uint32_t) (sizeof(arg_info)/sizeof(struct _zend_internal_arg_info)-1), flags }, ^~~~~ /usr/include/php/main/php.h:422:25: note: in expansion of macro 'ZEND_ME' #define PHP_ME ZEND_ME ^~~~~~~ /tmp/B.qnXry_/BUILD/php72-pecl-solr-2.4.0/src/php7/php_solr.c:636:36: note: in expansion of macro 'ZEND_ACC_PUBLIC' PHP_ME(SolrClient, __clone, NULL, ZEND_ACC_PUBLIC | ZEND_ACC_CLONE) ^~~~~~~~~~~~~~~ /usr/include/php/Zend/zend_compile.h:220:26: error: initializer element is not constant #define ZEND_ACC_PUBLIC 0x100 ^ /usr/include/php/Zend/zend_API.h:70:157: note: in definition of macro 'ZEND_FENTRY' #define ZEND_FENTRY(zend_name, name, arg_info, flags) { #zend_name, name, arg_info, (uint32_t) (sizeof(arg_info)/sizeof(struct _zend_internal_arg_info)-1), flags }, ^~~~~ /usr/include/php/main/php.h:422:25: note: in expansion of macro 'ZEND_ME' #define PHP_ME ZEND_ME ^~~~~~~ /tmp/B.qnXry_/BUILD/php72-pecl-solr-2.4.0/src/php7/php_solr.c:636:36: note: in expansion of macro 'ZEND_ACC_PUBLIC' PHP_ME(SolrClient, __clone, NULL, ZEND_ACC_PUBLIC | ZEND_ACC_CLONE) ^~~~~~~~~~~~~~~ /usr/include/php/Zend/zend_compile.h:220:26: note: (near initialization for 'solr_client_methods[4].flags') #define ZEND_ACC_PUBLIC 0x100 ^ /usr/include/php/Zend/zend_API.h:70:157: note: in definition of macro 'ZEND_FENTRY' #define ZEND_FENTRY(zend_name, name, arg_info, flags) { #zend_name, name, arg_info, (uint32_t) (sizeof(arg_info)/sizeof(struct _zend_internal_arg_info)-1), flags }, ^~~~~ /usr/include/php/main/php.h:422:25: note: in expansion of macro 'ZEND_ME' #define PHP_ME ZEND_ME ^~~~~~~ /tmp/B.qnXry_/BUILD/php72-pecl-solr-2.4.0/src/php7/php_solr.c:636:36: note: in expansion of macro 'ZEND_ACC_PUBLIC' PHP_ME(SolrClient, __clone, NULL, ZEND_ACC_PUBLIC | ZEND_ACC_CLONE) ^~~~~~~~~~~~~~~ /tmp/B.qnXry_/BUILD/php72-pecl-solr-2.4.0/src/php7/php_solr.c:713:52: error: invalid operands to binary | (have 'int' and 'zend_function_entry * {aka struct _zend_function_entry *}') PHP_ME(SolrParams, __clone, NULL, ZEND_ACC_PUBLIC | ZEND_ACC_CLONE) ^ /usr/include/php/Zend/zend_API.h:70:157: note: in definition of macro 'ZEND_FENTRY' #define ZEND_FENTRY(zend_name, name, arg_info, flags) { #zend_name, name, arg_info, (uint32_t) (sizeof(arg_info)/sizeof(struct _zend_internal_arg_info)-1), flags }, ^~~~~ /usr/include/php/main/php.h:422:25: note: in expansion of macro 'ZEND_ME' #define PHP_ME ZEND_ME ^~~~~~~ /tmp/B.qnXry_/BUILD/php72-pecl-solr-2.4.0/src/php7/php_solr.c:713:2: note: in expansion of macro 'PHP_ME' PHP_ME(SolrParams, __clone, NULL, ZEND_ACC_PUBLIC | ZEND_ACC_CLONE) ^~~~~~ /usr/include/php/Zend/zend_compile.h:220:26: warning: initialization makes integer from pointer without a cast [-Wint-conversion] #define ZEND_ACC_PUBLIC 0x100 ^ /usr/include/php/Zend/zend_API.h:70:157: note: in definition of macro 'ZEND_FENTRY' #define ZEND_FENTRY(zend_name, name, arg_info, flags) { #zend_name, name, arg_info, (uint32_t) (sizeof(arg_info)/sizeof(struct _zend_internal_arg_info)-1), flags }, ^~~~~ /usr/include/php/main/php.h:422:25: note: in expansion of macro 'ZEND_ME' #define PHP_ME ZEND_ME ^~~~~~~ /tmp/B.qnXry_/BUILD/php72-pecl-solr-2.4.0/src/php7/php_solr.c:713:36: note: in expansion of macro 'ZEND_ACC_PUBLIC' PHP_ME(SolrParams, __clone, NULL, ZEND_ACC_PUBLIC | ZEND_ACC_CLONE) ^~~~~~~~~~~~~~~ /usr/include/php/Zend/zend_compile.h:220:26: note: (near initialization for 'solr_params_methods[7].flags') #define ZEND_ACC_PUBLIC 0x100 ^ /usr/include/php/Zend/zend_API.h:70:157: note: in definition of macro 'ZEND_FENTRY' #define ZEND_FENTRY(zend_name, name, arg_info, flags) { #zend_name, name, arg_info, (uint32_t) (sizeof(arg_info)/sizeof(struct _zend_internal_arg_info)-1), flags }, ^~~~~ /usr/include/php/main/php.h:422:25: note: in expansion of macro 'ZEND_ME' #define PHP_ME ZEND_ME ^~~~~~~ /tmp/B.qnXry_/BUILD/php72-pecl-solr-2.4.0/src/php7/php_solr.c:713:36: note: in expansion of macro 'ZEND_ACC_PUBLIC' PHP_ME(SolrParams, __clone, NULL, ZEND_ACC_PUBLIC | ZEND_ACC_CLONE) ^~~~~~~~~~~~~~~ /usr/include/php/Zend/zend_compile.h:220:26: error: initializer element is not constant #define ZEND_ACC_PUBLIC 0x100 ^ /usr/include/php/Zend/zend_API.h:70:157: note: in definition of macro 'ZEND_FENTRY' #define ZEND_FENTRY(zend_name, name, arg_info, flags) { #zend_name, name, arg_info, (uint32_t) (sizeof(arg_info)/sizeof(struct _zend_internal_arg_info)-1), flags }, ^~~~~ /usr/include/php/main/php.h:422:25: note: in expansion of macro 'ZEND_ME' #define PHP_ME ZEND_ME ^~~~~~~ /tmp/B.qnXry_/BUILD/php72-pecl-solr-2.4.0/src/php7/php_solr.c:713:36: note: in expansion of macro 'ZEND_ACC_PUBLIC' PHP_ME(SolrParams, __clone, NULL, ZEND_ACC_PUBLIC | ZEND_ACC_CLONE) ^~~~~~~~~~~~~~~ /usr/include/php/Zend/zend_compile.h:220:26: note: (near initialization for 'solr_params_methods[7].flags') #define ZEND_ACC_PUBLIC 0x100 ^ /usr/include/php/Zend/zend_API.h:70:157: note: in definition of macro 'ZEND_FENTRY' #define ZEND_FENTRY(zend_name, name, arg_info, flags) { #zend_name, name, arg_info, (uint32_t) (sizeof(arg_info)/sizeof(struct _zend_internal_arg_info)-1), flags }, ^~~~~ /usr/include/php/main/php.h:422:25: note: in expansion of macro 'ZEND_ME' #define PHP_ME ZEND_ME ^~~~~~~ /tmp/B.qnXry_/BUILD/php72-pecl-solr-2.4.0/src/php7/php_solr.c:713:36: note: in expansion of macro 'ZEND_ACC_PUBLIC' PHP_ME(SolrParams, __clone, NULL, ZEND_ACC_PUBLIC | ZEND_ACC_CLONE) ^~~~~~~~~~~~~~~ make: *** [Makefile:214: src/php7/php_solr.lo] Error 1 make: *** Waiting for unfinished jobs.... /bin/sh /tmp/B.qnXry_/BUILD/php72-pecl-solr-2.4.0/libtool --mode=compile i686-pld-linux-gcc -I. -I/tmp/B.qnXry_/BUILD/php72-pecl-solr-2.4.0 -DPHP_ATOM_INC -I/tmp/B.qnXry_/BUILD/php72-pecl-solr-2.4.0/include -I/tmp/B.qnXry_/BUILD/php72-pecl-solr-2.4.0/main -I/tmp/B.qnXry_/BUILD/php72-pecl-solr-2.4.0 -I/usr/include/php -I/usr/include/php/main -I/usr/include/php/TSRM -I/usr/include/php/Zend -I/usr/include/php/ext -I/usr/include/php/ext/date/lib -I/usr/include/libxml2 -I/usr/include/php -I/usr/include/php/main -I/usr/include/php/TSRM -I/usr/include/php/Zend -I/usr/include/php/ext -I/usr/include/php/ext/date/lib -I/usr/include/libxml2 -DHAVE_CONFIG_H -O2 -fwrapv -pipe -Wformat -Werror=format-security -gdwarf-4 -fno-debug-types-section -fvar-tracking-assignments -g2 -Wp,-D_FORTIFY_SOURCE=2 -fstack-protector-strong --param=ssp-buffer-size=4 -fomit-frame-pointer -march=i686 -fasynchronous-unwind-tables -mtune=pentium4 -gdwarf-4 -fno-debug-types-section -fvar-tracking-assignments -g2 -c /tmp/B.qnXry_/BUILD/php72-pecl-solr-2.4.0/src/php7/php_solr_object.c -o src/php7/php_solr_object.lo libtool: compile: i686-pld-linux-gcc -I. -I/tmp/B.qnXry_/BUILD/php72-pecl-solr-2.4.0 -DPHP_ATOM_INC -I/tmp/B.qnXry_/BUILD/php72-pecl-solr-2.4.0/include -I/tmp/B.qnXry_/BUILD/php72-pecl-solr-2.4.0/main -I/tmp/B.qnXry_/BUILD/php72-pecl-solr-2.4.0 -I/usr/include/php -I/usr/include/php/main -I/usr/include/php/TSRM -I/usr/include/php/Zend -I/usr/include/php/ext -I/usr/include/php/ext/date/lib -I/usr/include/libxml2 -I/usr/include/php -I/usr/include/php/main -I/usr/include/php/TSRM -I/usr/include/php/Zend -I/usr/include/php/ext -I/usr/include/php/ext/date/lib -I/usr/include/libxml2 -DHAVE_CONFIG_H -O2 -fwrapv -pipe -Wformat -Werror=format-security -gdwarf-4 -fno-debug-types-section -fvar-tracking-assignments -g2 -Wp,-D_FORTIFY_SOURCE=2 -fstack-protector-strong --param=ssp-buffer-size=4 -fomit-frame-pointer -march=i686 -fasynchronous-unwind-tables -mtune=pentium4 -gdwarf-4 -fno-debug-types-section -fvar-tracking-assignments -g2 -c /tmp/B.qnXry_/BUILD/php72-pecl-solr-2.4.0/src/php7/php_solr_object.c -fPIC -DPIC -o src/php7/.libs/php_solr_object.o /bin/sh /tmp/B.qnXry_/BUILD/php72-pecl-solr-2.4.0/libtool --mode=compile i686-pld-linux-gcc -I. -I/tmp/B.qnXry_/BUILD/php72-pecl-solr-2.4.0 -DPHP_ATOM_INC -I/tmp/B.qnXry_/BUILD/php72-pecl-solr-2.4.0/include -I/tmp/B.qnXry_/BUILD/php72-pecl-solr-2.4.0/main -I/tmp/B.qnXry_/BUILD/php72-pecl-solr-2.4.0 -I/usr/include/php -I/usr/include/php/main -I/usr/include/php/TSRM -I/usr/include/php/Zend -I/usr/include/php/ext -I/usr/include/php/ext/date/lib -I/usr/include/libxml2 -I/usr/include/php -I/usr/include/php/main -I/usr/include/php/TSRM -I/usr/include/php/Zend -I/usr/include/php/ext -I/usr/include/php/ext/date/lib -I/usr/include/libxml2 -DHAVE_CONFIG_H -O2 -fwrapv -pipe -Wformat -Werror=format-security -gdwarf-4 -fno-debug-types-section -fvar-tracking-assignments -g2 -Wp,-D_FORTIFY_SOURCE=2 -fstack-protector-strong --param=ssp-buffer-size=4 -fomit-frame-pointer -march=i686 -fasynchronous-unwind-tables -mtune=pentium4 -gdwarf-4 -fno-debug-types-section -fvar-tracking-assignments -g2 -c /tmp/B.qnXry_/BUILD/php72-pecl-solr-2.4.0/src/php7/php_solr_exception.c -o src/php7/php_solr_exception.lo libtool: compile: i686-pld-linux-gcc -I. -I/tmp/B.qnXry_/BUILD/php72-pecl-solr-2.4.0 -DPHP_ATOM_INC -I/tmp/B.qnXry_/BUILD/php72-pecl-solr-2.4.0/include -I/tmp/B.qnXry_/BUILD/php72-pecl-solr-2.4.0/main -I/tmp/B.qnXry_/BUILD/php72-pecl-solr-2.4.0 -I/usr/include/php -I/usr/include/php/main -I/usr/include/php/TSRM -I/usr/include/php/Zend -I/usr/include/php/ext -I/usr/include/php/ext/date/lib -I/usr/include/libxml2 -I/usr/include/php -I/usr/include/php/main -I/usr/include/php/TSRM -I/usr/include/php/Zend -I/usr/include/php/ext -I/usr/include/php/ext/date/lib -I/usr/include/libxml2 -DHAVE_CONFIG_H -O2 -fwrapv -pipe -Wformat -Werror=format-security -gdwarf-4 -fno-debug-types-section -fvar-tracking-assignments -g2 -Wp,-D_FORTIFY_SOURCE=2 -fstack-protector-strong --param=ssp-buffer-size=4 -fomit-frame-pointer -march=i686 -fasynchronous-unwind-tables -mtune=pentium4 -gdwarf-4 -fno-debug-types-section -fvar-tracking-assignments -g2 -c /tmp/B.qnXry_/BUILD/php72-pecl-solr-2.4.0/src/php7/php_solr_exception.c -fPIC -DPIC -o src/php7/.libs/php_solr_exception.o /bin/sh /tmp/B.qnXry_/BUILD/php72-pecl-solr-2.4.0/libtool --mode=compile i686-pld-linux-gcc -I. -I/tmp/B.qnXry_/BUILD/php72-pecl-solr-2.4.0 -DPHP_ATOM_INC -I/tmp/B.qnXry_/BUILD/php72-pecl-solr-2.4.0/include -I/tmp/B.qnXry_/BUILD/php72-pecl-solr-2.4.0/main -I/tmp/B.qnXry_/BUILD/php72-pecl-solr-2.4.0 -I/usr/include/php -I/usr/include/php/main -I/usr/include/php/TSRM -I/usr/include/php/Zend -I/usr/include/php/ext -I/usr/include/php/ext/date/lib -I/usr/include/libxml2 -I/usr/include/php -I/usr/include/php/main -I/usr/include/php/TSRM -I/usr/include/php/Zend -I/usr/include/php/ext -I/usr/include/php/ext/date/lib -I/usr/include/libxml2 -DHAVE_CONFIG_H -O2 -fwrapv -pipe -Wformat -Werror=format-security -gdwarf-4 -fno-debug-types-section -fvar-tracking-assignments -g2 -Wp,-D_FORTIFY_SOURCE=2 -fstack-protector-strong --param=ssp-buffer-size=4 -fomit-frame-pointer -march=i686 -fasynchronous-unwind-tables -mtune=pentium4 -gdwarf-4 -fno-debug-types-section -fvar-tracking-assignments -g2 -c /tmp/B.qnXry_/BUILD/php72-pecl-solr-2.4.0/src/php7/php_solr_input_document.c -o src/php7/php_solr_input_document.lo libtool: compile: i686-pld-linux-gcc -I. -I/tmp/B.qnXry_/BUILD/php72-pecl-solr-2.4.0 -DPHP_ATOM_INC -I/tmp/B.qnXry_/BUILD/php72-pecl-solr-2.4.0/include -I/tmp/B.qnXry_/BUILD/php72-pecl-solr-2.4.0/main -I/tmp/B.qnXry_/BUILD/php72-pecl-solr-2.4.0 -I/usr/include/php -I/usr/include/php/main -I/usr/include/php/TSRM -I/usr/include/php/Zend -I/usr/include/php/ext -I/usr/include/php/ext/date/lib -I/usr/include/libxml2 -I/usr/include/php -I/usr/include/php/main -I/usr/include/php/TSRM -I/usr/include/php/Zend -I/usr/include/php/ext -I/usr/include/php/ext/date/lib -I/usr/include/libxml2 -DHAVE_CONFIG_H -O2 -fwrapv -pipe -Wformat -Werror=format-security -gdwarf-4 -fno-debug-types-section -fvar-tracking-assignments -g2 -Wp,-D_FORTIFY_SOURCE=2 -fstack-protector-strong --param=ssp-buffer-size=4 -fomit-frame-pointer -march=i686 -fasynchronous-unwind-tables -mtune=pentium4 -gdwarf-4 -fno-debug-types-section -fvar-tracking-assignments -g2 -c /tmp/B.qnXry_/BUILD/php72-pecl-solr-2.4.0/src/php7/php_solr_input_document.c -fPIC -DPIC -o src/php7/.libs/php_solr_input_document.o /bin/sh /tmp/B.qnXry_/BUILD/php72-pecl-solr-2.4.0/libtool --mode=compile i686-pld-linux-gcc -I. -I/tmp/B.qnXry_/BUILD/php72-pecl-solr-2.4.0 -DPHP_ATOM_INC -I/tmp/B.qnXry_/BUILD/php72-pecl-solr-2.4.0/include -I/tmp/B.qnXry_/BUILD/php72-pecl-solr-2.4.0/main -I/tmp/B.qnXry_/BUILD/php72-pecl-solr-2.4.0 -I/usr/include/php -I/usr/include/php/main -I/usr/include/php/TSRM -I/usr/include/php/Zend -I/usr/include/php/ext -I/usr/include/php/ext/date/lib -I/usr/include/libxml2 -I/usr/include/php -I/usr/include/php/main -I/usr/include/php/TSRM -I/usr/include/php/Zend -I/usr/include/php/ext -I/usr/include/php/ext/date/lib -I/usr/include/libxml2 -DHAVE_CONFIG_H -O2 -fwrapv -pipe -Wformat -Werror=format-security -gdwarf-4 -fno-debug-types-section -fvar-tracking-assignments -g2 -Wp,-D_FORTIFY_SOURCE=2 -fstack-protector-strong --param=ssp-buffer-size=4 -fomit-frame-pointer -march=i686 -fasynchronous-unwind-tables -mtune=pentium4 -gdwarf-4 -fno-debug-types-section -fvar-tracking-assignments -g2 -c /tmp/B.qnXry_/BUILD/php72-pecl-solr-2.4.0/src/php7/php_solr_response.c -o src/php7/php_solr_response.lo libtool: compile: i686-pld-linux-gcc -I. -I/tmp/B.qnXry_/BUILD/php72-pecl-solr-2.4.0 -DPHP_ATOM_INC -I/tmp/B.qnXry_/BUILD/php72-pecl-solr-2.4.0/include -I/tmp/B.qnXry_/BUILD/php72-pecl-solr-2.4.0/main -I/tmp/B.qnXry_/BUILD/php72-pecl-solr-2.4.0 -I/usr/include/php -I/usr/include/php/main -I/usr/include/php/TSRM -I/usr/include/php/Zend -I/usr/include/php/ext -I/usr/include/php/ext/date/lib -I/usr/include/libxml2 -I/usr/include/php -I/usr/include/php/main -I/usr/include/php/TSRM -I/usr/include/php/Zend -I/usr/include/php/ext -I/usr/include/php/ext/date/lib -I/usr/include/libxml2 -DHAVE_CONFIG_H -O2 -fwrapv -pipe -Wformat -Werror=format-security -gdwarf-4 -fno-debug-types-section -fvar-tracking-assignments -g2 -Wp,-D_FORTIFY_SOURCE=2 -fstack-protector-strong --param=ssp-buffer-size=4 -fomit-frame-pointer -march=i686 -fasynchronous-unwind-tables -mtune=pentium4 -gdwarf-4 -fno-debug-types-section -fvar-tracking-assignments -g2 -c /tmp/B.qnXry_/BUILD/php72-pecl-solr-2.4.0/src/php7/php_solr_response.c -fPIC -DPIC -o src/php7/.libs/php_solr_response.o /bin/sh /tmp/B.qnXry_/BUILD/php72-pecl-solr-2.4.0/libtool --mode=compile i686-pld-linux-gcc -I. -I/tmp/B.qnXry_/BUILD/php72-pecl-solr-2.4.0 -DPHP_ATOM_INC -I/tmp/B.qnXry_/BUILD/php72-pecl-solr-2.4.0/include -I/tmp/B.qnXry_/BUILD/php72-pecl-solr-2.4.0/main -I/tmp/B.qnXry_/BUILD/php72-pecl-solr-2.4.0 -I/usr/include/php -I/usr/include/php/main -I/usr/include/php/TSRM -I/usr/include/php/Zend -I/usr/include/php/ext -I/usr/include/php/ext/date/lib -I/usr/include/libxml2 -I/usr/include/php -I/usr/include/php/main -I/usr/include/php/TSRM -I/usr/include/php/Zend -I/usr/include/php/ext -I/usr/include/php/ext/date/lib -I/usr/include/libxml2 -DHAVE_CONFIG_H -O2 -fwrapv -pipe -Wformat -Werror=format-security -gdwarf-4 -fno-debug-types-section -fvar-tracking-assignments -g2 -Wp,-D_FORTIFY_SOURCE=2 -fstack-protector-strong --param=ssp-buffer-size=4 -fomit-frame-pointer -march=i686 -fasynchronous-unwind-tables -mtune=pentium4 -gdwarf-4 -fno-debug-types-section -fvar-tracking-assignments -g2 -c /tmp/B.qnXry_/BUILD/php72-pecl-solr-2.4.0/src/php7/php_solr_params.c -o src/php7/php_solr_params.lo libtool: compile: i686-pld-linux-gcc -I. -I/tmp/B.qnXry_/BUILD/php72-pecl-solr-2.4.0 -DPHP_ATOM_INC -I/tmp/B.qnXry_/BUILD/php72-pecl-solr-2.4.0/include -I/tmp/B.qnXry_/BUILD/php72-pecl-solr-2.4.0/main -I/tmp/B.qnXry_/BUILD/php72-pecl-solr-2.4.0 -I/usr/include/php -I/usr/include/php/main -I/usr/include/php/TSRM -I/usr/include/php/Zend -I/usr/include/php/ext -I/usr/include/php/ext/date/lib -I/usr/include/libxml2 -I/usr/include/php -I/usr/include/php/main -I/usr/include/php/TSRM -I/usr/include/php/Zend -I/usr/include/php/ext -I/usr/include/php/ext/date/lib -I/usr/include/libxml2 -DHAVE_CONFIG_H -O2 -fwrapv -pipe -Wformat -Werror=format-security -gdwarf-4 -fno-debug-types-section -fvar-tracking-assignments -g2 -Wp,-D_FORTIFY_SOURCE=2 -fstack-protector-strong --param=ssp-buffer-size=4 -fomit-frame-pointer -march=i686 -fasynchronous-unwind-tables -mtune=pentium4 -gdwarf-4 -fno-debug-types-section -fvar-tracking-assignments -g2 -c /tmp/B.qnXry_/BUILD/php72-pecl-solr-2.4.0/src/php7/php_solr_params.c -fPIC -DPIC -o src/php7/.libs/php_solr_params.o /bin/sh /tmp/B.qnXry_/BUILD/php72-pecl-solr-2.4.0/libtool --mode=compile i686-pld-linux-gcc -I. -I/tmp/B.qnXry_/BUILD/php72-pecl-solr-2.4.0 -DPHP_ATOM_INC -I/tmp/B.qnXry_/BUILD/php72-pecl-solr-2.4.0/include -I/tmp/B.qnXry_/BUILD/php72-pecl-solr-2.4.0/main -I/tmp/B.qnXry_/BUILD/php72-pecl-solr-2.4.0 -I/usr/include/php -I/usr/include/php/main -I/usr/include/php/TSRM -I/usr/include/php/Zend -I/usr/include/php/ext -I/usr/include/php/ext/date/lib -I/usr/include/libxml2 -I/usr/include/php -I/usr/include/php/main -I/usr/include/php/TSRM -I/usr/include/php/Zend -I/usr/include/php/ext -I/usr/include/php/ext/date/lib -I/usr/include/libxml2 -DHAVE_CONFIG_H -O2 -fwrapv -pipe -Wformat -Werror=format-security -gdwarf-4 -fno-debug-types-section -fvar-tracking-assignments -g2 -Wp,-D_FORTIFY_SOURCE=2 -fstack-protector-strong --param=ssp-buffer-size=4 -fomit-frame-pointer -march=i686 -fasynchronous-unwind-tables -mtune=pentium4 -gdwarf-4 -fno-debug-types-section -fvar-tracking-assignments -g2 -c /tmp/B.qnXry_/BUILD/php72-pecl-solr-2.4.0/src/php7/php_solr_document.c -o src/php7/php_solr_document.lo libtool: compile: i686-pld-linux-gcc -I. -I/tmp/B.qnXry_/BUILD/php72-pecl-solr-2.4.0 -DPHP_ATOM_INC -I/tmp/B.qnXry_/BUILD/php72-pecl-solr-2.4.0/include -I/tmp/B.qnXry_/BUILD/php72-pecl-solr-2.4.0/main -I/tmp/B.qnXry_/BUILD/php72-pecl-solr-2.4.0 -I/usr/include/php -I/usr/include/php/main -I/usr/include/php/TSRM -I/usr/include/php/Zend -I/usr/include/php/ext -I/usr/include/php/ext/date/lib -I/usr/include/libxml2 -I/usr/include/php -I/usr/include/php/main -I/usr/include/php/TSRM -I/usr/include/php/Zend -I/usr/include/php/ext -I/usr/include/php/ext/date/lib -I/usr/include/libxml2 -DHAVE_CONFIG_H -O2 -fwrapv -pipe -Wformat -Werror=format-security -gdwarf-4 -fno-debug-types-section -fvar-tracking-assignments -g2 -Wp,-D_FORTIFY_SOURCE=2 -fstack-protector-strong --param=ssp-buffer-size=4 -fomit-frame-pointer -march=i686 -fasynchronous-unwind-tables -mtune=pentium4 -gdwarf-4 -fno-debug-types-section -fvar-tracking-assignments -g2 -c /tmp/B.qnXry_/BUILD/php72-pecl-solr-2.4.0/src/php7/php_solr_document.c -fPIC -DPIC -o src/php7/.libs/php_solr_document.o In file included from /usr/include/php/Zend/zend.h:34:0, from /usr/include/php/main/php.h:35, from /tmp/B.qnXry_/BUILD/php72-pecl-solr-2.4.0/src/php7/php_solr.h:28, from /tmp/B.qnXry_/BUILD/php72-pecl-solr-2.4.0/src/php7/php_solr_document.c:23: /tmp/B.qnXry_/BUILD/php72-pecl-solr-2.4.0/src/php7/php_solr_document.c: In function 'zim_SolrDocument_key': /tmp/B.qnXry_/BUILD/php72-pecl-solr-2.4.0/src/php7/php_solr_document.c:758:61: warning: passing argument 3 of 'zend_hash_get_current_key_ex' from incompatible pointer type [-Wincompatible-pointer-types] if (zend_hash_get_current_key(doc_fields, &field_name_str, &num_index)) ^ /usr/include/php/Zend/zend_hash.h:216:46: note: in definition of macro 'zend_hash_get_current_key' zend_hash_get_current_key_ex(ht, str_index, num_index, &(ht)->nInternalPointer) ^~~~~~~~~ /usr/include/php/Zend/zend_hash.h:202:30: note: expected 'zend_ulong * {aka unsigned int *}' but argument is of type 'ulong * {aka long unsigned int *}' ZEND_API int ZEND_FASTCALL zend_hash_get_current_key_ex(const HashTable *ht, zend_string **str_index, zend_ulong *num_index, HashPosition *pos); ^~~~~~~~~~~~~~~~~~~~~~~~~~~~ /bin/sh /tmp/B.qnXry_/BUILD/php72-pecl-solr-2.4.0/libtool --mode=compile i686-pld-linux-gcc -I. -I/tmp/B.qnXry_/BUILD/php72-pecl-solr-2.4.0 -DPHP_ATOM_INC -I/tmp/B.qnXry_/BUILD/php72-pecl-solr-2.4.0/include -I/tmp/B.qnXry_/BUILD/php72-pecl-solr-2.4.0/main -I/tmp/B.qnXry_/BUILD/php72-pecl-solr-2.4.0 -I/usr/include/php -I/usr/include/php/main -I/usr/include/php/TSRM -I/usr/include/php/Zend -I/usr/include/php/ext -I/usr/include/php/ext/date/lib -I/usr/include/libxml2 -I/usr/include/php -I/usr/include/php/main -I/usr/include/php/TSRM -I/usr/include/php/Zend -I/usr/include/php/ext -I/usr/include/php/ext/date/lib -I/usr/include/libxml2 -DHAVE_CONFIG_H -O2 -fwrapv -pipe -Wformat -Werror=format-security -gdwarf-4 -fno-debug-types-section -fvar-tracking-assignments -g2 -Wp,-D_FORTIFY_SOURCE=2 -fstack-protector-strong --param=ssp-buffer-size=4 -fomit-frame-pointer -march=i686 -fasynchronous-unwind-tables -mtune=pentium4 -gdwarf-4 -fno-debug-types-section -fvar-tracking-assignments -g2 -c /tmp/B.qnXry_/BUILD/php72-pecl-solr-2.4.0/src/php7/php_solr_client.c -o src/php7/php_solr_client.lo libtool: compile: i686-pld-linux-gcc -I. -I/tmp/B.qnXry_/BUILD/php72-pecl-solr-2.4.0 -DPHP_ATOM_INC -I/tmp/B.qnXry_/BUILD/php72-pecl-solr-2.4.0/include -I/tmp/B.qnXry_/BUILD/php72-pecl-solr-2.4.0/main -I/tmp/B.qnXry_/BUILD/php72-pecl-solr-2.4.0 -I/usr/include/php -I/usr/include/php/main -I/usr/include/php/TSRM -I/usr/include/php/Zend -I/usr/include/php/ext -I/usr/include/php/ext/date/lib -I/usr/include/libxml2 -I/usr/include/php -I/usr/include/php/main -I/usr/include/php/TSRM -I/usr/include/php/Zend -I/usr/include/php/ext -I/usr/include/php/ext/date/lib -I/usr/include/libxml2 -DHAVE_CONFIG_H -O2 -fwrapv -pipe -Wformat -Werror=format-security -gdwarf-4 -fno-debug-types-section -fvar-tracking-assignments -g2 -Wp,-D_FORTIFY_SOURCE=2 -fstack-protector-strong --param=ssp-buffer-size=4 -fomit-frame-pointer -march=i686 -fasynchronous-unwind-tables -mtune=pentium4 -gdwarf-4 -fno-debug-types-section -fvar-tracking-assignments -g2 -c /tmp/B.qnXry_/BUILD/php72-pecl-solr-2.4.0/src/php7/php_solr_client.c -fPIC -DPIC -o src/php7/.libs/php_solr_client.o /bin/sh /tmp/B.qnXry_/BUILD/php72-pecl-solr-2.4.0/libtool --mode=compile i686-pld-linux-gcc -I. -I/tmp/B.qnXry_/BUILD/php72-pecl-solr-2.4.0 -DPHP_ATOM_INC -I/tmp/B.qnXry_/BUILD/php72-pecl-solr-2.4.0/include -I/tmp/B.qnXry_/BUILD/php72-pecl-solr-2.4.0/main -I/tmp/B.qnXry_/BUILD/php72-pecl-solr-2.4.0 -I/usr/include/php -I/usr/include/php/main -I/usr/include/php/TSRM -I/usr/include/php/Zend -I/usr/include/php/ext -I/usr/include/php/ext/date/lib -I/usr/include/libxml2 -I/usr/include/php -I/usr/include/php/main -I/usr/include/php/TSRM -I/usr/include/php/Zend -I/usr/include/php/ext -I/usr/include/php/ext/date/lib -I/usr/include/libxml2 -DHAVE_CONFIG_H -O2 -fwrapv -pipe -Wformat -Werror=format-security -gdwarf-4 -fno-debug-types-section -fvar-tracking-assignments -g2 -Wp,-D_FORTIFY_SOURCE=2 -fstack-protector-strong --param=ssp-buffer-size=4 -fomit-frame-pointer -march=i686 -fasynchronous-unwind-tables -mtune=pentium4 -gdwarf-4 -fno-debug-types-section -fvar-tracking-assignments -g2 -c /tmp/B.qnXry_/BUILD/php72-pecl-solr-2.4.0/src/php7/php_solr_query.c -o src/php7/php_solr_query.lo libtool: compile: i686-pld-linux-gcc -I. -I/tmp/B.qnXry_/BUILD/php72-pecl-solr-2.4.0 -DPHP_ATOM_INC -I/tmp/B.qnXry_/BUILD/php72-pecl-solr-2.4.0/include -I/tmp/B.qnXry_/BUILD/php72-pecl-solr-2.4.0/main -I/tmp/B.qnXry_/BUILD/php72-pecl-solr-2.4.0 -I/usr/include/php -I/usr/include/php/main -I/usr/include/php/TSRM -I/usr/include/php/Zend -I/usr/include/php/ext -I/usr/include/php/ext/date/lib -I/usr/include/libxml2 -I/usr/include/php -I/usr/include/php/main -I/usr/include/php/TSRM -I/usr/include/php/Zend -I/usr/include/php/ext -I/usr/include/php/ext/date/lib -I/usr/include/libxml2 -DHAVE_CONFIG_H -O2 -fwrapv -pipe -Wformat -Werror=format-security -gdwarf-4 -fno-debug-types-section -fvar-tracking-assignments -g2 -Wp,-D_FORTIFY_SOURCE=2 -fstack-protector-strong --param=ssp-buffer-size=4 -fomit-frame-pointer -march=i686 -fasynchronous-unwind-tables -mtune=pentium4 -gdwarf-4 -fno-debug-types-section -fvar-tracking-assignments -g2 -c /tmp/B.qnXry_/BUILD/php72-pecl-solr-2.4.0/src/php7/php_solr_query.c -fPIC -DPIC -o src/php7/.libs/php_solr_query.o error: Bad exit status from /tmp/B.qnXry_/BUILD/tmp/rpm-tmp.21039 (%build) RPM build errors: %changelog not in descending chronological order Bad exit status from /tmp/B.qnXry_/BUILD/tmp/rpm-tmp.21039 (%build) ended at: Tue Dec 5 17:19:07 2017, done in 0:00:06.376442 error: No files produced. + chmod -R u+rwX /tmp/B.qnXry_/BUILD + rm -rf /tmp/B.qnXry_/tmp /tmp/B.qnXry_/BUILD + rm -rf /tmp/B.qnXry_ Begin-PLD-Builder-Info Build-Time: user:16.41s sys:2.11s real:27.97s (faults io:0 non-io:872614) End-PLD-Builder-Info
[Back to list of logs] [View rpm -qa of builder]