FailedOk

th/SRPMS[OK]
th/x32[OK]
th/i686[OK]
th/x86_64[OK]

ac/SRPMS[OK]
ac/i386[OK]
ac/i586[OK]
ac/i686[OK]
ac/alpha[OK]
ac/amd64[OK]
ac/athlon[OK]
ac/ppc[OK]
ac/sparc[OK]
ac/sparc64[OK]

Advanced Search
main()
Powered by PLD Linux
(c) 2002-2019 PLD Team
$Revision: 1.37 $
Powered by electricity.
Your IP: 3.80.4.76

php-pecl-xdebug 18d53512-2caf-4ad8-825c-2e0ac03a5a73

Status:Failed
Source URL:ftp://buildlogs.pld-linux.org/th/i686/FAIL/php-pecl-xdebug,18d53512-2caf-4ad8-825c-2e0ac03a5a73.bz2
text/plain URL:View!
full text:View!
rpm -qa of builder:View!
Date:2019/08/06 14:44:33
Runtime:0:00:05.891671

Toc:

  • error 1
  • rpm: error: Failed build dependencies:
  • error 2
  • error: ftp://ftp1.pld-linux.org/dists/th/test/i686/RPMS/packages.ndir.gz: broken file
  • error 3
  • error: ftp://ftp1.pld-linux.org/dists/th/test/i686/RPMS/packages.ndir.gz: broken file
  • error 4
  • poldek: error: ftp://ftp1.pld-linux.org/dists/th/test/i686/RPMS/packages.ndir.gz: broken file
  • error 5
  • poldek: error: ftp://ftp1.pld-linux.org/dists/th/test/i686/RPMS/packages.ndir.gz: broken file
  • error 6
  • rpm: error: Failed build dependencies:
  • error 7
  • error: ftp://ftp1.pld-linux.org/dists/th/test/i686/RPMS/packages.ndir.gz: broken file
  • error 8
  • error: ftp://ftp1.pld-linux.org/dists/th/test/i686/RPMS/packages.ndir.gz: broken file
  • prep
  • Executing(%prep): /bin/sh -e /tmp/B.axDX5m/BUILD/tmp/rpm-tmp.30294
  • build
  • Executing(%build): /bin/sh -e /tmp/B.axDX5m/BUILD/tmp/rpm-tmp.30294
  • error 9
  • /tmp/B.axDX5m/BUILD/php74-pecl-xdebug-2.8.0/xdebug_code_coverage.c:385:28: error: 'ZEND_ASSIGN_DIM_OP' undeclared (first use in this function); did you mean 'ZEND_ASSIGN_DIM'?
  • error 10
  • /tmp/B.axDX5m/BUILD/php74-pecl-xdebug-2.8.0/xdebug_code_coverage.c:392:28: error: 'ZEND_ASSIGN_OBJ_OP' undeclared (first use in this function); did you mean 'ZEND_ASSIGN_OBJ'?
  • error 11
  • /tmp/B.axDX5m/BUILD/php74-pecl-xdebug-2.8.0/xdebug_code_coverage.c:402:28: error: 'ZEND_ASSIGN_STATIC_PROP_OP' undeclared (first use in this function); did you mean 'ZEND_ASSIGN_STATIC_PROP'?
  • error 12
  • /tmp/B.axDX5m/BUILD/php74-pecl-xdebug-2.8.0/xdebug.c:878:47: error: 'ZEND_ASSIGN_OP' undeclared (first use in this function); did you mean 'ZEND_ASSIGN_MOD'?
  • error 13
  • /tmp/B.axDX5m/BUILD/php74-pecl-xdebug-2.8.0/xdebug.c:879:51: error: 'ZEND_ASSIGN_DIM_OP' undeclared (first use in this function); did you mean 'ZEND_ASSIGN_DIM'?
  • error 14
  • /tmp/B.axDX5m/BUILD/php74-pecl-xdebug-2.8.0/xdebug.c:880:51: error: 'ZEND_ASSIGN_OBJ_OP' undeclared (first use in this function); did you mean 'ZEND_ASSIGN_OBJ'?
  • error 15
  • /tmp/B.axDX5m/BUILD/php74-pecl-xdebug-2.8.0/xdebug.c:881:59: error: 'ZEND_ASSIGN_STATIC_PROP_OP' undeclared (first use in this function); did you mean 'ZEND_ASSIGN_STATIC_PROP'?
  • error 16
  • /tmp/B.axDX5m/BUILD/php74-pecl-xdebug-2.8.0/xdebug.c:1069:32: error: 'ZEND_ASSIGN_OP' undeclared (first use in this function); did you mean 'ZEND_ASSIGN_MOD'?
  • error 17
  • /tmp/B.axDX5m/BUILD/php74-pecl-xdebug-2.8.0/xdebug.c:1070:32: error: 'ZEND_ASSIGN_DIM_OP' undeclared (first use in this function); did you mean 'ZEND_ASSIGN_DIM'?
  • error 18
  • /tmp/B.axDX5m/BUILD/php74-pecl-xdebug-2.8.0/xdebug.c:1071:32: error: 'ZEND_ASSIGN_OBJ_OP' undeclared (first use in this function); did you mean 'ZEND_ASSIGN_OBJ'?
  • error 19
  • /tmp/B.axDX5m/BUILD/php74-pecl-xdebug-2.8.0/xdebug.c:1072:32: error: 'ZEND_ASSIGN_STATIC_PROP_OP' undeclared (first use in this function); did you mean 'ZEND_ASSIGN_STATIC_PROP'?
  • error 20
  • error: Bad exit status from /tmp/B.axDX5m/BUILD/tmp/rpm-tmp.30294 (%build)
  • error 21
  • RPM build errors:
  • error 22
  • error: No files produced.

Content:

checking if we should skip the build
started at: Tue Aug  6 14:44:09 2019
killing old processes on a builder
sending signal 9 to pid -1
Killed
cleaning up /tmp
fetching https://srcbuilder.pld-linux.org/th//srpms/18d53512-2caf-4ad8-825c-2e0ac03a5a73/php74-pecl-xdebug-2.8.0-0.beta1.1.src.rpm
fetched 260410 bytes, 582.3 K/s
installing srpm: php74-pecl-xdebug-2.8.0-0.beta1.1.src.rpm
+ install -d /tmp/B.axDX5m/BUILD /tmp/B.axDX5m/RPMS
+ LC_ALL=en_US.UTF-8
+ rpm -qp --changelog php74-pecl-xdebug-2.8.0-0.beta1.1.src.rpm
* Tue Aug 06 2019 PLD Linux Team <feedback@pld-linux.org>
- For complete changelog see: http://git.pld-linux.org/?p=packages/php-pecl-xdebug.git;a=log;h=master
* Tue Aug 06 2019 Elan Ruusamäe <glen@pld-linux.org> 4f7e6f4
- update to 2.8.0beta1 for php 7.4 support * Mon Apr 08 2019 Adam Gołębiowski <adamg@pld-linux.org> bf2f1d0
- updated to 2.7.1 * Mon Sep 24 2018 Elan Ruusamäe <glen@pld-linux.org> 3171ad8
- up to xdebug-2.7.0beta1 with PHP 7.3 support * Mon Sep 24 2018 Elan Ruusamäe <glen@pld-linux.org> 3ea1035
- up to 2.6.1 [2018-08-01] + rpm -Uhv --nodeps --define '_topdir /tmp/B.axDX5m' --define '_specdir %{_topdir}' --define '_sourcedir %{_specdir}' --define '_rpmdir %{_topdir}/RPMS' --define '_builddir %{_topdir}/BUILD' --define 'php_suffix 74' php74-pecl-xdebug-2.8.0-0.beta1.1.src.rpm Preparing... ################################################## php74-pecl-xdebug ################################################## + rm -f php74-pecl-xdebug-2.8.0-0.beta1.1.src.rpm + install -m 700 -d /tmp/B.axDX5m/BUILD/tmp + TMPDIR=/tmp/B.axDX5m/BUILD/tmp + exec nice -n 0 rpmbuild -bp --short-circuit --nodeps --define '_topdir /tmp/B.axDX5m' --define '_specdir %{_topdir}' --define '_sourcedir %{_specdir}' --define '_rpmdir %{_topdir}/RPMS' --define '_builddir %{_topdir}/BUILD' --target i686-pld-linux --define 'php_suffix 74' --define 'prep exit 0' /tmp/B.axDX5m/php-pecl-xdebug.spec Building target platforms: i686-pld-linux checking BuildConflict-ing packages no BuildConflicts found checking BR rpm: error: Failed build dependencies: rpm: php74-devel >= 4:7.0 is needed by php74-pecl-xdebug-2.8.0-0.beta1.1.src rpm: Building target platforms: i686-pld-linux updating poldek cache... ready is up to date Retrieving th::packages.ndir.md... th is up to date Retrieving th::packages.ndir.md... th is up to date Retrieving th-ready::packages.ndir.md... th-ready is up to date Retrieving th-ready::packages.ndir.md... th-ready is up to date error: ftp://ftp1.pld-linux.org/dists/th/test/i686/RPMS/packages.ndir.gz: broken file Retrieving th-test::packages.ndir.md... Retrieving th-test::packages.ndir.gz... ..............................done error: ftp://ftp1.pld-linux.org/dists/th/test/i686/RPMS/packages.ndir.gz: broken file Retrieving th-test::packages.ndir.md... th-test is up to date checking conflicting packages in BRed packages poldek: error: ftp://ftp1.pld-linux.org/dists/th/test/i686/RPMS/packages.ndir.gz: broken file poldek: Retrieving th-test::packages.ndir.md... poldek: Retrieving th-test::packages.ndir.gz... poldek: ..............................done poldek: error: ftp://ftp1.pld-linux.org/dists/th/test/i686/RPMS/packages.ndir.gz: broken file poldek: warn: ftp://ftp1.pld-linux.org/dists/th/test/i686/RPMS/: load failed, skipped poldek: Loading [pndir]ready... poldek: Loading [pndir]th-test... poldek: Loading [pndir]th-ready... poldek: Loading [pndir]th-ready... poldek: Loading [pndir]th... poldek: Loading [pndir]th... poldek: 28630 packages read poldek: Removed 1010 duplicate packages from available set poldek: Processing dependencies... poldek: php74-devel-7.4.0-1.alpha1.1.i686 marks php74-common-7.4.0-1.alpha1.1.i686 (cap /usr/lib/php74) poldek: There are 2 packages to install (1 marked by dependencies): poldek: I php74-devel-7.4.0-1.alpha1.1.i686 poldek: D php74-common-7.4.0-1.alpha1.1.i686 poldek: This operation will use 9.3MB of disk space. poldek: Need to get 1.9MB of archives (1.9MB to download). poldek: poldek: Retrieving [1/2] th::php74-common-7.4.0-1.alpha1.1.i686.rpm... poldek: ..............................done poldek: Retrieving [2/2] th::php74-devel-7.4.0-1.alpha1.1.i686.rpm... poldek: ..............................done poldek: Executing pm-command.sh --upgrade -vh --test --root / --define _check_dirname_deps 1... poldek: Preparing... ################################################## no conflicts found checking BR rpm: error: Failed build dependencies: rpm: php74-devel >= 4:7.0 is needed by php74-pecl-xdebug-2.8.0-0.beta1.1.src rpm: Building target platforms: i686-pld-linux installing BR: php74\-devel + poldek --noask --caplookup -Q -v '--ignore=hhvm-*' '--ignore=php4-*' '--ignore=php52-*' '--ignore=php53-*' '--ignore=php54-*' '--ignore=php55-*' '--ignore=php56-*' '--ignore=php70-*' '--ignore=php71-*' '--ignore=php72-*' '--ignore=php73-*' --upgrade php74-devel error: ftp://ftp1.pld-linux.org/dists/th/test/i686/RPMS/packages.ndir.gz: broken file Retrieving th-test::packages.ndir.md... Retrieving th-test::packages.ndir.gz... ..............................done error: ftp://ftp1.pld-linux.org/dists/th/test/i686/RPMS/packages.ndir.gz: broken file warn: ftp://ftp1.pld-linux.org/dists/th/test/i686/RPMS/: load failed, skipped Loading [pndir]ready... Loading [pndir]th-test... Loading [pndir]th-ready... Loading [pndir]th-ready... Loading [pndir]th... Loading [pndir]th... 28630 packages read Removed 1010 duplicate packages from available set Processing dependencies... php74-devel-7.4.0-1.alpha1.1.i686 marks php74-common-7.4.0-1.alpha1.1.i686 (cap /usr/lib/php74) There are 2 packages to install (1 marked by dependencies): I php74-devel-7.4.0-1.alpha1.1.i686 D php74-common-7.4.0-1.alpha1.1.i686 This operation will use 9.3MB of disk space. Need to get 1.9MB of archives. Executing pm-command.sh --upgrade -vh --root / --define _check_dirname_deps 1... Preparing... ################################################## php74-common ################################################## php74-devel ################################################## building RPM using: set -ex; : build-id: 18d53512-2caf-4ad8-825c-2e0ac03a5a73; TMPDIR=/tmp/B.axDX5m/BUILD/tmp exec nice -n 0 rpmbuild -bb --define '_smp_mflags -j9' --define '_make_opts -Otarget' --define '_pld_builder 1' --define '_topdir /tmp/B.axDX5m' --define '_specdir %{_topdir}' --define '_sourcedir %{_specdir}' --define '_rpmdir %{_topdir}/RPMS' --define '_builddir %{_topdir}/BUILD' --target i686-pld-linux --define 'php_suffix 74' /tmp/B.axDX5m/php-pecl-xdebug.spec + : build-id: 18d53512-2caf-4ad8-825c-2e0ac03a5a73 + TMPDIR=/tmp/B.axDX5m/BUILD/tmp + exec nice -n 0 rpmbuild -bb --define '_smp_mflags -j9' --define '_make_opts -Otarget' --define '_pld_builder 1' --define '_topdir /tmp/B.axDX5m' --define '_specdir %{_topdir}' --define '_sourcedir %{_specdir}' --define '_rpmdir %{_topdir}/RPMS' --define '_builddir %{_topdir}/BUILD' --target i686-pld-linux --define 'php_suffix 74' /tmp/B.axDX5m/php-pecl-xdebug.spec Building target platforms: i686-pld-linux Executing(%prep): /bin/sh -e /tmp/B.axDX5m/BUILD/tmp/rpm-tmp.30294 + umask 022 + cd /tmp/B.axDX5m/BUILD + cd /tmp/B.axDX5m/BUILD + rm -rf php74-pecl-xdebug-2.8.0 + /bin/mkdir -p php74-pecl-xdebug-2.8.0 + cd php74-pecl-xdebug-2.8.0 + /usr/bin/gzip -dc /tmp/B.axDX5m/xdebug-2.8.0beta1.tgz + /bin/tar -xf - + STATUS=0 + '[' 0 -ne 0 ']' + /bin/id -u + '[' 1001 '=' 0 ']' + /bin/id -u + '[' 1001 '=' 0 ']' + /bin/chmod -Rf a+rX,u+w,g-w,o-w . + mv xdebug-2.8.0beta1/CREDITS xdebug-2.8.0beta1/LICENSE xdebug-2.8.0beta1/Makefile.frag xdebug-2.8.0beta1/README.rst xdebug-2.8.0beta1/config.m4 xdebug-2.8.0beta1/config.w32 xdebug-2.8.0beta1/contrib xdebug-2.8.0beta1/debugclient xdebug-2.8.0beta1/php_xdebug.h xdebug-2.8.0beta1/usefulstuff.c xdebug-2.8.0beta1/usefulstuff.h xdebug-2.8.0beta1/xdebug.c xdebug-2.8.0beta1/xdebug.ini xdebug-2.8.0beta1/xdebug_branch_info.c xdebug-2.8.0beta1/xdebug_branch_info.h xdebug-2.8.0beta1/xdebug_code_coverage.c xdebug-2.8.0beta1/xdebug_code_coverage.h xdebug-2.8.0beta1/xdebug_com.c xdebug-2.8.0beta1/xdebug_com.h xdebug-2.8.0beta1/xdebug_compat.c xdebug-2.8.0beta1/xdebug_compat.h xdebug-2.8.0beta1/xdebug_filter.c xdebug-2.8.0beta1/xdebug_filter.h xdebug-2.8.0beta1/xdebug_gc_stats.c xdebug-2.8.0beta1/xdebug_gc_stats.h xdebug-2.8.0beta1/xdebug_handler_dbgp.c xdebug-2.8.0beta1/xdebug_handler_dbgp.h xdebug-2.8.0beta1/xdebug_handlers.c xdebug-2.8.0beta1/xdebug_handlers.h xdebug-2.8.0beta1/xdebug_hash.c xdebug-2.8.0beta1/xdebug_hash.h xdebug-2.8.0beta1/xdebug_llist.c xdebug-2.8.0beta1/xdebug_llist.h xdebug-2.8.0beta1/xdebug_mm.h xdebug-2.8.0beta1/xdebug_monitor.c xdebug-2.8.0beta1/xdebug_monitor.h xdebug-2.8.0beta1/xdebug_private.c xdebug-2.8.0beta1/xdebug_private.h xdebug-2.8.0beta1/xdebug_profiler.c xdebug-2.8.0beta1/xdebug_profiler.h xdebug-2.8.0beta1/xdebug_set.c xdebug-2.8.0beta1/xdebug_set.h xdebug-2.8.0beta1/xdebug_stack.c xdebug-2.8.0beta1/xdebug_stack.h xdebug-2.8.0beta1/xdebug_str.c xdebug-2.8.0beta1/xdebug_str.h xdebug-2.8.0beta1/xdebug_superglobals.c xdebug-2.8.0beta1/xdebug_superglobals.h xdebug-2.8.0beta1/xdebug_trace_computerized.c xdebug-2.8.0beta1/xdebug_trace_computerized.h xdebug-2.8.0beta1/xdebug_trace_html.c xdebug-2.8.0beta1/xdebug_trace_html.h xdebug-2.8.0beta1/xdebug_trace_textual.c xdebug-2.8.0beta1/xdebug_trace_textual.h xdebug-2.8.0beta1/xdebug_tracing.c xdebug-2.8.0beta1/xdebug_tracing.h xdebug-2.8.0beta1/xdebug_var.c xdebug-2.8.0beta1/xdebug_var.h xdebug-2.8.0beta1/xdebug_xml.c xdebug-2.8.0beta1/xdebug_xml.h . + >xdebug.ini + /bin/sed -e 's#^;zend_extension.*#zend_extension=/usr/lib/php74/xdebug.so#' /tmp/B.axDX5m/xdebug.ini + install -d vim/syntax vim/ftdetect + mv contrib/xt.vim vim/syntax + cp -p /tmp/B.axDX5m/vim-xt-filetype.vim vim/ftdetect/xt.vim + exit 0 Executing(%build): /bin/sh -e /tmp/B.axDX5m/BUILD/tmp/rpm-tmp.30294 TMP=/home/users/builder/tmp HOME=/home/users/builder PATH=/home/users/builder/GNUstep/Tools:/usr/local/bin:/usr/bin:/bin:/home/users/builder/bin TMPDIR=/tmp/B.axDX5m/BUILD/tmp + umask 022 + cd /tmp/B.axDX5m/BUILD + cd php74-pecl-xdebug-2.8.0 + phpize Configuring for: PHP Api Version: 20190529 Zend Module Api No: 20190529 Zend Extension Api No: 320190529 + ./configure 'LDFLAGS=-Wl,--as-needed -Wl,--no-copy-dt-needed-entries -Wl,-z,relro -Wl,-z,combreloc ' 'CFLAGS=-O2 -fwrapv -pipe -Wformat -Werror=format-security -gdwarf-4 -fno-debug-types-section -fvar-tracking-assignments -g2 -Wp,-D_FORTIFY_SOURCE=2 -fstack-protector-strong --param=ssp-buffer-size=4 -Werror=trampolines -fomit-frame-pointer -march=i686 -fasynchronous-unwind-tables -mtune=pentium4 -gdwarf-4 -fno-debug-types-section -fvar-tracking-assignments -g2 ' 'CXXFLAGS=-O2 -fwrapv -pipe -Wformat -Werror=format-security -gdwarf-4 -fno-debug-types-section -fvar-tracking-assignments -g2 -Wp,-D_FORTIFY_SOURCE=2 -fstack-protector-strong --param=ssp-buffer-size=4 -Werror=trampolines -fomit-frame-pointer -march=i686 -fasynchronous-unwind-tables -mtune=pentium4 -gdwarf-4 -fno-debug-types-section -fvar-tracking-assignments -g2 ' 'FFLAGS=-O2 -fwrapv -pipe -Wformat -Werror=format-security -gdwarf-4 -fno-debug-types-section -fvar-tracking-assignments -g2 -Wp,-D_FORTIFY_SOURCE=2 -fstack-protector-strong --param=ssp-buffer-size=4 -Werror=trampolines -fomit-frame-pointer -march=i686 -fasynchronous-unwind-tables -mtune=pentium4 -gdwarf-4 -fno-debug-types-section -fvar-tracking-assignments -g2 ' 'FCFLAGS=-O2 -fwrapv -pipe -Wformat -Werror=format-security -gdwarf-4 -fno-debug-types-section -fvar-tracking-assignments -g2 -Wp,-D_FORTIFY_SOURCE=2 -fstack-protector-strong --param=ssp-buffer-size=4 -Werror=trampolines -fomit-frame-pointer -march=i686 -fasynchronous-unwind-tables -mtune=pentium4 -gdwarf-4 -fno-debug-types-section -fvar-tracking-assignments -g2 ' 'CPPFLAGS=' 'CC=i686-pld-linux-gcc' 'CXX=i686-pld-linux-g++' '--host=i686-pld-linux' '--build=i686-pld-linux' '--prefix=/usr' '--exec-prefix=/usr' '--bindir=/usr/bin' '--sbindir=/usr/sbin' '--sysconfdir=/etc' '--datadir=/usr/share' '--includedir=/usr/include' '--libdir=/usr/lib' '--libexecdir=/usr/libexec' '--localstatedir=/var' '--sharedstatedir=/var/lib' '--mandir=/usr/share/man' '--infodir=/usr/share/info' '--x-libraries=/usr/lib' checking for grep that handles long lines and -e... /bin/grep checking for egrep... /bin/grep -E checking for a sed that does not truncate output... /bin/sed checking for i686-pld-linux-pkg-config... no checking for pkg-config... /usr/bin/pkg-config checking pkg-config is at least version 0.9.0... yes checking for i686-pld-linux-cc... i686-pld-linux-gcc checking whether the C compiler works... yes checking for C compiler default output file name... a.out checking for suffix of executables... checking whether we are cross compiling... no checking for suffix of object files... o checking whether we are using the GNU C compiler... yes checking whether i686-pld-linux-gcc accepts -g... yes checking for i686-pld-linux-gcc option to accept ISO C89... none needed checking how to run the C preprocessor... i686-pld-linux-gcc -E checking for icc... no checking for suncc... no checking for system library directory... lib checking if compiler supports -R... no checking if compiler supports -Wl,-rpath,... yes checking build system type... i686-pld-linux-gnu checking host system type... i686-pld-linux-gnu checking target system type... i686-pld-linux-gnu checking for PHP prefix... /usr checking for PHP includes... -I/usr/include/php -I/usr/include/php/main -I/usr/include/php/TSRM -I/usr/include/php/Zend -I/usr/include/php/ext -I/usr/include/php/ext/date/lib checking for PHP extension directory... /usr/lib/php74 checking for PHP installed headers prefix... /usr/include/php checking if debug is enabled... no checking if zts is enabled... no checking for gawk... gawk checking whether to enable Xdebug support... yes, shared checking whether to enable Xdebug developer build flags... no checking Check for supported PHP versions... supported (7.4.0alpha1) checking for gettimeofday... yes checking for ANSI C header files... yes checking for sys/types.h... yes checking for sys/stat.h... yes checking for stdlib.h... yes checking for string.h... yes checking for memory.h... yes checking for strings.h... yes checking for inttypes.h... yes checking for stdint.h... yes checking for unistd.h... yes checking netinet/in.h usability... yes checking netinet/in.h presence... yes checking for netinet/in.h... yes checking poll.h usability... yes checking poll.h presence... yes checking for poll.h... yes checking sys/poll.h usability... yes checking sys/poll.h presence... yes checking for sys/poll.h... yes checking for cos in -lm... yes checking how to print strings... print -r checking for a sed that does not truncate output... (cached) /bin/sed checking for fgrep... /bin/grep -F checking for ld used by i686-pld-linux-gcc... /usr/bin/ld checking if the linker (/usr/bin/ld) is GNU ld... yes checking for BSD- or MS-compatible name lister (nm)... /usr/bin/nm -B checking the name lister (/usr/bin/nm -B) interface... BSD nm checking whether ln -s works... yes checking the maximum length of command line arguments... 1572864 checking how to convert i686-pld-linux-gnu file names to i686-pld-linux-gnu format... func_convert_file_noop checking how to convert i686-pld-linux-gnu file names to toolchain format... func_convert_file_noop checking for /usr/bin/ld option to reload object files... -r checking for i686-pld-linux-objdump... no checking for objdump... objdump checking how to recognize dependent libraries... pass_all checking for i686-pld-linux-dlltool... no checking for dlltool... no checking how to associate runtime and link libraries... print -r -- checking for i686-pld-linux-ar... no checking for ar... ar checking for archiver @FILE support... @ checking for i686-pld-linux-strip... no checking for strip... strip checking for i686-pld-linux-ranlib... no checking for ranlib... ranlib checking for mawk... (cached) gawk checking command to parse /usr/bin/nm -B output from i686-pld-linux-gcc object... ok checking for sysroot... no checking for a working dd... /bin/dd checking how to truncate binary pipes... /bin/dd bs=4096 count=1 checking for i686-pld-linux-mt... no checking for mt... no checking if : is a manifest tool... no checking for dlfcn.h... yes checking for objdir... .libs checking if i686-pld-linux-gcc supports -fno-rtti -fno-exceptions... no checking for i686-pld-linux-gcc option to produce PIC... -fPIC -DPIC checking if i686-pld-linux-gcc PIC flag -fPIC -DPIC works... yes checking if i686-pld-linux-gcc static flag -static works... yes checking if i686-pld-linux-gcc supports -c -o file.o... yes checking if i686-pld-linux-gcc supports -c -o file.o... (cached) yes checking whether the i686-pld-linux-gcc linker (/usr/bin/ld) supports shared libraries... yes checking whether -lc should be explicitly linked in... no checking dynamic linker characteristics... GNU/Linux ld.so checking how to hardcode library paths into programs... immediate checking whether stripping libraries is possible... yes checking if libtool supports shared libraries... yes checking whether to build shared libraries... yes checking whether to build static libraries... no configure: creating ./config.status config.status: creating config.h config.status: executing libtool commands + /usr/bin/make -Otarget -j9 /bin/sh /tmp/B.axDX5m/BUILD/php74-pecl-xdebug-2.8.0/libtool --mode=compile i686-pld-linux-gcc -I. -I/tmp/B.axDX5m/BUILD/php74-pecl-xdebug-2.8.0 -DPHP_ATOM_INC -I/tmp/B.axDX5m/BUILD/php74-pecl-xdebug-2.8.0/include -I/tmp/B.axDX5m/BUILD/php74-pecl-xdebug-2.8.0/main -I/tmp/B.axDX5m/BUILD/php74-pecl-xdebug-2.8.0 -I/usr/include/php -I/usr/include/php/main -I/usr/include/php/TSRM -I/usr/include/php/Zend -I/usr/include/php/ext -I/usr/include/php/ext/date/lib -DHAVE_CONFIG_H -O2 -fwrapv -pipe -Wformat -Werror=format-security -gdwarf-4 -fno-debug-types-section -fvar-tracking-assignments -g2 -Wp,-D_FORTIFY_SOURCE=2 -fstack-protector-strong --param=ssp-buffer-size=4 -Werror=trampolines -fomit-frame-pointer -march=i686 -fasynchronous-unwind-tables -mtune=pentium4 -gdwarf-4 -fno-debug-types-section -fvar-tracking-assignments -g2 -c /tmp/B.axDX5m/BUILD/php74-pecl-xdebug-2.8.0/xdebug_code_coverage.c -o xdebug_code_coverage.lo libtool: compile: i686-pld-linux-gcc -I. -I/tmp/B.axDX5m/BUILD/php74-pecl-xdebug-2.8.0 -DPHP_ATOM_INC -I/tmp/B.axDX5m/BUILD/php74-pecl-xdebug-2.8.0/include -I/tmp/B.axDX5m/BUILD/php74-pecl-xdebug-2.8.0/main -I/tmp/B.axDX5m/BUILD/php74-pecl-xdebug-2.8.0 -I/usr/include/php -I/usr/include/php/main -I/usr/include/php/TSRM -I/usr/include/php/Zend -I/usr/include/php/ext -I/usr/include/php/ext/date/lib -DHAVE_CONFIG_H -O2 -fwrapv -pipe -Wformat -Werror=format-security -gdwarf-4 -fno-debug-types-section -fvar-tracking-assignments -g2 -Wp,-D_FORTIFY_SOURCE=2 -fstack-protector-strong --param=ssp-buffer-size=4 -Werror=trampolines -fomit-frame-pointer -march=i686 -fasynchronous-unwind-tables -mtune=pentium4 -gdwarf-4 -fno-debug-types-section -fvar-tracking-assignments -g2 -c /tmp/B.axDX5m/BUILD/php74-pecl-xdebug-2.8.0/xdebug_code_coverage.c -fPIC -DPIC -o .libs/xdebug_code_coverage.o /tmp/B.axDX5m/BUILD/php74-pecl-xdebug-2.8.0/xdebug_code_coverage.c: In function 'xdebug_find_var_name': /tmp/B.axDX5m/BUILD/php74-pecl-xdebug-2.8.0/xdebug_code_coverage.c:385:28: error: 'ZEND_ASSIGN_DIM_OP' undeclared (first use in this function); did you mean 'ZEND_ASSIGN_DIM'? if (cur_opcode->opcode == ZEND_ASSIGN_DIM_OP) { ^~~~~~~~~~~~~~~~~~ ZEND_ASSIGN_DIM /tmp/B.axDX5m/BUILD/php74-pecl-xdebug-2.8.0/xdebug_code_coverage.c:385:28: note: each undeclared identifier is reported only once for each function it appears in /tmp/B.axDX5m/BUILD/php74-pecl-xdebug-2.8.0/xdebug_code_coverage.c:392:28: error: 'ZEND_ASSIGN_OBJ_OP' undeclared (first use in this function); did you mean 'ZEND_ASSIGN_OBJ'? if (cur_opcode->opcode == ZEND_ASSIGN_OBJ_OP) { ^~~~~~~~~~~~~~~~~~ ZEND_ASSIGN_OBJ /tmp/B.axDX5m/BUILD/php74-pecl-xdebug-2.8.0/xdebug_code_coverage.c:402:28: error: 'ZEND_ASSIGN_STATIC_PROP_OP' undeclared (first use in this function); did you mean 'ZEND_ASSIGN_STATIC_PROP'? if (cur_opcode->opcode == ZEND_ASSIGN_STATIC_PROP_OP) { ^~~~~~~~~~~~~~~~~~~~~~~~~~ ZEND_ASSIGN_STATIC_PROP make: *** [Makefile:252: xdebug_code_coverage.lo] Error 1 make: *** Waiting for unfinished jobs.... /bin/sh /tmp/B.axDX5m/BUILD/php74-pecl-xdebug-2.8.0/libtool --mode=compile i686-pld-linux-gcc -I. -I/tmp/B.axDX5m/BUILD/php74-pecl-xdebug-2.8.0 -DPHP_ATOM_INC -I/tmp/B.axDX5m/BUILD/php74-pecl-xdebug-2.8.0/include -I/tmp/B.axDX5m/BUILD/php74-pecl-xdebug-2.8.0/main -I/tmp/B.axDX5m/BUILD/php74-pecl-xdebug-2.8.0 -I/usr/include/php -I/usr/include/php/main -I/usr/include/php/TSRM -I/usr/include/php/Zend -I/usr/include/php/ext -I/usr/include/php/ext/date/lib -DHAVE_CONFIG_H -O2 -fwrapv -pipe -Wformat -Werror=format-security -gdwarf-4 -fno-debug-types-section -fvar-tracking-assignments -g2 -Wp,-D_FORTIFY_SOURCE=2 -fstack-protector-strong --param=ssp-buffer-size=4 -Werror=trampolines -fomit-frame-pointer -march=i686 -fasynchronous-unwind-tables -mtune=pentium4 -gdwarf-4 -fno-debug-types-section -fvar-tracking-assignments -g2 -c /tmp/B.axDX5m/BUILD/php74-pecl-xdebug-2.8.0/xdebug_handlers.c -o xdebug_handlers.lo libtool: compile: i686-pld-linux-gcc -I. -I/tmp/B.axDX5m/BUILD/php74-pecl-xdebug-2.8.0 -DPHP_ATOM_INC -I/tmp/B.axDX5m/BUILD/php74-pecl-xdebug-2.8.0/include -I/tmp/B.axDX5m/BUILD/php74-pecl-xdebug-2.8.0/main -I/tmp/B.axDX5m/BUILD/php74-pecl-xdebug-2.8.0 -I/usr/include/php -I/usr/include/php/main -I/usr/include/php/TSRM -I/usr/include/php/Zend -I/usr/include/php/ext -I/usr/include/php/ext/date/lib -DHAVE_CONFIG_H -O2 -fwrapv -pipe -Wformat -Werror=format-security -gdwarf-4 -fno-debug-types-section -fvar-tracking-assignments -g2 -Wp,-D_FORTIFY_SOURCE=2 -fstack-protector-strong --param=ssp-buffer-size=4 -Werror=trampolines -fomit-frame-pointer -march=i686 -fasynchronous-unwind-tables -mtune=pentium4 -gdwarf-4 -fno-debug-types-section -fvar-tracking-assignments -g2 -c /tmp/B.axDX5m/BUILD/php74-pecl-xdebug-2.8.0/xdebug_handlers.c -fPIC -DPIC -o .libs/xdebug_handlers.o /bin/sh /tmp/B.axDX5m/BUILD/php74-pecl-xdebug-2.8.0/libtool --mode=compile i686-pld-linux-gcc -I. -I/tmp/B.axDX5m/BUILD/php74-pecl-xdebug-2.8.0 -DPHP_ATOM_INC -I/tmp/B.axDX5m/BUILD/php74-pecl-xdebug-2.8.0/include -I/tmp/B.axDX5m/BUILD/php74-pecl-xdebug-2.8.0/main -I/tmp/B.axDX5m/BUILD/php74-pecl-xdebug-2.8.0 -I/usr/include/php -I/usr/include/php/main -I/usr/include/php/TSRM -I/usr/include/php/Zend -I/usr/include/php/ext -I/usr/include/php/ext/date/lib -DHAVE_CONFIG_H -O2 -fwrapv -pipe -Wformat -Werror=format-security -gdwarf-4 -fno-debug-types-section -fvar-tracking-assignments -g2 -Wp,-D_FORTIFY_SOURCE=2 -fstack-protector-strong --param=ssp-buffer-size=4 -Werror=trampolines -fomit-frame-pointer -march=i686 -fasynchronous-unwind-tables -mtune=pentium4 -gdwarf-4 -fno-debug-types-section -fvar-tracking-assignments -g2 -c /tmp/B.axDX5m/BUILD/php74-pecl-xdebug-2.8.0/xdebug_gc_stats.c -o xdebug_gc_stats.lo libtool: compile: i686-pld-linux-gcc -I. -I/tmp/B.axDX5m/BUILD/php74-pecl-xdebug-2.8.0 -DPHP_ATOM_INC -I/tmp/B.axDX5m/BUILD/php74-pecl-xdebug-2.8.0/include -I/tmp/B.axDX5m/BUILD/php74-pecl-xdebug-2.8.0/main -I/tmp/B.axDX5m/BUILD/php74-pecl-xdebug-2.8.0 -I/usr/include/php -I/usr/include/php/main -I/usr/include/php/TSRM -I/usr/include/php/Zend -I/usr/include/php/ext -I/usr/include/php/ext/date/lib -DHAVE_CONFIG_H -O2 -fwrapv -pipe -Wformat -Werror=format-security -gdwarf-4 -fno-debug-types-section -fvar-tracking-assignments -g2 -Wp,-D_FORTIFY_SOURCE=2 -fstack-protector-strong --param=ssp-buffer-size=4 -Werror=trampolines -fomit-frame-pointer -march=i686 -fasynchronous-unwind-tables -mtune=pentium4 -gdwarf-4 -fno-debug-types-section -fvar-tracking-assignments -g2 -c /tmp/B.axDX5m/BUILD/php74-pecl-xdebug-2.8.0/xdebug_gc_stats.c -fPIC -DPIC -o .libs/xdebug_gc_stats.o /bin/sh /tmp/B.axDX5m/BUILD/php74-pecl-xdebug-2.8.0/libtool --mode=compile i686-pld-linux-gcc -I. -I/tmp/B.axDX5m/BUILD/php74-pecl-xdebug-2.8.0 -DPHP_ATOM_INC -I/tmp/B.axDX5m/BUILD/php74-pecl-xdebug-2.8.0/include -I/tmp/B.axDX5m/BUILD/php74-pecl-xdebug-2.8.0/main -I/tmp/B.axDX5m/BUILD/php74-pecl-xdebug-2.8.0 -I/usr/include/php -I/usr/include/php/main -I/usr/include/php/TSRM -I/usr/include/php/Zend -I/usr/include/php/ext -I/usr/include/php/ext/date/lib -DHAVE_CONFIG_H -O2 -fwrapv -pipe -Wformat -Werror=format-security -gdwarf-4 -fno-debug-types-section -fvar-tracking-assignments -g2 -Wp,-D_FORTIFY_SOURCE=2 -fstack-protector-strong --param=ssp-buffer-size=4 -Werror=trampolines -fomit-frame-pointer -march=i686 -fasynchronous-unwind-tables -mtune=pentium4 -gdwarf-4 -fno-debug-types-section -fvar-tracking-assignments -g2 -c /tmp/B.axDX5m/BUILD/php74-pecl-xdebug-2.8.0/xdebug_filter.c -o xdebug_filter.lo libtool: compile: i686-pld-linux-gcc -I. -I/tmp/B.axDX5m/BUILD/php74-pecl-xdebug-2.8.0 -DPHP_ATOM_INC -I/tmp/B.axDX5m/BUILD/php74-pecl-xdebug-2.8.0/include -I/tmp/B.axDX5m/BUILD/php74-pecl-xdebug-2.8.0/main -I/tmp/B.axDX5m/BUILD/php74-pecl-xdebug-2.8.0 -I/usr/include/php -I/usr/include/php/main -I/usr/include/php/TSRM -I/usr/include/php/Zend -I/usr/include/php/ext -I/usr/include/php/ext/date/lib -DHAVE_CONFIG_H -O2 -fwrapv -pipe -Wformat -Werror=format-security -gdwarf-4 -fno-debug-types-section -fvar-tracking-assignments -g2 -Wp,-D_FORTIFY_SOURCE=2 -fstack-protector-strong --param=ssp-buffer-size=4 -Werror=trampolines -fomit-frame-pointer -march=i686 -fasynchronous-unwind-tables -mtune=pentium4 -gdwarf-4 -fno-debug-types-section -fvar-tracking-assignments -g2 -c /tmp/B.axDX5m/BUILD/php74-pecl-xdebug-2.8.0/xdebug_filter.c -fPIC -DPIC -o .libs/xdebug_filter.o /bin/sh /tmp/B.axDX5m/BUILD/php74-pecl-xdebug-2.8.0/libtool --mode=compile i686-pld-linux-gcc -I. -I/tmp/B.axDX5m/BUILD/php74-pecl-xdebug-2.8.0 -DPHP_ATOM_INC -I/tmp/B.axDX5m/BUILD/php74-pecl-xdebug-2.8.0/include -I/tmp/B.axDX5m/BUILD/php74-pecl-xdebug-2.8.0/main -I/tmp/B.axDX5m/BUILD/php74-pecl-xdebug-2.8.0 -I/usr/include/php -I/usr/include/php/main -I/usr/include/php/TSRM -I/usr/include/php/Zend -I/usr/include/php/ext -I/usr/include/php/ext/date/lib -DHAVE_CONFIG_H -O2 -fwrapv -pipe -Wformat -Werror=format-security -gdwarf-4 -fno-debug-types-section -fvar-tracking-assignments -g2 -Wp,-D_FORTIFY_SOURCE=2 -fstack-protector-strong --param=ssp-buffer-size=4 -Werror=trampolines -fomit-frame-pointer -march=i686 -fasynchronous-unwind-tables -mtune=pentium4 -gdwarf-4 -fno-debug-types-section -fvar-tracking-assignments -g2 -c /tmp/B.axDX5m/BUILD/php74-pecl-xdebug-2.8.0/xdebug.c -o xdebug.lo libtool: compile: i686-pld-linux-gcc -I. -I/tmp/B.axDX5m/BUILD/php74-pecl-xdebug-2.8.0 -DPHP_ATOM_INC -I/tmp/B.axDX5m/BUILD/php74-pecl-xdebug-2.8.0/include -I/tmp/B.axDX5m/BUILD/php74-pecl-xdebug-2.8.0/main -I/tmp/B.axDX5m/BUILD/php74-pecl-xdebug-2.8.0 -I/usr/include/php -I/usr/include/php/main -I/usr/include/php/TSRM -I/usr/include/php/Zend -I/usr/include/php/ext -I/usr/include/php/ext/date/lib -DHAVE_CONFIG_H -O2 -fwrapv -pipe -Wformat -Werror=format-security -gdwarf-4 -fno-debug-types-section -fvar-tracking-assignments -g2 -Wp,-D_FORTIFY_SOURCE=2 -fstack-protector-strong --param=ssp-buffer-size=4 -Werror=trampolines -fomit-frame-pointer -march=i686 -fasynchronous-unwind-tables -mtune=pentium4 -gdwarf-4 -fno-debug-types-section -fvar-tracking-assignments -g2 -c /tmp/B.axDX5m/BUILD/php74-pecl-xdebug-2.8.0/xdebug.c -fPIC -DPIC -o .libs/xdebug.o In file included from /tmp/B.axDX5m/BUILD/php74-pecl-xdebug-2.8.0/php_xdebug.h:37, from /tmp/B.axDX5m/BUILD/php74-pecl-xdebug-2.8.0/xdebug.c:52: /tmp/B.axDX5m/BUILD/php74-pecl-xdebug-2.8.0/xdebug.c: In function 'zm_startup_xdebug': /tmp/B.axDX5m/BUILD/php74-pecl-xdebug-2.8.0/xdebug.c:878:47: error: 'ZEND_ASSIGN_OP' undeclared (first use in this function); did you mean 'ZEND_ASSIGN_MOD'? XDEBUG_SET_OPCODE_OVERRIDE_ASSIGN(assign_op, ZEND_ASSIGN_OP); ^~~~~~~~~~~~~~ /tmp/B.axDX5m/BUILD/php74-pecl-xdebug-2.8.0/xdebug_code_coverage.h:50:31: note: in definition of macro 'XDEBUG_SET_OPCODE_OVERRIDE_ASSIGN' zend_set_user_opcode_handler(oc, xdebug_##f##_handler); ^~ /tmp/B.axDX5m/BUILD/php74-pecl-xdebug-2.8.0/xdebug.c:878:47: note: each undeclared identifier is reported only once for each function it appears in XDEBUG_SET_OPCODE_OVERRIDE_ASSIGN(assign_op, ZEND_ASSIGN_OP); ^~~~~~~~~~~~~~ /tmp/B.axDX5m/BUILD/php74-pecl-xdebug-2.8.0/xdebug_code_coverage.h:50:31: note: in definition of macro 'XDEBUG_SET_OPCODE_OVERRIDE_ASSIGN' zend_set_user_opcode_handler(oc, xdebug_##f##_handler); ^~ /tmp/B.axDX5m/BUILD/php74-pecl-xdebug-2.8.0/xdebug.c:879:51: error: 'ZEND_ASSIGN_DIM_OP' undeclared (first use in this function); did you mean 'ZEND_ASSIGN_DIM'? XDEBUG_SET_OPCODE_OVERRIDE_ASSIGN(assign_dim_op, ZEND_ASSIGN_DIM_OP); ^~~~~~~~~~~~~~~~~~ /tmp/B.axDX5m/BUILD/php74-pecl-xdebug-2.8.0/xdebug_code_coverage.h:50:31: note: in definition of macro 'XDEBUG_SET_OPCODE_OVERRIDE_ASSIGN' zend_set_user_opcode_handler(oc, xdebug_##f##_handler); ^~ /tmp/B.axDX5m/BUILD/php74-pecl-xdebug-2.8.0/xdebug.c:880:51: error: 'ZEND_ASSIGN_OBJ_OP' undeclared (first use in this function); did you mean 'ZEND_ASSIGN_OBJ'? XDEBUG_SET_OPCODE_OVERRIDE_ASSIGN(assign_obj_op, ZEND_ASSIGN_OBJ_OP); ^~~~~~~~~~~~~~~~~~ /tmp/B.axDX5m/BUILD/php74-pecl-xdebug-2.8.0/xdebug_code_coverage.h:50:31: note: in definition of macro 'XDEBUG_SET_OPCODE_OVERRIDE_ASSIGN' zend_set_user_opcode_handler(oc, xdebug_##f##_handler); ^~ /tmp/B.axDX5m/BUILD/php74-pecl-xdebug-2.8.0/xdebug.c:881:59: error: 'ZEND_ASSIGN_STATIC_PROP_OP' undeclared (first use in this function); did you mean 'ZEND_ASSIGN_STATIC_PROP'? XDEBUG_SET_OPCODE_OVERRIDE_ASSIGN(assign_static_prop_op, ZEND_ASSIGN_STATIC_PROP_OP); ^~~~~~~~~~~~~~~~~~~~~~~~~~ /tmp/B.axDX5m/BUILD/php74-pecl-xdebug-2.8.0/xdebug_code_coverage.h:50:31: note: in definition of macro 'XDEBUG_SET_OPCODE_OVERRIDE_ASSIGN' zend_set_user_opcode_handler(oc, xdebug_##f##_handler); ^~ /tmp/B.axDX5m/BUILD/php74-pecl-xdebug-2.8.0/xdebug.c: In function 'zm_shutdown_xdebug': /tmp/B.axDX5m/BUILD/php74-pecl-xdebug-2.8.0/xdebug.c:1069:32: error: 'ZEND_ASSIGN_OP' undeclared (first use in this function); did you mean 'ZEND_ASSIGN_MOD'? zend_set_user_opcode_handler(ZEND_ASSIGN_OP, NULL); ^~~~~~~~~~~~~~ ZEND_ASSIGN_MOD /tmp/B.axDX5m/BUILD/php74-pecl-xdebug-2.8.0/xdebug.c:1070:32: error: 'ZEND_ASSIGN_DIM_OP' undeclared (first use in this function); did you mean 'ZEND_ASSIGN_DIM'? zend_set_user_opcode_handler(ZEND_ASSIGN_DIM_OP, NULL); ^~~~~~~~~~~~~~~~~~ ZEND_ASSIGN_DIM /tmp/B.axDX5m/BUILD/php74-pecl-xdebug-2.8.0/xdebug.c:1071:32: error: 'ZEND_ASSIGN_OBJ_OP' undeclared (first use in this function); did you mean 'ZEND_ASSIGN_OBJ'? zend_set_user_opcode_handler(ZEND_ASSIGN_OBJ_OP, NULL); ^~~~~~~~~~~~~~~~~~ ZEND_ASSIGN_OBJ /tmp/B.axDX5m/BUILD/php74-pecl-xdebug-2.8.0/xdebug.c:1072:32: error: 'ZEND_ASSIGN_STATIC_PROP_OP' undeclared (first use in this function); did you mean 'ZEND_ASSIGN_STATIC_PROP'? zend_set_user_opcode_handler(ZEND_ASSIGN_STATIC_PROP_OP, NULL); ^~~~~~~~~~~~~~~~~~~~~~~~~~ ZEND_ASSIGN_STATIC_PROP make: *** [Makefile:248: xdebug.lo] Error 1 /bin/sh /tmp/B.axDX5m/BUILD/php74-pecl-xdebug-2.8.0/libtool --mode=compile i686-pld-linux-gcc -I. -I/tmp/B.axDX5m/BUILD/php74-pecl-xdebug-2.8.0 -DPHP_ATOM_INC -I/tmp/B.axDX5m/BUILD/php74-pecl-xdebug-2.8.0/include -I/tmp/B.axDX5m/BUILD/php74-pecl-xdebug-2.8.0/main -I/tmp/B.axDX5m/BUILD/php74-pecl-xdebug-2.8.0 -I/usr/include/php -I/usr/include/php/main -I/usr/include/php/TSRM -I/usr/include/php/Zend -I/usr/include/php/ext -I/usr/include/php/ext/date/lib -DHAVE_CONFIG_H -O2 -fwrapv -pipe -Wformat -Werror=format-security -gdwarf-4 -fno-debug-types-section -fvar-tracking-assignments -g2 -Wp,-D_FORTIFY_SOURCE=2 -fstack-protector-strong --param=ssp-buffer-size=4 -Werror=trampolines -fomit-frame-pointer -march=i686 -fasynchronous-unwind-tables -mtune=pentium4 -gdwarf-4 -fno-debug-types-section -fvar-tracking-assignments -g2 -c /tmp/B.axDX5m/BUILD/php74-pecl-xdebug-2.8.0/xdebug_branch_info.c -o xdebug_branch_info.lo libtool: compile: i686-pld-linux-gcc -I. -I/tmp/B.axDX5m/BUILD/php74-pecl-xdebug-2.8.0 -DPHP_ATOM_INC -I/tmp/B.axDX5m/BUILD/php74-pecl-xdebug-2.8.0/include -I/tmp/B.axDX5m/BUILD/php74-pecl-xdebug-2.8.0/main -I/tmp/B.axDX5m/BUILD/php74-pecl-xdebug-2.8.0 -I/usr/include/php -I/usr/include/php/main -I/usr/include/php/TSRM -I/usr/include/php/Zend -I/usr/include/php/ext -I/usr/include/php/ext/date/lib -DHAVE_CONFIG_H -O2 -fwrapv -pipe -Wformat -Werror=format-security -gdwarf-4 -fno-debug-types-section -fvar-tracking-assignments -g2 -Wp,-D_FORTIFY_SOURCE=2 -fstack-protector-strong --param=ssp-buffer-size=4 -Werror=trampolines -fomit-frame-pointer -march=i686 -fasynchronous-unwind-tables -mtune=pentium4 -gdwarf-4 -fno-debug-types-section -fvar-tracking-assignments -g2 -c /tmp/B.axDX5m/BUILD/php74-pecl-xdebug-2.8.0/xdebug_branch_info.c -fPIC -DPIC -o .libs/xdebug_branch_info.o /bin/sh /tmp/B.axDX5m/BUILD/php74-pecl-xdebug-2.8.0/libtool --mode=compile i686-pld-linux-gcc -I. -I/tmp/B.axDX5m/BUILD/php74-pecl-xdebug-2.8.0 -DPHP_ATOM_INC -I/tmp/B.axDX5m/BUILD/php74-pecl-xdebug-2.8.0/include -I/tmp/B.axDX5m/BUILD/php74-pecl-xdebug-2.8.0/main -I/tmp/B.axDX5m/BUILD/php74-pecl-xdebug-2.8.0 -I/usr/include/php -I/usr/include/php/main -I/usr/include/php/TSRM -I/usr/include/php/Zend -I/usr/include/php/ext -I/usr/include/php/ext/date/lib -DHAVE_CONFIG_H -O2 -fwrapv -pipe -Wformat -Werror=format-security -gdwarf-4 -fno-debug-types-section -fvar-tracking-assignments -g2 -Wp,-D_FORTIFY_SOURCE=2 -fstack-protector-strong --param=ssp-buffer-size=4 -Werror=trampolines -fomit-frame-pointer -march=i686 -fasynchronous-unwind-tables -mtune=pentium4 -gdwarf-4 -fno-debug-types-section -fvar-tracking-assignments -g2 -c /tmp/B.axDX5m/BUILD/php74-pecl-xdebug-2.8.0/xdebug_com.c -o xdebug_com.lo libtool: compile: i686-pld-linux-gcc -I. -I/tmp/B.axDX5m/BUILD/php74-pecl-xdebug-2.8.0 -DPHP_ATOM_INC -I/tmp/B.axDX5m/BUILD/php74-pecl-xdebug-2.8.0/include -I/tmp/B.axDX5m/BUILD/php74-pecl-xdebug-2.8.0/main -I/tmp/B.axDX5m/BUILD/php74-pecl-xdebug-2.8.0 -I/usr/include/php -I/usr/include/php/main -I/usr/include/php/TSRM -I/usr/include/php/Zend -I/usr/include/php/ext -I/usr/include/php/ext/date/lib -DHAVE_CONFIG_H -O2 -fwrapv -pipe -Wformat -Werror=format-security -gdwarf-4 -fno-debug-types-section -fvar-tracking-assignments -g2 -Wp,-D_FORTIFY_SOURCE=2 -fstack-protector-strong --param=ssp-buffer-size=4 -Werror=trampolines -fomit-frame-pointer -march=i686 -fasynchronous-unwind-tables -mtune=pentium4 -gdwarf-4 -fno-debug-types-section -fvar-tracking-assignments -g2 -c /tmp/B.axDX5m/BUILD/php74-pecl-xdebug-2.8.0/xdebug_com.c -fPIC -DPIC -o .libs/xdebug_com.o /bin/sh /tmp/B.axDX5m/BUILD/php74-pecl-xdebug-2.8.0/libtool --mode=compile i686-pld-linux-gcc -I. -I/tmp/B.axDX5m/BUILD/php74-pecl-xdebug-2.8.0 -DPHP_ATOM_INC -I/tmp/B.axDX5m/BUILD/php74-pecl-xdebug-2.8.0/include -I/tmp/B.axDX5m/BUILD/php74-pecl-xdebug-2.8.0/main -I/tmp/B.axDX5m/BUILD/php74-pecl-xdebug-2.8.0 -I/usr/include/php -I/usr/include/php/main -I/usr/include/php/TSRM -I/usr/include/php/Zend -I/usr/include/php/ext -I/usr/include/php/ext/date/lib -DHAVE_CONFIG_H -O2 -fwrapv -pipe -Wformat -Werror=format-security -gdwarf-4 -fno-debug-types-section -fvar-tracking-assignments -g2 -Wp,-D_FORTIFY_SOURCE=2 -fstack-protector-strong --param=ssp-buffer-size=4 -Werror=trampolines -fomit-frame-pointer -march=i686 -fasynchronous-unwind-tables -mtune=pentium4 -gdwarf-4 -fno-debug-types-section -fvar-tracking-assignments -g2 -c /tmp/B.axDX5m/BUILD/php74-pecl-xdebug-2.8.0/xdebug_compat.c -o xdebug_compat.lo libtool: compile: i686-pld-linux-gcc -I. -I/tmp/B.axDX5m/BUILD/php74-pecl-xdebug-2.8.0 -DPHP_ATOM_INC -I/tmp/B.axDX5m/BUILD/php74-pecl-xdebug-2.8.0/include -I/tmp/B.axDX5m/BUILD/php74-pecl-xdebug-2.8.0/main -I/tmp/B.axDX5m/BUILD/php74-pecl-xdebug-2.8.0 -I/usr/include/php -I/usr/include/php/main -I/usr/include/php/TSRM -I/usr/include/php/Zend -I/usr/include/php/ext -I/usr/include/php/ext/date/lib -DHAVE_CONFIG_H -O2 -fwrapv -pipe -Wformat -Werror=format-security -gdwarf-4 -fno-debug-types-section -fvar-tracking-assignments -g2 -Wp,-D_FORTIFY_SOURCE=2 -fstack-protector-strong --param=ssp-buffer-size=4 -Werror=trampolines -fomit-frame-pointer -march=i686 -fasynchronous-unwind-tables -mtune=pentium4 -gdwarf-4 -fno-debug-types-section -fvar-tracking-assignments -g2 -c /tmp/B.axDX5m/BUILD/php74-pecl-xdebug-2.8.0/xdebug_compat.c -fPIC -DPIC -o .libs/xdebug_compat.o /bin/sh /tmp/B.axDX5m/BUILD/php74-pecl-xdebug-2.8.0/libtool --mode=compile i686-pld-linux-gcc -I. -I/tmp/B.axDX5m/BUILD/php74-pecl-xdebug-2.8.0 -DPHP_ATOM_INC -I/tmp/B.axDX5m/BUILD/php74-pecl-xdebug-2.8.0/include -I/tmp/B.axDX5m/BUILD/php74-pecl-xdebug-2.8.0/main -I/tmp/B.axDX5m/BUILD/php74-pecl-xdebug-2.8.0 -I/usr/include/php -I/usr/include/php/main -I/usr/include/php/TSRM -I/usr/include/php/Zend -I/usr/include/php/ext -I/usr/include/php/ext/date/lib -DHAVE_CONFIG_H -O2 -fwrapv -pipe -Wformat -Werror=format-security -gdwarf-4 -fno-debug-types-section -fvar-tracking-assignments -g2 -Wp,-D_FORTIFY_SOURCE=2 -fstack-protector-strong --param=ssp-buffer-size=4 -Werror=trampolines -fomit-frame-pointer -march=i686 -fasynchronous-unwind-tables -mtune=pentium4 -gdwarf-4 -fno-debug-types-section -fvar-tracking-assignments -g2 -c /tmp/B.axDX5m/BUILD/php74-pecl-xdebug-2.8.0/xdebug_handler_dbgp.c -o xdebug_handler_dbgp.lo libtool: compile: i686-pld-linux-gcc -I. -I/tmp/B.axDX5m/BUILD/php74-pecl-xdebug-2.8.0 -DPHP_ATOM_INC -I/tmp/B.axDX5m/BUILD/php74-pecl-xdebug-2.8.0/include -I/tmp/B.axDX5m/BUILD/php74-pecl-xdebug-2.8.0/main -I/tmp/B.axDX5m/BUILD/php74-pecl-xdebug-2.8.0 -I/usr/include/php -I/usr/include/php/main -I/usr/include/php/TSRM -I/usr/include/php/Zend -I/usr/include/php/ext -I/usr/include/php/ext/date/lib -DHAVE_CONFIG_H -O2 -fwrapv -pipe -Wformat -Werror=format-security -gdwarf-4 -fno-debug-types-section -fvar-tracking-assignments -g2 -Wp,-D_FORTIFY_SOURCE=2 -fstack-protector-strong --param=ssp-buffer-size=4 -Werror=trampolines -fomit-frame-pointer -march=i686 -fasynchronous-unwind-tables -mtune=pentium4 -gdwarf-4 -fno-debug-types-section -fvar-tracking-assignments -g2 -c /tmp/B.axDX5m/BUILD/php74-pecl-xdebug-2.8.0/xdebug_handler_dbgp.c -fPIC -DPIC -o .libs/xdebug_handler_dbgp.o error: Bad exit status from /tmp/B.axDX5m/BUILD/tmp/rpm-tmp.30294 (%build) RPM build errors: Bad exit status from /tmp/B.axDX5m/BUILD/tmp/rpm-tmp.30294 (%build) ended at: Tue Aug 6 14:44:33 2019, done in 0:00:05.891671 error: No files produced. + chmod -R u+rwX /tmp/B.axDX5m/BUILD + rm -rf /tmp/B.axDX5m/tmp /tmp/B.axDX5m/BUILD + rm -rf /tmp/B.axDX5m Begin-PLD-Builder-Info Build-Time: user:15.29s sys:2.32s real:24.43s (faults io:0 non-io:805677) End-PLD-Builder-Info
[Back to list of logs] [View rpm -qa of builder]