FailedOk

th/SRPMS[OK]
th/x32[OK]
th/i686[OK]
th/x86_64[OK]

ac/SRPMS[OK]
ac/i386[OK]
ac/i586[OK]
ac/i686[OK]
ac/alpha[OK]
ac/amd64[OK]
ac/athlon[OK]
ac/ppc[OK]
ac/sparc[OK]
ac/sparc64[OK]

Advanced Search
main()
Powered by PLD Linux
(c) 2002-2021 PLD Team
$Revision: 1.37 $
Powered by The Right Thing.
Your IP: 3.239.40.250

php-pecl-zstd 1509ea3a-369e-4123-831b-3f7d5c44f822

Status:Failed
Source URL:https://buildlogs.pld-linux.org/pld/th/i686/FAIL/php-pecl-zstd,1509ea3a-369e-4123-831b-3f7d5c44f822.bz2
text/plain URL:View!
rpm -qa of builder:View!
Date:2021/01/03 12:14:32
Runtime:0:00:06.004209

Toc:

  • error 1
  • rpm: error: Failed build dependencies:
  • error 2
  • rpm: error: Failed build dependencies:
  • prep
  • Executing(%prep): /bin/sh -e /tmp/B.qpzVY7/BUILD/tmp/rpm-tmp.15293
  • build
  • Executing(%build): /bin/sh -e /tmp/B.qpzVY7/BUILD/tmp/rpm-tmp.15293
  • error 3
  • error: Bad exit status from /tmp/B.qpzVY7/BUILD/tmp/rpm-tmp.15293 (%build)
  • error 4
  • RPM build errors:
  • error 5
  • error: No files produced.

Content:

request from: glen
checking if we should skip the build
started at: Sun Jan  3 12:14:09 2021
killing old processes on a builder
sending signal 9 to pid -1
cleaning up /tmp
fetching https://srcbuilder.pld-linux.org/th//srpms/1509ea3a-369e-4123-831b-3f7d5c44f822/php71-pecl-zstd-0.9.0-1.src.rpm
fetched 309177 bytes, 739.7 K/s
installing srpm: php71-pecl-zstd-0.9.0-1.src.rpm
+ install -d /tmp/B.qpzVY7/BUILD /tmp/B.qpzVY7/RPMS
+ LC_ALL=en_US.UTF-8
+ rpm -qp --changelog php71-pecl-zstd-0.9.0-1.src.rpm
* Sun Jan 03 2021 PLD Linux Team <feedback@pld-linux.org>
- For complete changelog see: http://git.pld-linux.org/?p=packages/php-pecl-zstd.git;a=log;h=master
* Sun Jan 03 2021 Elan Ruusamäe <glen@pld-linux.org> 9a6fa29
- One more reference * Sun Jan 03 2021 Elan Ruusamäe <glen@pld-linux.org> 9b6fcb8
- The php8 difference fixed identically at upstream: * Sun Jan 03 2021 Elan Ruusamäe <glen@pld-linux.org> e3fc40e
- Update php8 argument/parameter difference * Sun Jan 03 2021 Elan Ruusamäe <glen@pld-linux.org> 732aa0a
- Up to 0.9.0 * Fri Mar 20 2020 Elan Ruusamäe <glen@pld-linux.org> d9f32f4
- XFAIL tests failing on x32 * Thu Mar 19 2020 Elan Ruusamäe <glen@pld-linux.org> 720a779
- Disable online tests for pld-builders * Thu Mar 19 2020 Elan Ruusamäe <glen@pld-linux.org> 043b5a6
- Add tests_online bcond * Thu Mar 19 2020 Elan Ruusamäe <glen@pld-linux.org> 2c573e8
- Include openssl ext for testing * Mon Mar 16 2020 Elan Ruusamäe <glen@pld-linux.org> eaab609
- Skip tests/008.phpt test * Tue Mar 17 2020 Elan Ruusamäe <glen@pld-linux.org> b2a7960
- tests/streams_6.php requires openssl for https stream * Mon Mar 16 2020 Elan Ruusamäe <glen@pld-linux.org> 36ee533
- Run unit tests * Mon Mar 16 2020 Elan Ruusamäe <glen@pld-linux.org> f13d719
- Skip -devel package * Mon Mar 16 2020 Elan Ruusamäe <glen@pld-linux.org> c66b7e5
- Build using system zstd-devel * Mon Mar 16 2020 Elan Ruusamäe <glen@pld-linux.org> 260423e
- New, version 0.8.0 + rpm -Uhv --nodeps --define '_topdir /tmp/B.qpzVY7' --define '_specdir %{_topdir}' --define '_sourcedir %{_specdir}' --define '_rpmdir %{_topdir}/RPMS' --define '_builddir %{_topdir}/BUILD' --define 'php_suffix 71' php71-pecl-zstd-0.9.0-1.src.rpm Preparing... ################################################## php71-pecl-zstd ################################################## + rm -f php71-pecl-zstd-0.9.0-1.src.rpm + install -m 700 -d /tmp/B.qpzVY7/BUILD/tmp + TMPDIR=/tmp/B.qpzVY7/BUILD/tmp + exec nice -n 0 rpmbuild -bp --short-circuit --nodeps --define '_topdir /tmp/B.qpzVY7' --define '_specdir %{_topdir}' --define '_sourcedir %{_specdir}' --define '_rpmdir %{_topdir}/RPMS' --define '_builddir %{_topdir}/BUILD' --target i686-pld-linux --define 'php_suffix 71' --define 'prep exit 0' /tmp/B.qpzVY7/php-pecl-zstd.spec sh: php-config: inaccessible or not found warning: %changelog not in descending chronological order Building target platforms: i686-pld-linux checking BuildConflict-ing packages no BuildConflicts found checking BR rpm: sh: php-config: inaccessible or not found rpm: warning: %changelog not in descending chronological order rpm: error: Failed build dependencies: rpm: php71-cli is needed by php71-pecl-zstd-0.9.0-1.src rpm: php71-devel is needed by php71-pecl-zstd-0.9.0-1.src rpm: php71-openssl is needed by php71-pecl-zstd-0.9.0-1.src rpm: php71-pcre is needed by php71-pecl-zstd-0.9.0-1.src rpm: Building target platforms: i686-pld-linux updating poldek cache... ready is up to date th is up to date th is up to date th-ready is up to date th-ready is up to date th-test is up to date th-test is up to date checking conflicting packages in BRed packages poldek: Loading [pndir]ready... poldek: Loading [pndir]th-test... poldek: Loading [pndir]th-test... poldek: Loading [pndir]th-ready... poldek: Loading [pndir]th-ready... poldek: Loading [pndir]th... poldek: Loading [pndir]th... poldek: 31068 packages read poldek: Removed 2313 duplicate packages from available set poldek: Processing dependencies... poldek: php71-pcre-7.1.33-3.i686 marks php71-common-7.1.33-3.i686 (cap /etc/php71/conf.d) poldek: There are 5 packages to install (1 marked by dependencies): poldek: A php71-cli-7.1.33-3.i686 php71-common-7.1.33-3.i686 poldek: A php71-devel-7.1.33-3.i686 php71-openssl-7.1.33-3.i686 poldek: A php71-pcre-7.1.33-3.i686 poldek: This operation will use 8.2MB of disk space. poldek: Need to get 1.7MB of archives (1.7MB to download). poldek: poldek: Retrieving [1/5] th::php71-common-7.1.33-3.i686.rpm........................................done poldek: Retrieving [2/5] th::php71-cli-7.1.33-3.i686.rpm...........................................done poldek: Retrieving [3/5] th::php71-devel-7.1.33-3.i686.rpm.........................................done poldek: Retrieving [4/5] th::php71-openssl-7.1.33-3.i686.rpm.......................................done poldek: Retrieving [5/5] th::php71-pcre-7.1.33-3.i686.rpm..........................................done poldek: Executing pm-command.sh --upgrade -vh --test --root / --define _check_dirname_deps 1... poldek: Preparing... ################################################## no conflicts found checking BR rpm: sh: php-config: inaccessible or not found rpm: warning: %changelog not in descending chronological order rpm: error: Failed build dependencies: rpm: php71-cli is needed by php71-pecl-zstd-0.9.0-1.src rpm: php71-devel is needed by php71-pecl-zstd-0.9.0-1.src rpm: php71-openssl is needed by php71-pecl-zstd-0.9.0-1.src rpm: php71-pcre is needed by php71-pecl-zstd-0.9.0-1.src rpm: Building target platforms: i686-pld-linux installing BR: php71\-openssl php71\-devel php71\-pcre php71\-cli + poldek --noask --caplookup -Q -v '--ignore=hhvm-*' '--ignore=php4-*' '--ignore=php52-*' '--ignore=php53-*' '--ignore=php54-*' '--ignore=php55-*' '--ignore=php56-*' '--ignore=php70-*' '--ignore=php72-*' '--ignore=php73-*' '--ignore=php74-*' '--ignore=php80-*' --upgrade php71-openssl php71-devel php71-pcre php71-cli Loading [pndir]ready... Loading [pndir]th-test... Loading [pndir]th-test... Loading [pndir]th-ready... Loading [pndir]th-ready... Loading [pndir]th... Loading [pndir]th... 31068 packages read Removed 2313 duplicate packages from available set Processing dependencies... php71-pcre-7.1.33-3.i686 marks php71-common-7.1.33-3.i686 (cap /etc/php71/conf.d) There are 5 packages to install (1 marked by dependencies): A php71-cli-7.1.33-3.i686 php71-common-7.1.33-3.i686 A php71-devel-7.1.33-3.i686 php71-openssl-7.1.33-3.i686 A php71-pcre-7.1.33-3.i686 This operation will use 8.2MB of disk space. Need to get 1.7MB of archives. Executing pm-command.sh --upgrade -vh --root / --define _check_dirname_deps 1... Preparing... ################################################## php71-common ################################################## php71-cli ################################################## php71-devel ################################################## php71-openssl ################################################## php71-pcre ################################################## building RPM using: set -ex; : build-id: 1509ea3a-369e-4123-831b-3f7d5c44f822; TMPDIR=/tmp/B.qpzVY7/BUILD/tmp exec nice -n 0 rpmbuild -bb --define '_smp_mflags -j9' --define '_make_opts -Otarget' --define '_pld_builder 1' --define '_topdir /tmp/B.qpzVY7' --define '_specdir %{_topdir}' --define '_sourcedir %{_specdir}' --define '_rpmdir %{_topdir}/RPMS' --define '_builddir %{_topdir}/BUILD' --target i686-pld-linux --define 'php_suffix 71' /tmp/B.qpzVY7/php-pecl-zstd.spec + : build-id: 1509ea3a-369e-4123-831b-3f7d5c44f822 + TMPDIR=/tmp/B.qpzVY7/BUILD/tmp + exec nice -n 0 rpmbuild -bb --define '_smp_mflags -j9' --define '_make_opts -Otarget' --define '_pld_builder 1' --define '_topdir /tmp/B.qpzVY7' --define '_specdir %{_topdir}' --define '_sourcedir %{_specdir}' --define '_rpmdir %{_topdir}/RPMS' --define '_builddir %{_topdir}/BUILD' --target i686-pld-linux --define 'php_suffix 71' /tmp/B.qpzVY7/php-pecl-zstd.spec warning: %changelog not in descending chronological order Building target platforms: i686-pld-linux Executing(%prep): /bin/sh -e /tmp/B.qpzVY7/BUILD/tmp/rpm-tmp.15293 + umask 022 + cd /tmp/B.qpzVY7/BUILD + cd /tmp/B.qpzVY7/BUILD + rm -rf php71-pecl-zstd-0.9.0 + /bin/mkdir -p php71-pecl-zstd-0.9.0 + cd php71-pecl-zstd-0.9.0 + /bin/gzip -dc /tmp/B.qpzVY7/zstd-0.9.0.tgz + /bin/tar -xf - + STATUS=0 + '[' 0 -ne 0 ']' + /bin/id -u + '[' 1001 '=' 0 ']' + /bin/id -u + '[' 1001 '=' 0 ']' + /bin/chmod -Rf a+rX,u+w,g-w,o-w . + mv zstd-0.9.0/LICENSE zstd-0.9.0/README.md zstd-0.9.0/config.m4 zstd-0.9.0/config.w32 zstd-0.9.0/php_zstd.h zstd-0.9.0/tests zstd-0.9.0/zstd zstd-0.9.0/zstd.c . + echo 'Patch #0 (php8-argument.patch):' Patch #0 (php8-argument.patch): + '[' -f /tmp/B.qpzVY7/php8-argument.patch ']' + /bin/cat /tmp/B.qpzVY7/php8-argument.patch + /usr/bin/patch -s -p1 + rm -r zstd + <<"EOF" #!/bin/sh export NO_INTERACTION=1 REPORT_EXIT_STATUS=1 MALLOC_CHECK_=2 exec /usr/bin/make -Otarget -j9 test \ PHP_EXECUTABLE=/usr/bin/php71 \ PHP_TEST_SHARED_SYSTEM_EXTENSIONS="openssl" \ RUN_TESTS_SETTINGS="-q $*" EOF + >run-tests.sh + cat + chmod +x run-tests.sh + <<"EOF" zstd_compress(): compress level [tests/008.phpt] EOF + read line + t='tests/008.phpt]' + t=tests/008.phpt + xfail tests/008.phpt + typeset 't=tests/008.phpt' + test -f tests/008.phpt + >>tests/008.phpt + <<-EOF --XFAIL-- Skip EOF + cat + read line + exit 0 Executing(%build): /bin/sh -e /tmp/B.qpzVY7/BUILD/tmp/rpm-tmp.15293 TMP=/home/users/builder/tmp HOME=/home/users/builder PATH=/home/users/builder/GNUstep/Tools:/bin:/usr/bin:/usr/local/bin:/home/users/builder/bin TMPDIR=/tmp/B.qpzVY7/BUILD/tmp + umask 022 + cd /tmp/B.qpzVY7/BUILD + cd php71-pecl-zstd-0.9.0 + phpize Configuring for: PHP Api Version: 20160303 Zend Module Api No: 20160303 Zend Extension Api No: 320160303 + ./configure 'LDFLAGS=-Wl,--as-needed -Wl,--no-copy-dt-needed-entries -Wl,-z,relro -Wl,-z,combreloc ' 'CFLAGS=-O2 -fwrapv -pipe -Wformat -Werror=format-security -gdwarf-4 -fno-debug-types-section -fvar-tracking-assignments -g2 -Wp,-D_FORTIFY_SOURCE=2 -fstack-protector-strong --param=ssp-buffer-size=4 -Werror=trampolines -fomit-frame-pointer -march=i686 -fasynchronous-unwind-tables -mtune=pentium4 -gdwarf-4 -fno-debug-types-section -fvar-tracking-assignments -g2 ' 'CXXFLAGS=-O2 -fwrapv -pipe -Wformat -Werror=format-security -gdwarf-4 -fno-debug-types-section -fvar-tracking-assignments -g2 -Wp,-D_FORTIFY_SOURCE=2 -fstack-protector-strong --param=ssp-buffer-size=4 -Werror=trampolines -fomit-frame-pointer -march=i686 -fasynchronous-unwind-tables -mtune=pentium4 -gdwarf-4 -fno-debug-types-section -fvar-tracking-assignments -g2 ' 'FFLAGS=-O2 -fwrapv -pipe -Wformat -Werror=format-security -gdwarf-4 -fno-debug-types-section -fvar-tracking-assignments -g2 -Wp,-D_FORTIFY_SOURCE=2 -fstack-protector-strong --param=ssp-buffer-size=4 -Werror=trampolines -fomit-frame-pointer -march=i686 -fasynchronous-unwind-tables -mtune=pentium4 -gdwarf-4 -fno-debug-types-section -fvar-tracking-assignments -g2 ' 'FCFLAGS=-O2 -fwrapv -pipe -Wformat -Werror=format-security -gdwarf-4 -fno-debug-types-section -fvar-tracking-assignments -g2 -Wp,-D_FORTIFY_SOURCE=2 -fstack-protector-strong --param=ssp-buffer-size=4 -Werror=trampolines -fomit-frame-pointer -march=i686 -fasynchronous-unwind-tables -mtune=pentium4 -gdwarf-4 -fno-debug-types-section -fvar-tracking-assignments -g2 ' 'CPPFLAGS=' 'CC=i686-pld-linux-gcc' 'CXX=i686-pld-linux-g++' '--host=i686-pld-linux' '--build=i686-pld-linux' '--prefix=/usr' '--exec-prefix=/usr' '--bindir=/usr/bin' '--sbindir=/usr/sbin' '--sysconfdir=/etc' '--datadir=/usr/share' '--includedir=/usr/include' '--libdir=/usr/lib' '--libexecdir=/usr/libexec' '--localstatedir=/var' '--sharedstatedir=/var/lib' '--mandir=/usr/share/man' '--infodir=/usr/share/info' '--x-libraries=/usr/lib' --with-libzstd checking for grep that handles long lines and -e... /bin/grep checking for egrep... /bin/grep -E checking for a sed that does not truncate output... /bin/sed checking for i686-pld-linux-cc... i686-pld-linux-gcc checking whether the C compiler works... yes checking for C compiler default output file name... a.out checking for suffix of executables... checking whether we are cross compiling... no checking for suffix of object files... o checking whether we are using the GNU C compiler... yes checking whether i686-pld-linux-gcc accepts -g... yes checking for i686-pld-linux-gcc option to accept ISO C89... none needed checking how to run the C preprocessor... i686-pld-linux-gcc -E checking for icc... no checking for suncc... no checking whether i686-pld-linux-gcc and cc understand -c and -o together... yes checking for system library directory... lib checking if compiler supports -R... no checking if compiler supports -Wl,-rpath,... yes checking build system type... i686-pld-linux-gnu checking host system type... i686-pld-linux-gnu checking target system type... i686-pld-linux-gnu checking for PHP prefix... /usr checking for PHP includes... -I/usr/include/php -I/usr/include/php/main -I/usr/include/php/TSRM -I/usr/include/php/Zend -I/usr/include/php/ext -I/usr/include/php/ext/date/lib checking for PHP extension directory... /usr/lib/php71 checking for PHP installed headers prefix... /usr/include/php checking if debug is enabled... no checking if zts is enabled... no checking for re2c... re2c checking for re2c version... 1.2 (ok) checking for gawk... gawk checking PHP version... 7.1.33 checking whether to enable zstd support... yes, shared checking whether to use system zstd library... yes checking for pkg-config... /usr/bin/pkg-config checking for libzstd... from pkgconfig: version 1.4.5 checking whether to enable coverage support... no checking how to print strings... print -r checking for a sed that does not truncate output... (cached) /bin/sed checking for fgrep... /bin/grep -F checking for ld used by i686-pld-linux-gcc... /usr/bin/ld checking if the linker (/usr/bin/ld) is GNU ld... yes checking for BSD- or MS-compatible name lister (nm)... /usr/bin/nm -B checking the name lister (/usr/bin/nm -B) interface... BSD nm checking whether ln -s works... yes checking the maximum length of command line arguments... 1572864 checking how to convert i686-pld-linux-gnu file names to i686-pld-linux-gnu format... func_convert_file_noop checking how to convert i686-pld-linux-gnu file names to toolchain format... func_convert_file_noop checking for /usr/bin/ld option to reload object files... -r checking for i686-pld-linux-objdump... no checking for objdump... objdump checking how to recognize dependent libraries... pass_all checking for i686-pld-linux-dlltool... no checking for dlltool... no checking how to associate runtime and link libraries... print -r -- checking for i686-pld-linux-ar... no checking for ar... ar checking for archiver @FILE support... @ checking for i686-pld-linux-strip... no checking for strip... strip checking for i686-pld-linux-ranlib... no checking for ranlib... ranlib checking for mawk... (cached) gawk checking command to parse /usr/bin/nm -B output from i686-pld-linux-gcc object... ok checking for sysroot... no checking for a working dd... /bin/dd checking how to truncate binary pipes... /bin/dd bs=4096 count=1 checking for i686-pld-linux-mt... no checking for mt... no checking if : is a manifest tool... no checking for ANSI C header files... yes checking for sys/types.h... yes checking for sys/stat.h... yes checking for stdlib.h... yes checking for string.h... yes checking for memory.h... yes checking for strings.h... yes checking for inttypes.h... yes checking for stdint.h... yes checking for unistd.h... yes checking for dlfcn.h... yes checking for objdir... .libs checking if i686-pld-linux-gcc supports -fno-rtti -fno-exceptions... no checking for i686-pld-linux-gcc option to produce PIC... -fPIC -DPIC checking if i686-pld-linux-gcc PIC flag -fPIC -DPIC works... yes checking if i686-pld-linux-gcc static flag -static works... yes checking if i686-pld-linux-gcc supports -c -o file.o... yes checking if i686-pld-linux-gcc supports -c -o file.o... (cached) yes checking whether the i686-pld-linux-gcc linker (/usr/bin/ld) supports shared libraries... yes checking whether -lc should be explicitly linked in... no checking dynamic linker characteristics... GNU/Linux ld.so checking how to hardcode library paths into programs... immediate checking whether stripping libraries is possible... yes checking if libtool supports shared libraries... yes checking whether to build shared libraries... yes checking whether to build static libraries... no configure: creating ./config.status config.status: creating config.h config.status: executing libtool commands + /usr/bin/make -Otarget -j9 /bin/sh /tmp/B.qpzVY7/BUILD/php71-pecl-zstd-0.9.0/libtool --mode=compile i686-pld-linux-gcc -I. -I/tmp/B.qpzVY7/BUILD/php71-pecl-zstd-0.9.0 -DPHP_ATOM_INC -I/tmp/B.qpzVY7/BUILD/php71-pecl-zstd-0.9.0/include -I/tmp/B.qpzVY7/BUILD/php71-pecl-zstd-0.9.0/main -I/tmp/B.qpzVY7/BUILD/php71-pecl-zstd-0.9.0 -I/usr/include/php -I/usr/include/php/main -I/usr/include/php/TSRM -I/usr/include/php/Zend -I/usr/include/php/ext -I/usr/include/php/ext/date/lib -I/usr/local/include -DHAVE_CONFIG_H -O2 -fwrapv -pipe -Wformat -Werror=format-security -gdwarf-4 -fno-debug-types-section -fvar-tracking-assignments -g2 -Wp,-D_FORTIFY_SOURCE=2 -fstack-protector-strong --param=ssp-buffer-size=4 -Werror=trampolines -fomit-frame-pointer -march=i686 -fasynchronous-unwind-tables -mtune=pentium4 -gdwarf-4 -fno-debug-types-section -fvar-tracking-assignments -g2 -c /tmp/B.qpzVY7/BUILD/php71-pecl-zstd-0.9.0/zstd.c -o zstd.lo libtool: compile: i686-pld-linux-gcc -I. -I/tmp/B.qpzVY7/BUILD/php71-pecl-zstd-0.9.0 -DPHP_ATOM_INC -I/tmp/B.qpzVY7/BUILD/php71-pecl-zstd-0.9.0/include -I/tmp/B.qpzVY7/BUILD/php71-pecl-zstd-0.9.0/main -I/tmp/B.qpzVY7/BUILD/php71-pecl-zstd-0.9.0 -I/usr/include/php -I/usr/include/php/main -I/usr/include/php/TSRM -I/usr/include/php/Zend -I/usr/include/php/ext -I/usr/include/php/ext/date/lib -I/usr/local/include -DHAVE_CONFIG_H -O2 -fwrapv -pipe -Wformat -Werror=format-security -gdwarf-4 -fno-debug-types-section -fvar-tracking-assignments -g2 -Wp,-D_FORTIFY_SOURCE=2 -fstack-protector-strong --param=ssp-buffer-size=4 -Werror=trampolines -fomit-frame-pointer -march=i686 -fasynchronous-unwind-tables -mtune=pentium4 -gdwarf-4 -fno-debug-types-section -fvar-tracking-assignments -g2 -c /tmp/B.qpzVY7/BUILD/php71-pecl-zstd-0.9.0/zstd.c -fPIC -DPIC -o .libs/zstd.o /bin/sh /tmp/B.qpzVY7/BUILD/php71-pecl-zstd-0.9.0/libtool --mode=link i686-pld-linux-gcc -DPHP_ATOM_INC -I/tmp/B.qpzVY7/BUILD/php71-pecl-zstd-0.9.0/include -I/tmp/B.qpzVY7/BUILD/php71-pecl-zstd-0.9.0/main -I/tmp/B.qpzVY7/BUILD/php71-pecl-zstd-0.9.0 -I/usr/include/php -I/usr/include/php/main -I/usr/include/php/TSRM -I/usr/include/php/Zend -I/usr/include/php/ext -I/usr/include/php/ext/date/lib -I/usr/local/include -DHAVE_CONFIG_H -O2 -fwrapv -pipe -Wformat -Werror=format-security -gdwarf-4 -fno-debug-types-section -fvar-tracking-assignments -g2 -Wp,-D_FORTIFY_SOURCE=2 -fstack-protector-strong --param=ssp-buffer-size=4 -Werror=trampolines -fomit-frame-pointer -march=i686 -fasynchronous-unwind-tables -mtune=pentium4 -gdwarf-4 -fno-debug-types-section -fvar-tracking-assignments -g2 -Wl,--as-needed -Wl,--no-copy-dt-needed-entries -Wl,-z,relro -Wl,-z,combreloc -o zstd.la -export-dynamic -avoid-version -prefer-pic -module -rpath /tmp/B.qpzVY7/BUILD/php71-pecl-zstd-0.9.0/modules zstd.lo -Wl,-rpath,/usr/local/lib -L/usr/local/lib -lzstd libtool: link: i686-pld-linux-gcc -shared -fPIC -DPIC -O2 -gdwarf-4 -g2 -fstack-protector-strong -march=i686 -mtune=pentium4 -gdwarf-4 -g2 -Wl,--as-needed -Wl,--no-copy-dt-needed-entries -Wl,-z -Wl,relro -Wl,-z -Wl,combreloc -Wl,-rpath -Wl,/usr/local/lib .libs/zstd.o -L/usr/local/lib -lzstd -Wl,-soname -Wl,zstd.so -o .libs/zstd.so libtool: link: ( cd ".libs" && rm -f "zstd.la" && ln -s "../zstd.la" "zstd.la" ) /bin/sh /tmp/B.qpzVY7/BUILD/php71-pecl-zstd-0.9.0/libtool --mode=install cp ./zstd.la /tmp/B.qpzVY7/BUILD/php71-pecl-zstd-0.9.0/modules libtool: install: cp ./.libs/zstd.so /tmp/B.qpzVY7/BUILD/php71-pecl-zstd-0.9.0/modules/zstd.so libtool: install: cp ./.libs/zstd.lai /tmp/B.qpzVY7/BUILD/php71-pecl-zstd-0.9.0/modules/zstd.la libtool: finish: PATH="/home/users/builder/GNUstep/Tools:/bin:/usr/bin:/usr/local/bin:/home/users/builder/bin:/sbin" ldconfig -n /tmp/B.qpzVY7/BUILD/php71-pecl-zstd-0.9.0/modules ---------------------------------------------------------------------- Libraries have been installed in: /tmp/B.qpzVY7/BUILD/php71-pecl-zstd-0.9.0/modules If you ever happen to want to link against installed libraries in a given directory, LIBDIR, you must either use libtool, and specify the full pathname of the library, or use the '-LLIBDIR' flag during linking and do at least one of the following: - add LIBDIR to the 'LD_LIBRARY_PATH' environment variable during execution - add LIBDIR to the 'LD_RUN_PATH' environment variable during linking - use the '-Wl,-rpath -Wl,LIBDIR' linker flag - have your system administrator add LIBDIR to '/etc/ld.so.conf' See any operating system documentation about shared libraries for more information, such as the ld(1) and ld.so(8) manual pages. ---------------------------------------------------------------------- Build complete. Don't forget to run 'make test'. + >modules.log + /usr/bin/php71 -n -q -d 'extension_dir=modules' -d 'extension=zstd.so' -m + grep zstd modules.log zstd + SKIP_ONLINE_TESTS=1 ./run-tests.sh --show-diff Build complete. Don't forget to run 'make test'. ===================================================================== PHP : /usr/bin/php71 PHP_SAPI : cli PHP_VERSION : 7.1.33 ZEND_VERSION: 3.1.0 PHP_OS : Linux - Linux nereid 5.9.3-1 #1 SMP Tue Nov 3 19:26:12 CET 2020 i686 INI actual : /tmp/B.qpzVY7/BUILD/php71-pecl-zstd-0.9.0/tmp-php.ini More .INIs : CWD : /tmp/B.qpzVY7/BUILD/php71-pecl-zstd-0.9.0 Extra dirs : VALGRIND : Not used ===================================================================== TIME START 2021-01-03 12:14:31 ===================================================================== TEST 1/25 [tests/001.phpt] PASS zstd_compress(): basic functionality [tests/001.phpt] TEST 2/25 [tests/002.phpt] PASS zstd_compress(): error conditions [tests/002.phpt] TEST 3/25 [tests/002_b.phpt] SKIP zstd_compress(): error conditions [tests/002_b.phpt] reason: requires PHP 8.0+ TEST 4/25 [tests/003.phpt] PASS zstd_compress(): variation [tests/003.phpt] TEST 5/25 [tests/004.phpt] PASS zstd_uncompress(): basic functionality [tests/004.phpt] TEST 6/25 [tests/005.phpt] PASS zstd_uncompress(): error conditions [tests/005.phpt] TEST 7/25 [tests/005_b.phpt] SKIP zstd_uncompress(): error conditions [tests/005_b.phpt] reason: requires PHP 8.0+ TEST 8/25 [tests/006.phpt] PASS unexpected exiting when uncompress the wrong format data [tests/006.phpt] TEST 9/25 [tests/007.phpt] PASS namespace: Zstd\compress()/uncompress() [tests/007.phpt] TEST 10/25 [tests/008.phpt] SKIP zstd_compress(): compress level [tests/008.phpt] reason: needs libzstd 1.3.1 or older TEST 11/25 [tests/008_b.phpt] SKIP zstd_compress(): compress level [tests/008_b.phpt] reason: needs libzstd 1.3.[2-3] TEST 12/25 [tests/009.phpt] PASS zstd_compress(): compress level [tests/009.phpt] TEST 13/25 [tests/010.phpt] PASS zstd_uncompress(): streaming archive [tests/010.phpt] TEST 14/25 [tests/011.phpt] PASS compress level constants [tests/011.phpt] TEST 15/25 [tests/alias.phpt] PASS alias functionality [tests/alias.phpt] TEST 16/25 [tests/dictionary.phpt] PASS zstd_compress_dict(): basic functionality [tests/dictionary.phpt] TEST 17/25 [tests/info.phpt] PASS phpinfo() displays zstd info [tests/info.phpt] TEST 18/25 [tests/streams_1.phpt] PASS compress.zstd streams basic [tests/streams_1.phpt] TEST 19/25 [tests/streams_2.phpt] PASS compress.zstd streams and compatibility [tests/streams_2.phpt] TEST 20/25 [tests/streams_3.phpt] PASS compress.zstd streams and big file [tests/streams_3.phpt] TEST 21/25 [tests/streams_4.phpt] PASS compress.zstd streams with file functions [tests/streams_4.phpt] TEST 22/25 [tests/streams_5.phpt] PASS compress.zstd streams with dictionary [tests/streams_5.phpt] TEST 23/25 [tests/streams_6.phpt] ========DIFF======== 001+ Warning: readfile(): php_network_getaddresses: getaddrinfo failed: Temporary failure in name resolution in /tmp/B.qpzVY7/BUILD/php71-pecl-zstd-0.9.0/tests/streams_6.php on line 2 002+ 003+ Warning: readfile(https://github.com/kjdev/php-ext-zstd/raw/master/tests/streaming.zst): failed to open stream: php_network_getaddresses: getaddrinfo failed: Temporary failure in name resolution in /tmp/B.qpzVY7/BUILD/php71-pecl-zstd-0.9.0/tests/streams_6.php on line 2 004+ 005+ Warning: readfile(compress.zstd://https://github.com/kjdev/php-ext-zstd/raw/master/tests/streaming.zst): failed to open stream: operation failed in /tmp/B.qpzVY7/BUILD/php71-pecl-zstd-0.9.0/tests/streams_6.php on line 2 006+ 001- X ========DONE======== FAIL compress.zstd read online stream [tests/streams_6.phpt] TEST 24/25 [tests/streams_7.phpt] PASS compress.zstd read online stream denied [tests/streams_7.phpt] TEST 25/25 [tests/streams_8.phpt] PASS compress.zstd use include_path [tests/streams_8.phpt] ===================================================================== TIME END 2021-01-03 12:14:32 ===================================================================== TEST RESULT SUMMARY --------------------------------------------------------------------- Exts skipped : 0 Exts tested : 7 --------------------------------------------------------------------- Number of tests : 25 21 Tests skipped : 4 ( 16.0%) -------- Tests warned : 0 ( 0.0%) ( 0.0%) Tests failed : 1 ( 4.0%) ( 4.8%) Expected fail : 0 ( 0.0%) ( 0.0%) Tests passed : 20 ( 80.0%) ( 95.2%) --------------------------------------------------------------------- Time taken : 1 seconds ===================================================================== ===================================================================== FAILED TEST SUMMARY --------------------------------------------------------------------- compress.zstd read online stream [tests/streams_6.phpt] ===================================================================== make: *** [Makefile:151: test] Error 1 error: Bad exit status from /tmp/B.qpzVY7/BUILD/tmp/rpm-tmp.15293 (%build) RPM build errors: %changelog not in descending chronological order Bad exit status from /tmp/B.qpzVY7/BUILD/tmp/rpm-tmp.15293 (%build) ended at: Sun Jan 3 12:14:32 2021, done in 0:00:06.004209 error: No files produced. + chmod -R u+rwX /tmp/B.qpzVY7/BUILD + rm -rf /tmp/B.qpzVY7/tmp /tmp/B.qpzVY7/BUILD + rm -rf /tmp/B.qpzVY7 Begin-PLD-Builder-Info Build-Time: user:14.64s sys:3.75s real:23.73s (faults io:74491 non-io:767279) End-PLD-Builder-Info
[Back to list of logs] [View rpm -qa of builder]