FailedOk

th/SRPMS[OK]
th/x32[OK]
th/i686[OK]
th/x86_64[OK]

ac/SRPMS[OK]
ac/i386[OK]
ac/i586[OK]
ac/i686[OK]
ac/alpha[OK]
ac/amd64[OK]
ac/athlon[OK]
ac/ppc[OK]
ac/sparc[OK]
ac/sparc64[OK]

Advanced Search
main()
Powered by PLD Linux
(c) 2002-2018 PLD Team
$Revision: 1.37 $
Powered by matrix.
Your IP: 52.91.245.237

pixman 54567132-5b65-44e9-bbb6-5399bb098f68

Status:Failed
Source URL:ftp://buildlogs.pld-linux.org/th/i686/FAIL/pixman,54567132-5b65-44e9-bbb6-5399bb098f68.bz2
text/plain URL:View!
full text:View!
rpm -qa of builder:View!
Date:2018/11/30 22:28:56
Runtime:0:02:45.707235

Toc:

  • error 1
  • FAIL: composite
  • error 2
  • # XFAIL: 0
  • error 3
  • # FAIL: 1
  • error 4
  • # ERROR: 0
  • error 5
  • make[3]: *** [Makefile:1247: test-suite.log] Error 1
  • error 6
  • make[2]: *** [Makefile:1355: check-TESTS] Error 2
  • error 7
  • make[1]: *** [Makefile:1652: check-am] Error 2
  • error 8
  • error: Bad exit status from /tmp/B.xgSB_j/BUILD/tmp/rpm-tmp.1651 (%build)
  • error 9
  • RPM build errors:
  • error 10
  • error: No files produced.

Content:

make[2]: Leaving directory '/tmp/B.xgSB_j/BUILD/pixman-0.36.0/test'
make[2]: Entering directory '/tmp/B.xgSB_j/BUILD/pixman-0.36.0/test'
/bin/sh ../libtool  --tag=CC   --mode=link i686-pld-linux-gcc  -O2 -fwrapv -pipe -Wformat -Werror=format-security -gdwarf-4 -fno-debug-types-section -fvar-tracking-assignments -g2 -Wp,-D_FORTIFY_SOURCE=2 -fstack-protector-strong --param=ssp-buffer-size=4 -fomit-frame-pointer -march=i686 -fasynchronous-unwind-tables -mtune=pentium4 -gdwarf-4 -fno-debug-types-section -fvar-tracking-assignments -g2  -Wall -Wdeclaration-after-statement -Wno-unused-local-typedefs -fno-strict-aliasing -fvisibility=hidden -pthread -O2 -fwrapv -pipe -Wformat -Werror=format-security -gdwarf-4 -fno-debug-types-section -fvar-tracking-assignments -g2 -Wp,-D_FORTIFY_SOURCE=2 -fstack-protector-strong --param=ssp-buffer-size=4 -fomit-frame-pointer -march=i686 -fasynchronous-unwind-tables -mtune=pentium4 -gdwarf-4 -fno-debug-types-section -fvar-tracking-assignments -g2  -Wall -Wdeclaration-after-statement -Wno-unused-local-typedefs -fno-strict-aliasing -fvisibility=hidden   -Wl,--as-needed -Wl,--no-copy-dt-needed-entries -Wl,-z,relro -Wl,-z,combreloc  -pthread -Wl,--as-needed -Wl,--no-copy-dt-needed-entries -Wl,-z,relro -Wl,-z,combreloc  -o check-formats check-formats.o libutils.la ../pixman/libpixman-1.la -lm  -lpng16 -lz -lm   -lm 
libtool: link: i686-pld-linux-gcc -O2 -fwrapv -pipe -Wformat -Werror=format-security -gdwarf-4 -fno-debug-types-section -fvar-tracking-assignments -g2 -Wp,-D_FORTIFY_SOURCE=2 -fstack-protector-strong --param=ssp-buffer-size=4 -fomit-frame-pointer -march=i686 -fasynchronous-unwind-tables -mtune=pentium4 -gdwarf-4 -fno-debug-types-section -fvar-tracking-assignments -g2 -Wall -Wdeclaration-after-statement -Wno-unused-local-typedefs -fno-strict-aliasing -fvisibility=hidden -pthread -O2 -fwrapv -pipe -Wformat -Werror=format-security -gdwarf-4 -fno-debug-types-section -fvar-tracking-assignments -g2 -Wp,-D_FORTIFY_SOURCE=2 -fstack-protector-strong --param=ssp-buffer-size=4 -fomit-frame-pointer -march=i686 -fasynchronous-unwind-tables -mtune=pentium4 -gdwarf-4 -fno-debug-types-section -fvar-tracking-assignments -g2 -Wall -Wdeclaration-after-statement -Wno-unused-local-typedefs -fno-strict-aliasing -fvisibility=hidden -Wl,--as-needed -Wl,--no-copy-dt-needed-entries -Wl,-z -Wl,relro -Wl,-z -Wl,combreloc -pthread -Wl,--as-needed -Wl,--no-copy-dt-needed-entries -Wl,-z -Wl,relro -Wl,-z -Wl,combreloc -o .libs/check-formats check-formats.o  ./.libs/libutils.a ../pixman/.libs/libpixman-1.so /usr/lib/libpng16.so -lz -lm -pthread
make[2]: Leaving directory '/tmp/B.xgSB_j/BUILD/pixman-0.36.0/test'
make[2]: Entering directory '/tmp/B.xgSB_j/BUILD/pixman-0.36.0/test'
/bin/sh ../libtool  --tag=CC   --mode=link i686-pld-linux-gcc  -O2 -fwrapv -pipe -Wformat -Werror=format-security -gdwarf-4 -fno-debug-types-section -fvar-tracking-assignments -g2 -Wp,-D_FORTIFY_SOURCE=2 -fstack-protector-strong --param=ssp-buffer-size=4 -fomit-frame-pointer -march=i686 -fasynchronous-unwind-tables -mtune=pentium4 -gdwarf-4 -fno-debug-types-section -fvar-tracking-assignments -g2  -Wall -Wdeclaration-after-statement -Wno-unused-local-typedefs -fno-strict-aliasing -fvisibility=hidden -pthread -O2 -fwrapv -pipe -Wformat -Werror=format-security -gdwarf-4 -fno-debug-types-section -fvar-tracking-assignments -g2 -Wp,-D_FORTIFY_SOURCE=2 -fstack-protector-strong --param=ssp-buffer-size=4 -fomit-frame-pointer -march=i686 -fasynchronous-unwind-tables -mtune=pentium4 -gdwarf-4 -fno-debug-types-section -fvar-tracking-assignments -g2  -Wall -Wdeclaration-after-statement -Wno-unused-local-typedefs -fno-strict-aliasing -fvisibility=hidden   -Wl,--as-needed -Wl,--no-copy-dt-needed-entries -Wl,-z,relro -Wl,-z,combreloc  -pthread -Wl,--as-needed -Wl,--no-copy-dt-needed-entries -Wl,-z,relro -Wl,-z,combreloc  -o scaling-bench scaling-bench.o libutils.la ../pixman/libpixman-1.la -lm  -lpng16 -lz -lm   -lm 
libtool: link: i686-pld-linux-gcc -O2 -fwrapv -pipe -Wformat -Werror=format-security -gdwarf-4 -fno-debug-types-section -fvar-tracking-assignments -g2 -Wp,-D_FORTIFY_SOURCE=2 -fstack-protector-strong --param=ssp-buffer-size=4 -fomit-frame-pointer -march=i686 -fasynchronous-unwind-tables -mtune=pentium4 -gdwarf-4 -fno-debug-types-section -fvar-tracking-assignments -g2 -Wall -Wdeclaration-after-statement -Wno-unused-local-typedefs -fno-strict-aliasing -fvisibility=hidden -pthread -O2 -fwrapv -pipe -Wformat -Werror=format-security -gdwarf-4 -fno-debug-types-section -fvar-tracking-assignments -g2 -Wp,-D_FORTIFY_SOURCE=2 -fstack-protector-strong --param=ssp-buffer-size=4 -fomit-frame-pointer -march=i686 -fasynchronous-unwind-tables -mtune=pentium4 -gdwarf-4 -fno-debug-types-section -fvar-tracking-assignments -g2 -Wall -Wdeclaration-after-statement -Wno-unused-local-typedefs -fno-strict-aliasing -fvisibility=hidden -Wl,--as-needed -Wl,--no-copy-dt-needed-entries -Wl,-z -Wl,relro -Wl,-z -Wl,combreloc -pthread -Wl,--as-needed -Wl,--no-copy-dt-needed-entries -Wl,-z -Wl,relro -Wl,-z -Wl,combreloc -o .libs/scaling-bench scaling-bench.o  ./.libs/libutils.a ../pixman/.libs/libpixman-1.so /usr/lib/libpng16.so -lz -lm -pthread
make[2]: Leaving directory '/tmp/B.xgSB_j/BUILD/pixman-0.36.0/test'
make[2]: Entering directory '/tmp/B.xgSB_j/BUILD/pixman-0.36.0/test'
/bin/sh ../libtool  --tag=CC   --mode=link i686-pld-linux-gcc  -O2 -fwrapv -pipe -Wformat -Werror=format-security -gdwarf-4 -fno-debug-types-section -fvar-tracking-assignments -g2 -Wp,-D_FORTIFY_SOURCE=2 -fstack-protector-strong --param=ssp-buffer-size=4 -fomit-frame-pointer -march=i686 -fasynchronous-unwind-tables -mtune=pentium4 -gdwarf-4 -fno-debug-types-section -fvar-tracking-assignments -g2  -Wall -Wdeclaration-after-statement -Wno-unused-local-typedefs -fno-strict-aliasing -fvisibility=hidden -pthread -O2 -fwrapv -pipe -Wformat -Werror=format-security -gdwarf-4 -fno-debug-types-section -fvar-tracking-assignments -g2 -Wp,-D_FORTIFY_SOURCE=2 -fstack-protector-strong --param=ssp-buffer-size=4 -fomit-frame-pointer -march=i686 -fasynchronous-unwind-tables -mtune=pentium4 -gdwarf-4 -fno-debug-types-section -fvar-tracking-assignments -g2  -Wall -Wdeclaration-after-statement -Wno-unused-local-typedefs -fno-strict-aliasing -fvisibility=hidden   -Wl,--as-needed -Wl,--no-copy-dt-needed-entries -Wl,-z,relro -Wl,-z,combreloc  -pthread -Wl,--as-needed -Wl,--no-copy-dt-needed-entries -Wl,-z,relro -Wl,-z,combreloc  -o affine-bench affine-bench.o libutils.la ../pixman/libpixman-1.la -lm  -lpng16 -lz -lm   -lm 
libtool: link: i686-pld-linux-gcc -O2 -fwrapv -pipe -Wformat -Werror=format-security -gdwarf-4 -fno-debug-types-section -fvar-tracking-assignments -g2 -Wp,-D_FORTIFY_SOURCE=2 -fstack-protector-strong --param=ssp-buffer-size=4 -fomit-frame-pointer -march=i686 -fasynchronous-unwind-tables -mtune=pentium4 -gdwarf-4 -fno-debug-types-section -fvar-tracking-assignments -g2 -Wall -Wdeclaration-after-statement -Wno-unused-local-typedefs -fno-strict-aliasing -fvisibility=hidden -pthread -O2 -fwrapv -pipe -Wformat -Werror=format-security -gdwarf-4 -fno-debug-types-section -fvar-tracking-assignments -g2 -Wp,-D_FORTIFY_SOURCE=2 -fstack-protector-strong --param=ssp-buffer-size=4 -fomit-frame-pointer -march=i686 -fasynchronous-unwind-tables -mtune=pentium4 -gdwarf-4 -fno-debug-types-section -fvar-tracking-assignments -g2 -Wall -Wdeclaration-after-statement -Wno-unused-local-typedefs -fno-strict-aliasing -fvisibility=hidden -Wl,--as-needed -Wl,--no-copy-dt-needed-entries -Wl,-z -Wl,relro -Wl,-z -Wl,combreloc -pthread -Wl,--as-needed -Wl,--no-copy-dt-needed-entries -Wl,-z -Wl,relro -Wl,-z -Wl,combreloc -o .libs/affine-bench affine-bench.o  ./.libs/libutils.a ../pixman/.libs/libpixman-1.so /usr/lib/libpng16.so -lz -lm -pthread
make[2]: Leaving directory '/tmp/B.xgSB_j/BUILD/pixman-0.36.0/test'
+ /usr/bin/make -Otarget -j9 check
Making check in pixman
make[1]: Nothing to be done for 'check'.
Making check in demos
make[1]: Nothing to be done for 'check'.
Making check in test
/usr/bin/make  check-TESTS
make[3]: Entering directory '/tmp/B.xgSB_j/BUILD/pixman-0.36.0/test'
PASS: oob-test
make[3]: Leaving directory '/tmp/B.xgSB_j/BUILD/pixman-0.36.0/test'
make[3]: Entering directory '/tmp/B.xgSB_j/BUILD/pixman-0.36.0/test'
PASS: trap-crasher
make[3]: Leaving directory '/tmp/B.xgSB_j/BUILD/pixman-0.36.0/test'
make[3]: Entering directory '/tmp/B.xgSB_j/BUILD/pixman-0.36.0/test'
PASS: fence-image-self-test
make[3]: Leaving directory '/tmp/B.xgSB_j/BUILD/pixman-0.36.0/test'
make[3]: Entering directory '/tmp/B.xgSB_j/BUILD/pixman-0.36.0/test'
PASS: prng-test
make[3]: Leaving directory '/tmp/B.xgSB_j/BUILD/pixman-0.36.0/test'
make[3]: Entering directory '/tmp/B.xgSB_j/BUILD/pixman-0.36.0/test'
PASS: region-translate-test
make[3]: Leaving directory '/tmp/B.xgSB_j/BUILD/pixman-0.36.0/test'
make[3]: Entering directory '/tmp/B.xgSB_j/BUILD/pixman-0.36.0/test'
PASS: fetch-test
make[3]: Leaving directory '/tmp/B.xgSB_j/BUILD/pixman-0.36.0/test'
make[3]: Entering directory '/tmp/B.xgSB_j/BUILD/pixman-0.36.0/test'
PASS: infinite-loop
make[3]: Leaving directory '/tmp/B.xgSB_j/BUILD/pixman-0.36.0/test'
make[3]: Entering directory '/tmp/B.xgSB_j/BUILD/pixman-0.36.0/test'
PASS: radial-invalid
make[3]: Leaving directory '/tmp/B.xgSB_j/BUILD/pixman-0.36.0/test'
make[3]: Entering directory '/tmp/B.xgSB_j/BUILD/pixman-0.36.0/test'
PASS: a1-trap-test
make[3]: Leaving directory '/tmp/B.xgSB_j/BUILD/pixman-0.36.0/test'
make[3]: Entering directory '/tmp/B.xgSB_j/BUILD/pixman-0.36.0/test'
PASS: pdf-op-test
make[3]: Leaving directory '/tmp/B.xgSB_j/BUILD/pixman-0.36.0/test'
make[3]: Entering directory '/tmp/B.xgSB_j/BUILD/pixman-0.36.0/test'
PASS: region-test
make[3]: Leaving directory '/tmp/B.xgSB_j/BUILD/pixman-0.36.0/test'
make[3]: Entering directory '/tmp/B.xgSB_j/BUILD/pixman-0.36.0/test'
PASS: combiner-test
make[3]: Leaving directory '/tmp/B.xgSB_j/BUILD/pixman-0.36.0/test'
make[3]: Entering directory '/tmp/B.xgSB_j/BUILD/pixman-0.36.0/test'
PASS: alpha-loop
make[3]: Leaving directory '/tmp/B.xgSB_j/BUILD/pixman-0.36.0/test'
make[3]: Entering directory '/tmp/B.xgSB_j/BUILD/pixman-0.36.0/test'
PASS: thread-test
make[3]: Leaving directory '/tmp/B.xgSB_j/BUILD/pixman-0.36.0/test'
make[3]: Entering directory '/tmp/B.xgSB_j/BUILD/pixman-0.36.0/test'
PASS: scaling-crash-test
make[3]: Leaving directory '/tmp/B.xgSB_j/BUILD/pixman-0.36.0/test'
make[3]: Entering directory '/tmp/B.xgSB_j/BUILD/pixman-0.36.0/test'
PASS: scaling-helpers-test
make[3]: Leaving directory '/tmp/B.xgSB_j/BUILD/pixman-0.36.0/test'
make[3]: Entering directory '/tmp/B.xgSB_j/BUILD/pixman-0.36.0/test'
PASS: rotate-test
make[3]: Leaving directory '/tmp/B.xgSB_j/BUILD/pixman-0.36.0/test'
make[3]: Entering directory '/tmp/B.xgSB_j/BUILD/pixman-0.36.0/test'
PASS: gradient-crash-test
make[3]: Leaving directory '/tmp/B.xgSB_j/BUILD/pixman-0.36.0/test'
make[3]: Entering directory '/tmp/B.xgSB_j/BUILD/pixman-0.36.0/test'
PASS: composite-traps-test
make[3]: Leaving directory '/tmp/B.xgSB_j/BUILD/pixman-0.36.0/test'
make[3]: Entering directory '/tmp/B.xgSB_j/BUILD/pixman-0.36.0/test'
PASS: pixel-test
make[3]: Leaving directory '/tmp/B.xgSB_j/BUILD/pixman-0.36.0/test'
make[3]: Entering directory '/tmp/B.xgSB_j/BUILD/pixman-0.36.0/test'
PASS: alphamap
make[3]: Leaving directory '/tmp/B.xgSB_j/BUILD/pixman-0.36.0/test'
make[3]: Entering directory '/tmp/B.xgSB_j/BUILD/pixman-0.36.0/test'
PASS: filter-reduction-test
make[3]: Leaving directory '/tmp/B.xgSB_j/BUILD/pixman-0.36.0/test'
make[3]: Entering directory '/tmp/B.xgSB_j/BUILD/pixman-0.36.0/test'
PASS: glyph-test
make[3]: Leaving directory '/tmp/B.xgSB_j/BUILD/pixman-0.36.0/test'
make[3]: Entering directory '/tmp/B.xgSB_j/BUILD/pixman-0.36.0/test'
PASS: matrix-test
make[3]: Leaving directory '/tmp/B.xgSB_j/BUILD/pixman-0.36.0/test'
make[3]: Entering directory '/tmp/B.xgSB_j/BUILD/pixman-0.36.0/test'
PASS: region-contains-test
make[3]: Leaving directory '/tmp/B.xgSB_j/BUILD/pixman-0.36.0/test'
make[3]: Entering directory '/tmp/B.xgSB_j/BUILD/pixman-0.36.0/test'
PASS: solid-test
make[3]: Leaving directory '/tmp/B.xgSB_j/BUILD/pixman-0.36.0/test'
make[3]: Entering directory '/tmp/B.xgSB_j/BUILD/pixman-0.36.0/test'
FAIL: composite
make[3]: Leaving directory '/tmp/B.xgSB_j/BUILD/pixman-0.36.0/test'
make[3]: Entering directory '/tmp/B.xgSB_j/BUILD/pixman-0.36.0/test'
PASS: stress-test
make[3]: Leaving directory '/tmp/B.xgSB_j/BUILD/pixman-0.36.0/test'
make[3]: Entering directory '/tmp/B.xgSB_j/BUILD/pixman-0.36.0/test'
PASS: cover-test
make[3]: Leaving directory '/tmp/B.xgSB_j/BUILD/pixman-0.36.0/test'
make[3]: Entering directory '/tmp/B.xgSB_j/BUILD/pixman-0.36.0/test'
PASS: affine-test
make[3]: Leaving directory '/tmp/B.xgSB_j/BUILD/pixman-0.36.0/test'
make[3]: Entering directory '/tmp/B.xgSB_j/BUILD/pixman-0.36.0/test'
PASS: blitters-test
make[3]: Leaving directory '/tmp/B.xgSB_j/BUILD/pixman-0.36.0/test'
make[3]: Entering directory '/tmp/B.xgSB_j/BUILD/pixman-0.36.0/test'
PASS: scaling-test
make[3]: Leaving directory '/tmp/B.xgSB_j/BUILD/pixman-0.36.0/test'
make[3]: Entering directory '/tmp/B.xgSB_j/BUILD/pixman-0.36.0/test'
PASS: tolerance-test
make[3]: Leaving directory '/tmp/B.xgSB_j/BUILD/pixman-0.36.0/test'
make[3]: Entering directory '/tmp/B.xgSB_j/BUILD/pixman-0.36.0/test'
============================================================================
Testsuite summary for pixman 0.36.0
============================================================================
# TOTAL: 33
# PASS:  32
# SKIP:  0
# XFAIL: 0
# FAIL:  1
# XPASS: 0
# ERROR: 0
============================================================================
See test/test-suite.log
Please report to pixman@lists.freedesktop.org
============================================================================
make[3]: *** [Makefile:1247: test-suite.log] Error 1
make[3]: Leaving directory '/tmp/B.xgSB_j/BUILD/pixman-0.36.0/test'
make[2]: *** [Makefile:1355: check-TESTS] Error 2
make[1]: *** [Makefile:1652: check-am] Error 2
make: *** [Makefile:504: check-recursive] Error 1
error: Bad exit status from /tmp/B.xgSB_j/BUILD/tmp/rpm-tmp.1651 (%build)


RPM build errors:
    Bad exit status from /tmp/B.xgSB_j/BUILD/tmp/rpm-tmp.1651 (%build)
ended at: Fri Nov 30 22:28:56 2018, done in 0:02:45.707235
error: No files produced.
+ chmod -R u+rwX /tmp/B.xgSB_j/BUILD
+ rm -rf /tmp/B.xgSB_j/tmp /tmp/B.xgSB_j/BUILD
+ rm -rf /tmp/B.xgSB_j
Begin-PLD-Builder-Info
Build-Time: user:436.98s sys:24.91s real:170.13s (faults io:0 non-io:4209833)

End-PLD-Builder-Info
[Back to list of logs] [View rpm -qa of builder]