FailedOk

th/SRPMS[OK]
th/x32[OK]
th/i686[OK]
th/x86_64[OK]

ac/SRPMS[OK]
ac/i386[OK]
ac/i586[OK]
ac/i686[OK]
ac/alpha[OK]
ac/amd64[OK]
ac/athlon[OK]
ac/ppc[OK]
ac/sparc[OK]
ac/sparc64[OK]

Advanced Search
main()
Powered by PLD Linux
(c) 2002-2018 PLD Team
$Revision: 1.37 $
Powered by The Golden Path.
Your IP: 54.90.109.231

pixman f7673490-398e-46b7-ac4a-c21eccdd7b47

Status:Failed
Source URL:ftp://buildlogs.pld-linux.org/th/i686/FAIL/pixman,f7673490-398e-46b7-ac4a-c21eccdd7b47.bz2
text/plain URL:View!
full text:View!
rpm -qa of builder:View!
Date:2018/11/30 19:31:49
Runtime:0:01:38.708602

Toc:

  • error 1
  • FAIL: tolerance-test
  • error 2
  • # XFAIL: 0
  • error 3
  • # FAIL: 1
  • error 4
  • # ERROR: 0
  • error 5
  • make[3]: *** [Makefile:1247: test-suite.log] Error 1
  • error 6
  • make[2]: *** [Makefile:1355: check-TESTS] Error 2
  • error 7
  • make[1]: *** [Makefile:1652: check-am] Error 2
  • error 8
  • error: Bad exit status from /tmp/B.L7WBlN/BUILD/tmp/rpm-tmp.25075 (%build)
  • error 9
  • RPM build errors:
  • error 10
  • error: No files produced.

Content:

Making check in test
/usr/bin/make  check-TESTS
make[3]: Entering directory '/tmp/B.L7WBlN/BUILD/pixman-0.36.0/test'
PASS: oob-test
make[3]: Leaving directory '/tmp/B.L7WBlN/BUILD/pixman-0.36.0/test'
make[3]: Entering directory '/tmp/B.L7WBlN/BUILD/pixman-0.36.0/test'
PASS: region-translate-test
make[3]: Leaving directory '/tmp/B.L7WBlN/BUILD/pixman-0.36.0/test'
make[3]: Entering directory '/tmp/B.L7WBlN/BUILD/pixman-0.36.0/test'
PASS: prng-test
make[3]: Leaving directory '/tmp/B.L7WBlN/BUILD/pixman-0.36.0/test'
make[3]: Entering directory '/tmp/B.L7WBlN/BUILD/pixman-0.36.0/test'
PASS: fetch-test
make[3]: Leaving directory '/tmp/B.L7WBlN/BUILD/pixman-0.36.0/test'
make[3]: Entering directory '/tmp/B.L7WBlN/BUILD/pixman-0.36.0/test'
PASS: a1-trap-test
make[3]: Leaving directory '/tmp/B.L7WBlN/BUILD/pixman-0.36.0/test'
make[3]: Entering directory '/tmp/B.L7WBlN/BUILD/pixman-0.36.0/test'
PASS: infinite-loop
make[3]: Leaving directory '/tmp/B.L7WBlN/BUILD/pixman-0.36.0/test'
make[3]: Entering directory '/tmp/B.L7WBlN/BUILD/pixman-0.36.0/test'
PASS: radial-invalid
make[3]: Leaving directory '/tmp/B.L7WBlN/BUILD/pixman-0.36.0/test'
make[3]: Entering directory '/tmp/B.L7WBlN/BUILD/pixman-0.36.0/test'
PASS: trap-crasher
make[3]: Leaving directory '/tmp/B.L7WBlN/BUILD/pixman-0.36.0/test'
make[3]: Entering directory '/tmp/B.L7WBlN/BUILD/pixman-0.36.0/test'
PASS: fence-image-self-test
make[3]: Leaving directory '/tmp/B.L7WBlN/BUILD/pixman-0.36.0/test'
make[3]: Entering directory '/tmp/B.L7WBlN/BUILD/pixman-0.36.0/test'
PASS: pdf-op-test
make[3]: Leaving directory '/tmp/B.L7WBlN/BUILD/pixman-0.36.0/test'
make[3]: Entering directory '/tmp/B.L7WBlN/BUILD/pixman-0.36.0/test'
PASS: combiner-test
make[3]: Leaving directory '/tmp/B.L7WBlN/BUILD/pixman-0.36.0/test'
make[3]: Entering directory '/tmp/B.L7WBlN/BUILD/pixman-0.36.0/test'
PASS: region-test
make[3]: Leaving directory '/tmp/B.L7WBlN/BUILD/pixman-0.36.0/test'
make[3]: Entering directory '/tmp/B.L7WBlN/BUILD/pixman-0.36.0/test'
PASS: alpha-loop
make[3]: Leaving directory '/tmp/B.L7WBlN/BUILD/pixman-0.36.0/test'
make[3]: Entering directory '/tmp/B.L7WBlN/BUILD/pixman-0.36.0/test'
PASS: thread-test
make[3]: Leaving directory '/tmp/B.L7WBlN/BUILD/pixman-0.36.0/test'
make[3]: Entering directory '/tmp/B.L7WBlN/BUILD/pixman-0.36.0/test'
PASS: scaling-crash-test
make[3]: Leaving directory '/tmp/B.L7WBlN/BUILD/pixman-0.36.0/test'
make[3]: Entering directory '/tmp/B.L7WBlN/BUILD/pixman-0.36.0/test'
PASS: rotate-test
make[3]: Leaving directory '/tmp/B.L7WBlN/BUILD/pixman-0.36.0/test'
make[3]: Entering directory '/tmp/B.L7WBlN/BUILD/pixman-0.36.0/test'
PASS: scaling-helpers-test
make[3]: Leaving directory '/tmp/B.L7WBlN/BUILD/pixman-0.36.0/test'
make[3]: Entering directory '/tmp/B.L7WBlN/BUILD/pixman-0.36.0/test'
PASS: gradient-crash-test
make[3]: Leaving directory '/tmp/B.L7WBlN/BUILD/pixman-0.36.0/test'
make[3]: Entering directory '/tmp/B.L7WBlN/BUILD/pixman-0.36.0/test'
PASS: matrix-test
make[3]: Leaving directory '/tmp/B.L7WBlN/BUILD/pixman-0.36.0/test'
make[3]: Entering directory '/tmp/B.L7WBlN/BUILD/pixman-0.36.0/test'
PASS: composite-traps-test
make[3]: Leaving directory '/tmp/B.L7WBlN/BUILD/pixman-0.36.0/test'
make[3]: Entering directory '/tmp/B.L7WBlN/BUILD/pixman-0.36.0/test'
PASS: glyph-test
make[3]: Leaving directory '/tmp/B.L7WBlN/BUILD/pixman-0.36.0/test'
make[3]: Entering directory '/tmp/B.L7WBlN/BUILD/pixman-0.36.0/test'
PASS: region-contains-test
make[3]: Leaving directory '/tmp/B.L7WBlN/BUILD/pixman-0.36.0/test'
make[3]: Entering directory '/tmp/B.L7WBlN/BUILD/pixman-0.36.0/test'
PASS: solid-test
make[3]: Leaving directory '/tmp/B.L7WBlN/BUILD/pixman-0.36.0/test'
make[3]: Entering directory '/tmp/B.L7WBlN/BUILD/pixman-0.36.0/test'
PASS: pixel-test
make[3]: Leaving directory '/tmp/B.L7WBlN/BUILD/pixman-0.36.0/test'
make[3]: Entering directory '/tmp/B.L7WBlN/BUILD/pixman-0.36.0/test'
PASS: alphamap
make[3]: Leaving directory '/tmp/B.L7WBlN/BUILD/pixman-0.36.0/test'
make[3]: Entering directory '/tmp/B.L7WBlN/BUILD/pixman-0.36.0/test'
PASS: filter-reduction-test
make[3]: Leaving directory '/tmp/B.L7WBlN/BUILD/pixman-0.36.0/test'
make[3]: Entering directory '/tmp/B.L7WBlN/BUILD/pixman-0.36.0/test'
PASS: stress-test
make[3]: Leaving directory '/tmp/B.L7WBlN/BUILD/pixman-0.36.0/test'
make[3]: Entering directory '/tmp/B.L7WBlN/BUILD/pixman-0.36.0/test'
PASS: cover-test
make[3]: Leaving directory '/tmp/B.L7WBlN/BUILD/pixman-0.36.0/test'
make[3]: Entering directory '/tmp/B.L7WBlN/BUILD/pixman-0.36.0/test'
PASS: affine-test
make[3]: Leaving directory '/tmp/B.L7WBlN/BUILD/pixman-0.36.0/test'
make[3]: Entering directory '/tmp/B.L7WBlN/BUILD/pixman-0.36.0/test'
PASS: scaling-test
make[3]: Leaving directory '/tmp/B.L7WBlN/BUILD/pixman-0.36.0/test'
make[3]: Entering directory '/tmp/B.L7WBlN/BUILD/pixman-0.36.0/test'
PASS: blitters-test
make[3]: Leaving directory '/tmp/B.L7WBlN/BUILD/pixman-0.36.0/test'
make[3]: Entering directory '/tmp/B.L7WBlN/BUILD/pixman-0.36.0/test'
PASS: composite
make[3]: Leaving directory '/tmp/B.L7WBlN/BUILD/pixman-0.36.0/test'
make[3]: Entering directory '/tmp/B.L7WBlN/BUILD/pixman-0.36.0/test'
FAIL: tolerance-test
make[3]: Leaving directory '/tmp/B.L7WBlN/BUILD/pixman-0.36.0/test'
make[3]: Entering directory '/tmp/B.L7WBlN/BUILD/pixman-0.36.0/test'
============================================================================
Testsuite summary for pixman 0.36.0
============================================================================
# TOTAL: 33
# PASS:  32
# SKIP:  0
# XFAIL: 0
# FAIL:  1
# XPASS: 0
# ERROR: 0
============================================================================
See test/test-suite.log
Please report to pixman@lists.freedesktop.org
============================================================================
make[3]: *** [Makefile:1247: test-suite.log] Error 1
make[3]: Leaving directory '/tmp/B.L7WBlN/BUILD/pixman-0.36.0/test'
make[2]: *** [Makefile:1355: check-TESTS] Error 2
make[1]: *** [Makefile:1652: check-am] Error 2
make: *** [Makefile:504: check-recursive] Error 1
error: Bad exit status from /tmp/B.L7WBlN/BUILD/tmp/rpm-tmp.25075 (%build)


RPM build errors:
    Bad exit status from /tmp/B.L7WBlN/BUILD/tmp/rpm-tmp.25075 (%build)
ended at: Fri Nov 30 19:31:49 2018, done in 0:01:38.708602
error: No files produced.
+ chmod -R u+rwX /tmp/B.L7WBlN/BUILD
+ rm -rf /tmp/B.L7WBlN/tmp /tmp/B.L7WBlN/BUILD
+ rm -rf /tmp/B.L7WBlN
Begin-PLD-Builder-Info
Build-Time: user:515.12s sys:32.85s real:102.72s (faults io:0 non-io:4222750)

End-PLD-Builder-Info
[Back to list of logs] [View rpm -qa of builder]