FailedOk

th/SRPMS[OK]
th/x32[OK]
th/i686[OK]
th/x86_64[OK]

ac/SRPMS[OK]
ac/i386[OK]
ac/i586[OK]
ac/i686[OK]
ac/alpha[OK]
ac/amd64[OK]
ac/athlon[OK]
ac/ppc[OK]
ac/sparc[OK]
ac/sparc64[OK]

Advanced Search
main()
Powered by PLD Linux
(c) 2002-2018 PLD Team
$Revision: 1.37 $
Powered by foobar.
Your IP: 54.164.198.240

pluto 470695f5-b889-40e2-b5c7-cfce8d24f43f

Status:Failed
Source URL:ftp://buildlogs.pld-linux.org/th/i686/FAIL/pluto,470695f5-b889-40e2-b5c7-cfce8d24f43f.bz2
text/plain URL:View!
rpm -qa of builder:View!
Date:2018/07/28 23:02:54
Runtime:0:00:16.282368

Toc:

  • error 1
  • rpm: error: Failed build dependencies:
  • error 2
  • rpm: error: Failed build dependencies:
  • prep
  • Executing(%prep): /bin/sh -e /tmp/B.S4L0dx/BUILD/tmp/rpm-tmp.85336
  • build
  • Executing(%build): /bin/sh -e /tmp/B.S4L0dx/BUILD/tmp/rpm-tmp.85336
  • error 3
  • ast_transform.c:67:9: error: unknown type name 'ClastFilter'
  • error 4
  • ast_transform.c:67:65: error: 'subset' undeclared (first use in this function); did you mean 'strsep'?
  • error 5
  • ast_transform.c:79:25: error: 'struct clast_for' has no member named 'parallel'
  • error 6
  • ast_transform.c:79:38: error: 'CLAST_PARALLEL_NOT' undeclared (first use in this function); did you mean 'PIPE_PARALLEL'?
  • error 7
  • ast_transform.c:84:29: error: 'struct clast_for' has no member named 'parallel'
  • error 8
  • ast_transform.c:84:42: error: 'CLAST_PARALLEL_OMP' undeclared (first use in this function); did you mean 'PIPE_PARALLEL'?
  • error 9
  • ast_transform.c:90:25: error: 'struct clast_for' has no member named 'private_vars'
  • error 10
  • ast_transform.c:139:9: error: unknown type name 'ClastFilter'
  • error 11
  • ast_transform.c:139:65: error: 'subset' undeclared (first use in this function); did you mean 'strsep'?
  • error 12
  • ast_transform.c:152:21: error: 'struct clast_for' has no member named 'parallel'
  • error 13
  • ast_transform.c:152:35: error: 'CLAST_PARALLEL_VEC' undeclared (first use in this function); did you mean 'PIPE_PARALLEL'?
  • error 14
  • make[3]: *** [Makefile:919: pluto-ast_transform.o] Error 1
  • error 15
  • pluto_codegen_if.c:231:19: error: 'CloogOptions' {aka 'struct cloogoptions'} has no member named 'fs'; did you mean 'f'?
  • error 16
  • pluto_codegen_if.c:232:19: error: 'CloogOptions' {aka 'struct cloogoptions'} has no member named 'ls'; did you mean 'l'?
  • error 17
  • pluto_codegen_if.c:233:17: error: 'CloogOptions' {aka 'struct cloogoptions'} has no member named 'fs_ls_size'
  • error 18
  • pluto_codegen_if.c:236:23: error: 'CloogOptions' {aka 'struct cloogoptions'} has no member named 'fs'; did you mean 'f'?
  • error 19
  • pluto_codegen_if.c:237:23: error: 'CloogOptions' {aka 'struct cloogoptions'} has no member named 'ls'; did you mean 'l'?
  • error 20
  • pluto_codegen_if.c:258:31: error: 'CloogOptions' {aka 'struct cloogoptions'} has no member named 'fs'; did you mean 'f'?
  • error 21
  • pluto_codegen_if.c:259:31: error: 'CloogOptions' {aka 'struct cloogoptions'} has no member named 'ls'; did you mean 'l'?
  • error 22
  • pluto_codegen_if.c:271:42: error: 'CloogOptions' {aka 'struct cloogoptions'} has no member named 'fs'; did you mean 'f'?
  • error 23
  • pluto_codegen_if.c:274:59: error: 'CloogOptions' {aka 'struct cloogoptions'} has no member named 'fs'; did you mean 'f'?
  • error 24
  • pluto_codegen_if.c:275:39: error: 'CloogOptions' {aka 'struct cloogoptions'} has no member named 'ls'; did you mean 'l'?
  • error 25
  • make[3]: *** [Makefile:891: pluto-pluto_codegen_if.o] Error 1
  • error 26
  • make[2]: *** [Makefile:1015: all-recursive] Error 1
  • error 27
  • make[1]: *** [Makefile:518: all-recursive] Error 1
  • error 28
  • error: Bad exit status from /tmp/B.S4L0dx/BUILD/tmp/rpm-tmp.85336 (%build)
  • error 29
  • RPM build errors:
  • error 30
  • error: No files produced.

Content:

request from: baggins
checking if we should skip the build
started at: Sat Jul 28 23:02:16 2018
killing old processes on a builder
sending signal 9 to pid -1
Killed
cleaning up /tmp
fetching https://srcbuilder.pld-linux.org/th//srpms/470695f5-b889-40e2-b5c7-cfce8d24f43f/pluto-0.11.4-2.src.rpm
fetched 7371367 bytes, 5890.7 K/s
installing srpm: pluto-0.11.4-2.src.rpm
+ install -d /tmp/B.S4L0dx/BUILD /tmp/B.S4L0dx/RPMS
+ LC_ALL=en_US.UTF-8
+ rpm -qp --changelog pluto-0.11.4-2.src.rpm
* Sat Jul 28 2018 PLD Linux Team <feedback@pld-linux.org>
- For complete changelog see: http://git.pld-linux.org/?p=packages/pluto.git;a=log;h=master
* Mon Apr 02 2018 Jakub Bogusz <qboosh@pld-linux.org> 25e9337
- adjusted updated patch to cover deprecated isl_int removal in 0.19 + rpm -Uhv --nodeps --define '_topdir /tmp/B.S4L0dx' --define '_specdir %{_topdir}' --define '_sourcedir %{_specdir}' --define '_rpmdir %{_topdir}/RPMS' --define '_builddir %{_topdir}/BUILD' pluto-0.11.4-2.src.rpm Preparing... ################################################## pluto ################################################## + rm -f pluto-0.11.4-2.src.rpm + install -m 700 -d /tmp/B.S4L0dx/BUILD/tmp + TMPDIR=/tmp/B.S4L0dx/BUILD/tmp + exec nice -n 0 rpmbuild -bp --short-circuit --nodeps --define '_topdir /tmp/B.S4L0dx' --define '_specdir %{_topdir}' --define '_sourcedir %{_specdir}' --define '_rpmdir %{_topdir}/RPMS' --define '_builddir %{_topdir}/BUILD' --target i686-pld-linux --define 'prep exit 0' /tmp/B.S4L0dx/pluto.spec Building target platforms: i686-pld-linux checking BuildConflict-ing packages no BuildConflicts found checking BR rpm: error: Failed build dependencies: rpm: candl-devel >= 0.6.2-1.20120728 is needed by pluto-0.11.4-2.src rpm: clan-devel >= 0.8.0 is needed by pluto-0.11.4-2.src rpm: piplib-devel >= 1.4.0 is needed by pluto-0.11.4-2.src rpm: polylib-devel >= 5.22.5 is needed by pluto-0.11.4-2.src rpm: Building target platforms: i686-pld-linux updating poldek cache... ready is up to date Retrieving th::packages.ndir.md... th is up to date Retrieving th::packages.ndir.md... th is up to date Retrieving th-ready::packages.ndir.md... th-ready is up to date Retrieving th-ready::packages.ndir.md... th-ready is up to date Retrieving th-test::packages.ndir.md... th-test is up to date Retrieving th-test::packages.ndir.md... th-test is up to date checking conflicting packages in BRed packages poldek: Loading [pndir]ready... poldek: Loading [pndir]th-test... poldek: Loading [pndir]th-test... poldek: Loading [pndir]th-ready... poldek: Loading [pndir]th-ready... poldek: Loading [pndir]th... poldek: Loading [pndir]th... poldek: 32869 packages read poldek: Removed 5801 duplicate packages from available set poldek: Processing dependencies... poldek: piplib-devel-1.4.0-4.i686 marks piplib-1.4.0-4.i686 (cap piplib = 1.4.0-4) poldek: candl-devel-0.6.3-1.20140806.1.i686 marks candl-0.6.3-1.20140806.1.i686 (cap candl = 0.6.3-1.20140806.1) poldek: clan-devel-0.8.0-3.i686 marks clan-0.8.0-3.i686 (cap clan = 0.8.0-3) poldek: polylib-devel-5.22.5-3.i686 marks polylib-5.22.5-3.i686 (cap polylib = 5.22.5-3) poldek: There are 8 packages to install (4 marked by dependencies): poldek: I candl-devel-0.6.3-1.20140806.1.i686 clan-devel-0.8.0-3.i686 poldek: I piplib-devel-1.4.0-4.i686 polylib-devel-5.22.5-3.i686 poldek: D candl-0.6.3-1.20140806.1.i686 clan-0.8.0-3.i686 piplib-1.4.0-4.i686 poldek: D polylib-5.22.5-3.i686 poldek: This operation will use 1.4MB of disk space. poldek: Need to get 462.5KB of archives (462.5KB to download). poldek: poldek: Retrieving [1/8] th::piplib-1.4.0-4.i686.rpm... poldek: ..............................done poldek: Retrieving [2/8] th::candl-0.6.3-1.20140806.1.i686.rpm... poldek: ..............................done poldek: Retrieving [3/8] th::piplib-devel-1.4.0-4.i686.rpm... poldek: ..............................done poldek: Retrieving [4/8] th::candl-devel-0.6.3-1.20140806.1.i686.rpm... poldek: ..............................done poldek: Retrieving [5/8] th::clan-0.8.0-3.i686.rpm... poldek: ..............................done poldek: Retrieving [6/8] th::clan-devel-0.8.0-3.i686.rpm... poldek: ..............................done poldek: Retrieving [7/8] th::polylib-5.22.5-3.i686.rpm... poldek: ..............................done poldek: Retrieving [8/8] th::polylib-devel-5.22.5-3.i686.rpm... poldek: ..............................done poldek: Executing pm-command.sh --upgrade -vh --test --root / --define _check_dirname_deps 1... poldek: Preparing... ################################################## no conflicts found checking BR rpm: error: Failed build dependencies: rpm: candl-devel >= 0.6.2-1.20120728 is needed by pluto-0.11.4-2.src rpm: clan-devel >= 0.8.0 is needed by pluto-0.11.4-2.src rpm: piplib-devel >= 1.4.0 is needed by pluto-0.11.4-2.src rpm: polylib-devel >= 5.22.5 is needed by pluto-0.11.4-2.src rpm: Building target platforms: i686-pld-linux installing BR: piplib\-devel clan\-devel candl\-devel polylib\-devel + poldek --noask --caplookup -Q -v '--ignore=hhvm-*' '--ignore=php4-*' '--ignore=php52-*' '--ignore=php54-*' '--ignore=php55-*' '--ignore=php56-*' '--ignore=php70-*' '--ignore=php71-*' '--ignore=php72-*' --upgrade piplib-devel clan-devel candl-devel polylib-devel Loading [pndir]ready... Loading [pndir]th-test... Loading [pndir]th-test... Loading [pndir]th-ready... Loading [pndir]th-ready... Loading [pndir]th... Loading [pndir]th... 32869 packages read Removed 5801 duplicate packages from available set Processing dependencies... piplib-devel-1.4.0-4.i686 marks piplib-1.4.0-4.i686 (cap piplib = 1.4.0-4) There are 2 packages to install (1 marked by dependencies): I piplib-devel-1.4.0-4.i686 D piplib-1.4.0-4.i686 This operation will use 195.0KB of disk space. Need to get 66.6KB of archives. Executing pm-command.sh --upgrade -vh --root / --define _check_dirname_deps 1... Preparing... ################################################## piplib ################################################## piplib-devel ################################################## Installing set #2 Processing dependencies... candl-devel-0.6.3-1.20140806.1.i686 marks candl-0.6.3-1.20140806.1.i686 (cap candl = 0.6.3-1.20140806.1) There are 2 packages to install (1 marked by dependencies): I candl-devel-0.6.3-1.20140806.1.i686 D candl-0.6.3-1.20140806.1.i686 This operation will use 134.6KB of disk space. Need to get 48.1KB of archives. Executing pm-command.sh --upgrade -vh --root / --define _check_dirname_deps 1... Preparing... ################################################## candl ################################################## candl-devel ################################################## Installing set #3 Processing dependencies... clan-devel-0.8.0-3.i686 marks clan-0.8.0-3.i686 (cap clan = 0.8.0-3) There are 2 packages to install (1 marked by dependencies): I clan-devel-0.8.0-3.i686 D clan-0.8.0-3.i686 This operation will use 159.0KB of disk space. Need to get 71.4KB of archives. Executing pm-command.sh --upgrade -vh --root / --define _check_dirname_deps 1... Preparing... ################################################## clan ################################################## clan-devel ################################################## Installing set #4 Processing dependencies... polylib-devel-5.22.5-3.i686 marks polylib-5.22.5-3.i686 (cap polylib = 5.22.5-3) There are 2 packages to install (1 marked by dependencies): I polylib-devel-5.22.5-3.i686 D polylib-5.22.5-3.i686 This operation will use 956.3KB of disk space. Need to get 276.4KB of archives. Executing pm-command.sh --upgrade -vh --root / --define _check_dirname_deps 1... Preparing... ################################################## polylib ################################################## polylib-devel ################################################## building RPM using: set -ex; : build-id: 470695f5-b889-40e2-b5c7-cfce8d24f43f; TMPDIR=/tmp/B.S4L0dx/BUILD/tmp exec nice -n 0 rpmbuild -bb --define '_smp_mflags -j9' --define '_make_opts -Otarget' --define '_pld_builder 1' --define '_topdir /tmp/B.S4L0dx' --define '_specdir %{_topdir}' --define '_sourcedir %{_specdir}' --define '_rpmdir %{_topdir}/RPMS' --define '_builddir %{_topdir}/BUILD' --target i686-pld-linux /tmp/B.S4L0dx/pluto.spec + : build-id: 470695f5-b889-40e2-b5c7-cfce8d24f43f + TMPDIR=/tmp/B.S4L0dx/BUILD/tmp + exec nice -n 0 rpmbuild -bb --define '_smp_mflags -j9' --define '_make_opts -Otarget' --define '_pld_builder 1' --define '_topdir /tmp/B.S4L0dx' --define '_specdir %{_topdir}' --define '_sourcedir %{_specdir}' --define '_rpmdir %{_topdir}/RPMS' --define '_builddir %{_topdir}/BUILD' --target i686-pld-linux /tmp/B.S4L0dx/pluto.spec Building target platforms: i686-pld-linux Executing(%prep): /bin/sh -e /tmp/B.S4L0dx/BUILD/tmp/rpm-tmp.85336 + umask 022 + cd /tmp/B.S4L0dx/BUILD + cd /tmp/B.S4L0dx/BUILD + rm -rf pluto-0.11.4 + /usr/bin/gzip -dc /tmp/B.S4L0dx/pluto-0.11.4.tar.gz + /bin/tar -xf - + STATUS=0 + '[' 0 -ne 0 ']' + cd pluto-0.11.4 + /bin/id -u + '[' 1001 '=' 0 ']' + /bin/id -u + '[' 1001 '=' 0 ']' + /bin/chmod -Rf a+rX,u+w,g-w,o-w . + echo 'Patch #0 (pluto-system-libs.patch):' Patch #0 (pluto-system-libs.patch): + '[' -f /tmp/B.S4L0dx/pluto-system-libs.patch ']' + /bin/cat /tmp/B.S4L0dx/pluto-system-libs.patch + /usr/bin/patch -s -p1 + echo 'Patch #1 (pluto-updates.patch):' Patch #1 (pluto-updates.patch): + '[' -f /tmp/B.S4L0dx/pluto-updates.patch ']' + /bin/cat /tmp/B.S4L0dx/pluto-updates.patch + /usr/bin/patch -s -p1 + echo 'Patch #2 (pluto-include.patch):' Patch #2 (pluto-include.patch): + '[' -f /tmp/B.S4L0dx/pluto-include.patch ']' + /bin/cat /tmp/B.S4L0dx/pluto-include.patch + /usr/bin/patch -s -p1 + echo 'Patch #3 (pluto-link.patch):' Patch #3 (pluto-link.patch): + '[' -f /tmp/B.S4L0dx/pluto-link.patch ']' + /bin/cat /tmp/B.S4L0dx/pluto-link.patch + /usr/bin/patch -s -p1 + exit 0 Executing(%build): /bin/sh -e /tmp/B.S4L0dx/BUILD/tmp/rpm-tmp.85336 TMP=/home/users/builder/tmp HOME=/home/users/builder PATH=/usr/local/bin:/usr/bin:/bin:/home/users/builder/bin TMPDIR=/tmp/B.S4L0dx/BUILD/tmp + umask 022 + cd /tmp/B.S4L0dx/BUILD + cd pluto-0.11.4 + libtoolize --copy --force --install libtoolize: putting auxiliary files in AC_CONFIG_AUX_DIR, '.'. libtoolize: copying file './config.guess' libtoolize: copying file './config.sub' libtoolize: copying file './install-sh' libtoolize: copying file './ltmain.sh' libtoolize: putting macros in AC_CONFIG_MACRO_DIRS, 'm4'. libtoolize: copying file 'm4/libtool.m4' libtoolize: copying file 'm4/ltoptions.m4' libtoolize: copying file 'm4/ltsugar.m4' libtoolize: copying file 'm4/ltversion.m4' libtoolize: copying file 'm4/lt~obsolete.m4' + aclocal -I m4 + autoconf + autoheader + automake -a -c -f --foreign configure.ac:54: installing './compile' configure.ac:23: installing './missing' src/Makefile.am: installing './depcomp' + ./configure 'LDFLAGS=-Wl,--as-needed -Wl,--no-copy-dt-needed-entries -Wl,-z,relro -Wl,-z,combreloc ' 'CFLAGS=-O2 -fwrapv -pipe -Wformat -Werror=format-security -gdwarf-4 -fno-debug-types-section -fvar-tracking-assignments -g2 -Wp,-D_FORTIFY_SOURCE=2 -fstack-protector-strong --param=ssp-buffer-size=4 -fomit-frame-pointer -march=i686 -fasynchronous-unwind-tables -mtune=pentium4 -gdwarf-4 -fno-debug-types-section -fvar-tracking-assignments -g2 ' 'CXXFLAGS=-O2 -fwrapv -pipe -Wformat -Werror=format-security -gdwarf-4 -fno-debug-types-section -fvar-tracking-assignments -g2 -Wp,-D_FORTIFY_SOURCE=2 -fstack-protector-strong --param=ssp-buffer-size=4 -fomit-frame-pointer -march=i686 -fasynchronous-unwind-tables -mtune=pentium4 -gdwarf-4 -fno-debug-types-section -fvar-tracking-assignments -g2 ' 'FFLAGS=-O2 -fwrapv -pipe -Wformat -Werror=format-security -gdwarf-4 -fno-debug-types-section -fvar-tracking-assignments -g2 -Wp,-D_FORTIFY_SOURCE=2 -fstack-protector-strong --param=ssp-buffer-size=4 -fomit-frame-pointer -march=i686 -fasynchronous-unwind-tables -mtune=pentium4 -gdwarf-4 -fno-debug-types-section -fvar-tracking-assignments -g2 ' 'FCFLAGS=-O2 -fwrapv -pipe -Wformat -Werror=format-security -gdwarf-4 -fno-debug-types-section -fvar-tracking-assignments -g2 -Wp,-D_FORTIFY_SOURCE=2 -fstack-protector-strong --param=ssp-buffer-size=4 -fomit-frame-pointer -march=i686 -fasynchronous-unwind-tables -mtune=pentium4 -gdwarf-4 -fno-debug-types-section -fvar-tracking-assignments -g2 ' 'CPPFLAGS=' 'CC=i686-pld-linux-gcc' 'CXX=i686-pld-linux-g++' '--host=i686-pld-linux' '--build=i686-pld-linux' '--prefix=/usr' '--exec-prefix=/usr' '--bindir=/usr/bin' '--sbindir=/usr/sbin' '--sysconfdir=/etc' '--datadir=/usr/share' '--includedir=/usr/include' '--libdir=/usr/lib' '--libexecdir=/usr/libexec' '--localstatedir=/var' '--sharedstatedir=/var/lib' '--mandir=/usr/share/man' '--infodir=/usr/share/info' '--x-libraries=/usr/lib' --disable-silent-rules checking for a BSD-compatible install... /usr/bin/install -c checking whether build environment is sane... yes checking for a thread-safe mkdir -p... /bin/mkdir -p checking for mawk... mawk checking whether make sets $(MAKE)... yes checking whether make supports nested variables... yes checking whether make supports nested variables... (cached) yes checking for gcc... i686-pld-linux-gcc checking whether the C++ compiler works... yes checking for C++ compiler default output file name... a.out checking for suffix of executables... checking whether we are cross compiling... no checking for suffix of object files... o checking whether we are using the GNU C++ compiler... yes checking whether i686-pld-linux-g++ accepts -g... yes checking whether make supports the include directive... yes (GNU style) checking dependency style of i686-pld-linux-g++... gcc3 checking for ld... ld checking whether ln -s works... yes checking build system type... i686-pld-linux-gnu checking host system type... i686-pld-linux-gnu checking how to print strings... print -r checking for i686-pld-linux-gcc... (cached) i686-pld-linux-gcc checking whether we are using the GNU C compiler... yes checking whether i686-pld-linux-gcc accepts -g... yes checking for i686-pld-linux-gcc option to accept ISO C89... none needed checking whether i686-pld-linux-gcc understands -c and -o together... yes checking dependency style of i686-pld-linux-gcc... gcc3 checking for a sed that does not truncate output... /bin/sed checking for grep that handles long lines and -e... /bin/grep checking for egrep... /bin/grep -E checking for fgrep... /bin/grep -F checking for ld used by i686-pld-linux-gcc... ld checking if the linker (ld) is GNU ld... yes checking for BSD- or MS-compatible name lister (nm)... /usr/bin/nm -B checking the name lister (/usr/bin/nm -B) interface... BSD nm checking the maximum length of command line arguments... 1572864 checking how to convert i686-pld-linux-gnu file names to i686-pld-linux-gnu format... func_convert_file_noop checking how to convert i686-pld-linux-gnu file names to toolchain format... func_convert_file_noop checking for ld option to reload object files... -r checking for i686-pld-linux-objdump... no checking for objdump... objdump checking how to recognize dependent libraries... pass_all checking for i686-pld-linux-dlltool... no checking for dlltool... no checking how to associate runtime and link libraries... print -r -- checking for i686-pld-linux-ar... no checking for ar... ar checking for archiver @FILE support... @ checking for i686-pld-linux-strip... no checking for strip... strip checking for i686-pld-linux-ranlib... no checking for ranlib... ranlib checking command to parse /usr/bin/nm -B output from i686-pld-linux-gcc object... ok checking for sysroot... no checking for a working dd... /bin/dd checking how to truncate binary pipes... /bin/dd bs=4096 count=1 checking for i686-pld-linux-mt... no checking for mt... no checking if : is a manifest tool... no checking how to run the C preprocessor... i686-pld-linux-gcc -E checking for ANSI C header files... yes checking for sys/types.h... yes checking for sys/stat.h... yes checking for stdlib.h... yes checking for string.h... yes checking for memory.h... yes checking for strings.h... yes checking for inttypes.h... yes checking for stdint.h... yes checking for unistd.h... yes checking for dlfcn.h... yes checking for objdir... .libs checking if i686-pld-linux-gcc supports -fno-rtti -fno-exceptions... no checking for i686-pld-linux-gcc option to produce PIC... -fPIC -DPIC checking if i686-pld-linux-gcc PIC flag -fPIC -DPIC works... yes checking if i686-pld-linux-gcc static flag -static works... yes checking if i686-pld-linux-gcc supports -c -o file.o... yes checking if i686-pld-linux-gcc supports -c -o file.o... (cached) yes checking whether the i686-pld-linux-gcc linker (ld) supports shared libraries... yes checking whether -lc should be explicitly linked in... no checking dynamic linker characteristics... GNU/Linux ld.so checking how to hardcode library paths into programs... immediate checking whether stripping libraries is possible... yes checking if libtool supports shared libraries... yes checking whether to build shared libraries... yes checking whether to build static libraries... yes checking how to run the C++ preprocessor... i686-pld-linux-g++ -E checking for ld used by i686-pld-linux-g++... ld checking if the linker (ld) is GNU ld... yes checking whether the i686-pld-linux-g++ linker (ld) supports shared libraries... yes checking for i686-pld-linux-g++ option to produce PIC... -fPIC -DPIC checking if i686-pld-linux-g++ PIC flag -fPIC -DPIC works... yes checking if i686-pld-linux-g++ static flag -static works... yes checking if i686-pld-linux-g++ supports -c -o file.o... yes checking if i686-pld-linux-g++ supports -c -o file.o... (cached) yes checking whether the i686-pld-linux-g++ linker (ld) supports shared libraries... yes checking dynamic linker characteristics... (cached) GNU/Linux ld.so checking how to hardcode library paths into programs... immediate checking for an ANSI C-conforming const... yes checking math.h usability... yes checking math.h presence... yes checking for math.h... yes checking for stdlib.h... (cached) yes checking stdio.h usability... yes checking stdio.h presence... yes checking for stdio.h... yes checking assert.h usability... yes checking assert.h presence... yes checking for assert.h... yes checking for string.h... (cached) yes checking for cp... cp -f checking for rm... rm -f checking for mv... mv -f checking for cat... cat checking for ar... ar checking for strip... strip checking for sed... /bin/sed checking gmp.h usability... yes checking gmp.h presence... yes checking for gmp.h... yes checking for main in -lgmp... yes checking whether mp_get_memory_functions is declared... yes ====================== Configuring isl ====================== checking for a BSD-compatible install... /usr/bin/install -c checking whether build environment is sane... yes checking for a thread-safe mkdir -p... /bin/mkdir -p checking for gawk... gawk checking whether make sets $(MAKE)... yes checking whether make supports nested variables... yes checking whether make supports nested variables... (cached) yes checking for gcc... i686-pld-linux-gcc checking whether the C compiler works... yes checking for C compiler default output file name... a.out checking for suffix of executables... checking whether we are cross compiling... no checking for suffix of object files... o checking whether we are using the GNU C compiler... yes checking whether i686-pld-linux-gcc accepts -g... yes checking for i686-pld-linux-gcc option to accept ISO C89... none needed checking whether i686-pld-linux-gcc understands -c and -o together... yes checking for style of include used by make... GNU checking dependency style of i686-pld-linux-gcc... gcc3 checking whether we are using the GNU C++ compiler... yes checking whether i686-pld-linux-g++ accepts -g... yes checking dependency style of i686-pld-linux-g++... gcc3 checking for C compiler vendor... gnu checking build system type... i686-pc-linux-gnu checking host system type... i686-pc-linux-gnu checking whether the compiler supports function __attribute__((__warn_unused_result__))... yes checking for __attribute__... yes checking how to print strings... print -r checking for a sed that does not truncate output... /bin/sed checking for grep that handles long lines and -e... /bin/grep checking for egrep... /bin/grep -E checking for fgrep... /bin/grep -F checking for ld used by i686-pld-linux-gcc... /usr/bin/ld checking if the linker (/usr/bin/ld) is GNU ld... yes checking for BSD- or MS-compatible name lister (nm)... /usr/bin/nm -B checking the name lister (/usr/bin/nm -B) interface... BSD nm checking whether ln -s works... yes checking the maximum length of command line arguments... 1572864 checking whether the shell understands some XSI constructs... yes checking whether the shell understands "+="... yes checking how to convert i686-pc-linux-gnu file names to i686-pc-linux-gnu format... func_convert_file_noop checking how to convert i686-pc-linux-gnu file names to toolchain format... func_convert_file_noop checking for /usr/bin/ld option to reload object files... -r checking for objdump... objdump checking how to recognize dependent libraries... pass_all checking for dlltool... no checking how to associate runtime and link libraries... print -r -- checking for ar... ar checking for archiver @FILE support... @ checking for strip... strip checking for ranlib... ranlib checking command to parse /usr/bin/nm -B output from i686-pld-linux-gcc object... ok checking for sysroot... no checking for mt... no checking if : is a manifest tool... no checking how to run the C preprocessor... i686-pld-linux-gcc -E checking for ANSI C header files... yes checking for sys/types.h... yes checking for sys/stat.h... yes checking for stdlib.h... yes checking for string.h... yes checking for memory.h... yes checking for strings.h... yes checking for inttypes.h... yes checking for stdint.h... yes checking for unistd.h... yes checking for dlfcn.h... yes checking for objdir... .libs checking if i686-pld-linux-gcc supports -fno-rtti -fno-exceptions... no checking for i686-pld-linux-gcc option to produce PIC... -fPIC -DPIC checking if i686-pld-linux-gcc PIC flag -fPIC -DPIC works... yes checking if i686-pld-linux-gcc static flag -static works... yes checking if i686-pld-linux-gcc supports -c -o file.o... yes checking if i686-pld-linux-gcc supports -c -o file.o... (cached) yes checking whether the i686-pld-linux-gcc linker (/usr/bin/ld) supports shared libraries... yes checking whether -lc should be explicitly linked in... no checking dynamic linker characteristics... GNU/Linux ld.so checking how to hardcode library paths into programs... immediate checking whether stripping libraries is possible... yes checking if libtool supports shared libraries... yes checking whether to build shared libraries... yes checking whether to build static libraries... yes checking how to run the C++ preprocessor... i686-pld-linux-g++ -E checking for ld used by i686-pld-linux-g++... /usr/bin/ld checking if the linker (/usr/bin/ld) is GNU ld... yes checking whether the i686-pld-linux-g++ linker (/usr/bin/ld) supports shared libraries... yes checking for i686-pld-linux-g++ option to produce PIC... -fPIC -DPIC checking if i686-pld-linux-g++ PIC flag -fPIC -DPIC works... yes checking if i686-pld-linux-g++ static flag -static works... yes checking if i686-pld-linux-g++ supports -c -o file.o... yes checking if i686-pld-linux-g++ supports -c -o file.o... (cached) yes checking whether the i686-pld-linux-g++ linker (/usr/bin/ld) supports shared libraries... yes checking dynamic linker characteristics... (cached) GNU/Linux ld.so checking how to hardcode library paths into programs... immediate checking for perl... perl checking for pdflatex... pdflatex checking for pod2html... pod2html checking for stdint types... stdint.h (shortcircuit) make use of stdint.h in include/isl/stdint.h (assuming C99 compatible system) checking which gmp to use... system checking gmp.h usability... yes checking gmp.h presence... yes checking for gmp.h... yes checking for main in -lgmp... yes checking whether mp_get_memory_functions is declared... yes checking whether ffs is declared... yes checking whether __builtin_ffs is declared... yes checking which clang to use... no checking for C compiler vendor... (cached) gnu checking our pkgconfig libname... isl checking our pkgconfig version... 0.12.1 checking our pkgconfig_libdir... ${libdir}/pkgconfig expanded our pkgconfig_libdir... /usr/lib/pkgconfig checking our pkgconfig_libfile... isl.pc checking our package / suffix... isl / checking our pkgconfig description... isl Library checking our pkgconfig requires... checking our pkgconfig ext libs... -lisl -lgmp checking our pkgconfig cppflags... checking our pkgconfig ldflags... noninstalled pkgconfig -L /tmp/B.S4L0dx/BUILD/pluto-0.11.4/isl/.libs noninstalled pkgconfig -I /tmp/B.S4L0dx/BUILD/pluto-0.11.4/isl/./include checking that generated files are newer than configure... done configure: creating ./config.status config.status: creating Makefile config.status: creating doc/Makefile config.status: creating bound_test.sh config.status: creating codegen_test.sh config.status: creating pip_test.sh config.status: creating isl_config.h config.status: creating include/isl/config.h config.status: executing depfiles commands config.status: executing libtool commands config.status: executing include/isl/stdint.h commands config.status: creating include/isl/stdint.h : _ISL_INCLUDE_ISL_STDINT_H config.status: executing isl.pc commands config.status: creating isl.pc.in config.status: creating isl.pc config.status: creating isl-uninstalled.pc config.status: creating isl-uninstalled.sh checking for bash... /bin/bash checking that generated files are newer than configure... done configure: creating ./config.status config.status: creating getversion.sh config.status: creating Makefile config.status: creating src/Makefile config.status: creating polycc.sh config.status: creating config.h config.status: executing depfiles commands config.status: executing libtool commands config.status: executing version.h commands /*-----------------------------------------------* * PLUTO configuration is OK * *-----------------------------------------------*/ Your system is ready to compile PLUTO Run 'make' next to compile Then, run 'make test' to check if everything is working correctly Use polycc (see README) + /usr/bin/make -Otarget -j9 /usr/bin/make all-recursive Making all in src make[3]: Entering directory '/tmp/B.S4L0dx/BUILD/pluto-0.11.4/src' i686-pld-linux-gcc -DHAVE_CONFIG_H -I. -I.. -O3 -funroll-loops -fopenmp -funroll-loops -fopenmp -DSCOPLIB_INT_T_IS_MP -DCLOOG_INT_GMP -I../include -Wall -MT pluto-constraints_polylib.o -MD -MP -MF .deps/pluto-constraints_polylib.Tpo -c -o pluto-constraints_polylib.o `test -f 'constraints_polylib.c' || echo './'`constraints_polylib.c mv -f .deps/pluto-constraints_polylib.Tpo .deps/pluto-constraints_polylib.Po make[3]: Leaving directory '/tmp/B.S4L0dx/BUILD/pluto-0.11.4/src' make[3]: Entering directory '/tmp/B.S4L0dx/BUILD/pluto-0.11.4/src' i686-pld-linux-gcc -DHAVE_CONFIG_H -I. -I.. -O3 -funroll-loops -fopenmp -funroll-loops -fopenmp -DSCOPLIB_INT_T_IS_MP -DCLOOG_INT_GMP -I../include -Wall -MT pluto-transforms.o -MD -MP -MF .deps/pluto-transforms.Tpo -c -o pluto-transforms.o `test -f 'transforms.c' || echo './'`transforms.c transforms.c: In function 'pluto_sink_statement': transforms.c:35:21: warning: '%d' directive writing between 1 and 11 bytes into a region of size 4 [-Wformat-overflow=] sprintf(iter, "d%d", stmt->dim); ^~ transforms.c:35:19: note: directive argument in the range [-2147483648, 2147483646] sprintf(iter, "d%d", stmt->dim); ^~~~~ transforms.c:35:5: note: 'sprintf' output between 3 and 13 bytes into a destination of size 5 sprintf(iter, "d%d", stmt->dim); ^~~~~~~~~~~~~~~~~~~~~~~~~~~~~~~ mv -f .deps/pluto-transforms.Tpo .deps/pluto-transforms.Po make[3]: Leaving directory '/tmp/B.S4L0dx/BUILD/pluto-0.11.4/src' make[3]: Entering directory '/tmp/B.S4L0dx/BUILD/pluto-0.11.4/src' i686-pld-linux-gcc -DHAVE_CONFIG_H -I. -I.. -O3 -funroll-loops -fopenmp -funroll-loops -fopenmp -DSCOPLIB_INT_T_IS_MP -DCLOOG_INT_GMP -I../include -Wall -MT pluto-ddg.o -MD -MP -MF .deps/pluto-ddg.Tpo -c -o pluto-ddg.o `test -f 'ddg.c' || echo './'`ddg.c mv -f .deps/pluto-ddg.Tpo .deps/pluto-ddg.Po make[3]: Leaving directory '/tmp/B.S4L0dx/BUILD/pluto-0.11.4/src' make[3]: Entering directory '/tmp/B.S4L0dx/BUILD/pluto-0.11.4/src' i686-pld-linux-gcc -DHAVE_CONFIG_H -I. -I.. -O3 -funroll-loops -fopenmp -funroll-loops -fopenmp -DSCOPLIB_INT_T_IS_MP -DCLOOG_INT_GMP -I../include -Wall -MT pluto-constraints_isl.o -MD -MP -MF .deps/pluto-constraints_isl.Tpo -c -o pluto-constraints_isl.o `test -f 'constraints_isl.c' || echo './'`constraints_isl.c mv -f .deps/pluto-constraints_isl.Tpo .deps/pluto-constraints_isl.Po make[3]: Leaving directory '/tmp/B.S4L0dx/BUILD/pluto-0.11.4/src' make[3]: Entering directory '/tmp/B.S4L0dx/BUILD/pluto-0.11.4/src' i686-pld-linux-gcc -DHAVE_CONFIG_H -I. -I.. -O3 -funroll-loops -fopenmp -funroll-loops -fopenmp -DSCOPLIB_INT_T_IS_MP -DCLOOG_INT_GMP -I../include -Wall -MT pluto-ast_transform.o -MD -MP -MF .deps/pluto-ast_transform.Tpo -c -o pluto-ast_transform.o `test -f 'ast_transform.c' || echo './'`ast_transform.c ast_transform.c: In function 'pluto_mark_parallel': ast_transform.c:67:9: error: unknown type name 'ClastFilter' ClastFilter filter = {iter, stmtids, ploops[i]->nstmts, subset}; ^~~~~~~~~~~ ast_transform.c:67:31: warning: initialization of 'int' from 'char *' makes integer from pointer without a cast [-Wint-conversion] ClastFilter filter = {iter, stmtids, ploops[i]->nstmts, subset}; ^~~~ ast_transform.c:67:31: note: (near initialization for 'filter') ast_transform.c:67:37: warning: excess elements in scalar initializer ClastFilter filter = {iter, stmtids, ploops[i]->nstmts, subset}; ^~~~~~~ ast_transform.c:67:37: note: (near initialization for 'filter') ast_transform.c:67:46: warning: excess elements in scalar initializer ClastFilter filter = {iter, stmtids, ploops[i]->nstmts, subset}; ^~~~~~ ast_transform.c:67:46: note: (near initialization for 'filter') ast_transform.c:67:65: error: 'subset' undeclared (first use in this function); did you mean 'strsep'? ClastFilter filter = {iter, stmtids, ploops[i]->nstmts, subset}; ^~~~~~ strsep ast_transform.c:67:65: note: each undeclared identifier is reported only once for each function it appears in ast_transform.c:67:65: warning: excess elements in scalar initializer ast_transform.c:67:65: note: (near initialization for 'filter') ast_transform.c:68:9: warning: implicit declaration of function 'clast_filter'; did you mean 'clast_pprint'? [-Wimplicit-function-declaration] clast_filter(root, filter, &loops, &nloops, &stmts, &nstmts); ^~~~~~~~~~~~ clast_pprint ast_transform.c:79:25: error: 'struct clast_for' has no member named 'parallel' loops[j]->parallel = CLAST_PARALLEL_NOT; ^~ ast_transform.c:79:38: error: 'CLAST_PARALLEL_NOT' undeclared (first use in this function); did you mean 'PIPE_PARALLEL'? loops[j]->parallel = CLAST_PARALLEL_NOT; ^~~~~~~~~~~~~~~~~~ PIPE_PARALLEL ast_transform.c:84:29: error: 'struct clast_for' has no member named 'parallel' loops[j]->parallel = CLAST_PARALLEL_OMP; ^~ ast_transform.c:84:42: error: 'CLAST_PARALLEL_OMP' undeclared (first use in this function); did you mean 'PIPE_PARALLEL'? loops[j]->parallel = CLAST_PARALLEL_OMP; ^~~~~~~~~~~~~~~~~~ PIPE_PARALLEL ast_transform.c:90:25: error: 'struct clast_for' has no member named 'private_vars' loops[j]->private_vars = strdup(private_vars); ^~ ast_transform.c: In function 'pluto_mark_vector': ast_transform.c:139:9: error: unknown type name 'ClastFilter' ClastFilter filter = {iter, stmtids, ploops[i]->nstmts, subset}; ^~~~~~~~~~~ ast_transform.c:139:31: warning: initialization of 'int' from 'char *' makes integer from pointer without a cast [-Wint-conversion] ClastFilter filter = {iter, stmtids, ploops[i]->nstmts, subset}; ^~~~ ast_transform.c:139:31: note: (near initialization for 'filter') ast_transform.c:139:37: warning: excess elements in scalar initializer ClastFilter filter = {iter, stmtids, ploops[i]->nstmts, subset}; ^~~~~~~ ast_transform.c:139:37: note: (near initialization for 'filter') ast_transform.c:139:46: warning: excess elements in scalar initializer ClastFilter filter = {iter, stmtids, ploops[i]->nstmts, subset}; ^~~~~~ ast_transform.c:139:46: note: (near initialization for 'filter') ast_transform.c:139:65: error: 'subset' undeclared (first use in this function); did you mean 'strsep'? ClastFilter filter = {iter, stmtids, ploops[i]->nstmts, subset}; ^~~~~~ strsep ast_transform.c:139:65: warning: excess elements in scalar initializer ast_transform.c:139:65: note: (near initialization for 'filter') ast_transform.c:152:21: error: 'struct clast_for' has no member named 'parallel' loops[j]->parallel += CLAST_PARALLEL_VEC; ^~ ast_transform.c:152:35: error: 'CLAST_PARALLEL_VEC' undeclared (first use in this function); did you mean 'PIPE_PARALLEL'? loops[j]->parallel += CLAST_PARALLEL_VEC; ^~~~~~~~~~~~~~~~~~ PIPE_PARALLEL make[3]: *** [Makefile:919: pluto-ast_transform.o] Error 1 make[3]: Leaving directory '/tmp/B.S4L0dx/BUILD/pluto-0.11.4/src' make[3]: *** Waiting for unfinished jobs.... make[3]: Entering directory '/tmp/B.S4L0dx/BUILD/pluto-0.11.4/src' i686-pld-linux-gcc -DHAVE_CONFIG_H -I. -I.. -O3 -funroll-loops -fopenmp -funroll-loops -fopenmp -DSCOPLIB_INT_T_IS_MP -DCLOOG_INT_GMP -I../include -Wall -MT pluto-pluto_codegen_if.o -MD -MP -MF .deps/pluto-pluto_codegen_if.Tpo -c -o pluto-pluto_codegen_if.o `test -f 'pluto_codegen_if.c' || echo './'`pluto_codegen_if.c pluto_codegen_if.c: In function 'pluto_gen_cloog_code': pluto_codegen_if.c:231:19: error: 'CloogOptions' {aka 'struct cloogoptions'} has no member named 'fs'; did you mean 'f'? cloogOptions->fs = malloc (nstmts*sizeof(int)); ^~ f pluto_codegen_if.c:232:19: error: 'CloogOptions' {aka 'struct cloogoptions'} has no member named 'ls'; did you mean 'l'? cloogOptions->ls = malloc(nstmts*sizeof(int)); ^~ l pluto_codegen_if.c:233:17: error: 'CloogOptions' {aka 'struct cloogoptions'} has no member named 'fs_ls_size' cloogOptions->fs_ls_size = nstmts; ^~ pluto_codegen_if.c:236:23: error: 'CloogOptions' {aka 'struct cloogoptions'} has no member named 'fs'; did you mean 'f'? cloogOptions->fs[i] = -1; ^~ f pluto_codegen_if.c:237:23: error: 'CloogOptions' {aka 'struct cloogoptions'} has no member named 'ls'; did you mean 'l'? cloogOptions->ls[i] = -1; ^~ l pluto_codegen_if.c:258:31: error: 'CloogOptions' {aka 'struct cloogoptions'} has no member named 'fs'; did you mean 'f'? cloogOptions->fs[i] = get_first_point_loop(stmts[i], prog)+1; ^~ f pluto_codegen_if.c:259:31: error: 'CloogOptions' {aka 'struct cloogoptions'} has no member named 'ls'; did you mean 'l'? cloogOptions->ls[i] = prog->num_hyperplanes; ^~ l pluto_codegen_if.c:271:42: error: 'CloogOptions' {aka 'struct cloogoptions'} has no member named 'fs'; did you mean 'f'? if (nstmts >= 1 && cloogOptions->fs[0] >= 1) { ^~ f pluto_codegen_if.c:274:59: error: 'CloogOptions' {aka 'struct cloogoptions'} has no member named 'fs'; did you mean 'f'? printf("S%d(%d,%d), ", i+1, cloogOptions->fs[i], ^~ f pluto_codegen_if.c:275:39: error: 'CloogOptions' {aka 'struct cloogoptions'} has no member named 'ls'; did you mean 'l'? cloogOptions->ls[i]); ^~ l make[3]: *** [Makefile:891: pluto-pluto_codegen_if.o] Error 1 make[3]: Leaving directory '/tmp/B.S4L0dx/BUILD/pluto-0.11.4/src' make[3]: Entering directory '/tmp/B.S4L0dx/BUILD/pluto-0.11.4/src' i686-pld-linux-gcc -DHAVE_CONFIG_H -I. -I.. -O3 -funroll-loops -fopenmp -funroll-loops -fopenmp -DSCOPLIB_INT_T_IS_MP -DCLOOG_INT_GMP -I../include -Wall -MT pluto-post_transform.o -MD -MP -MF .deps/pluto-post_transform.Tpo -c -o pluto-post_transform.o `test -f 'post_transform.c' || echo './'`post_transform.c mv -f .deps/pluto-post_transform.Tpo .deps/pluto-post_transform.Po make[3]: Leaving directory '/tmp/B.S4L0dx/BUILD/pluto-0.11.4/src' make[3]: Entering directory '/tmp/B.S4L0dx/BUILD/pluto-0.11.4/src' i686-pld-linux-gcc -DHAVE_CONFIG_H -I. -I.. -O3 -funroll-loops -fopenmp -funroll-loops -fopenmp -DSCOPLIB_INT_T_IS_MP -DCLOOG_INT_GMP -I../include -Wall -MT pluto-math_support.o -MD -MP -MF .deps/pluto-math_support.Tpo -c -o pluto-math_support.o `test -f 'math_support.c' || echo './'`math_support.c math_support.c: In function 'pluto_affine_function_print': math_support.c:635:31: warning: '%d' directive writing between 1 and 10 bytes into a region of size 4 [-Wformat-overflow=] sprintf(var[j], "x%d", j+1); ^~ math_support.c:635:29: note: directive argument in the range [1, 2147483647] sprintf(var[j], "x%d", j+1); ^~~~~ math_support.c:635:13: note: 'sprintf' output between 3 and 12 bytes into a destination of size 5 sprintf(var[j], "x%d", j+1); ^~~~~~~~~~~~~~~~~~~~~~~~~~~ math_support.c:635:31: warning: '%d' directive writing between 1 and 10 bytes into a region of size 4 [-Wformat-overflow=] sprintf(var[j], "x%d", j+1); ^~ math_support.c:635:29: note: directive argument in the range [1, 2147483647] sprintf(var[j], "x%d", j+1); ^~~~~ math_support.c:635:13: note: 'sprintf' output between 3 and 12 bytes into a destination of size 5 sprintf(var[j], "x%d", j+1); ^~~~~~~~~~~~~~~~~~~~~~~~~~~ mv -f .deps/pluto-math_support.Tpo .deps/pluto-math_support.Po make[3]: Leaving directory '/tmp/B.S4L0dx/BUILD/pluto-0.11.4/src' make[3]: Entering directory '/tmp/B.S4L0dx/BUILD/pluto-0.11.4/src' i686-pld-linux-gcc -DHAVE_CONFIG_H -I. -I.. -O3 -funroll-loops -fopenmp -funroll-loops -fopenmp -DSCOPLIB_INT_T_IS_MP -DCLOOG_INT_GMP -I../include -Wall -MT pluto-polyloop.o -MD -MP -MF .deps/pluto-polyloop.Tpo -c -o pluto-polyloop.o `test -f 'polyloop.c' || echo './'`polyloop.c mv -f .deps/pluto-polyloop.Tpo .deps/pluto-polyloop.Po make[3]: Leaving directory '/tmp/B.S4L0dx/BUILD/pluto-0.11.4/src' make[3]: Entering directory '/tmp/B.S4L0dx/BUILD/pluto-0.11.4/src' i686-pld-linux-gcc -DHAVE_CONFIG_H -I. -I.. -O3 -funroll-loops -fopenmp -funroll-loops -fopenmp -DSCOPLIB_INT_T_IS_MP -DCLOOG_INT_GMP -I../include -Wall -MT pluto-framework.o -MD -MP -MF .deps/pluto-framework.Tpo -c -o pluto-framework.o `test -f 'framework.c' || echo './'`framework.c mv -f .deps/pluto-framework.Tpo .deps/pluto-framework.Po make[3]: Leaving directory '/tmp/B.S4L0dx/BUILD/pluto-0.11.4/src' make[3]: Entering directory '/tmp/B.S4L0dx/BUILD/pluto-0.11.4/src' i686-pld-linux-gcc -DHAVE_CONFIG_H -I. -I.. -O3 -funroll-loops -fopenmp -funroll-loops -fopenmp -DSCOPLIB_INT_T_IS_MP -DCLOOG_INT_GMP -I../include -Wall -MT pluto-iss.o -MD -MP -MF .deps/pluto-iss.Tpo -c -o pluto-iss.o `test -f 'iss.c' || echo './'`iss.c mv -f .deps/pluto-iss.Tpo .deps/pluto-iss.Po make[3]: Leaving directory '/tmp/B.S4L0dx/BUILD/pluto-0.11.4/src' make[3]: Entering directory '/tmp/B.S4L0dx/BUILD/pluto-0.11.4/src' i686-pld-linux-gcc -DHAVE_CONFIG_H -I. -I.. -O3 -funroll-loops -fopenmp -funroll-loops -fopenmp -DSCOPLIB_INT_T_IS_MP -DCLOOG_INT_GMP -I../include -Wall -MT pluto-pluto.o -MD -MP -MF .deps/pluto-pluto.Tpo -c -o pluto-pluto.o `test -f 'pluto.c' || echo './'`pluto.c mv -f .deps/pluto-pluto.Tpo .deps/pluto-pluto.Po make[3]: Leaving directory '/tmp/B.S4L0dx/BUILD/pluto-0.11.4/src' make[3]: Entering directory '/tmp/B.S4L0dx/BUILD/pluto-0.11.4/src' i686-pld-linux-gcc -DHAVE_CONFIG_H -I. -I.. -O3 -funroll-loops -fopenmp -funroll-loops -fopenmp -DSCOPLIB_INT_T_IS_MP -DCLOOG_INT_GMP -I../include -Wall -MT pluto-constraints.o -MD -MP -MF .deps/pluto-constraints.Tpo -c -o pluto-constraints.o `test -f 'constraints.c' || echo './'`constraints.c constraints.c: In function 'pluto_constraints_cplex_print': constraints.c:1028:38: warning: '%d' directive writing between 1 and 10 bytes into a region of size 4 [-Wformat-overflow=] else sprintf(var, "c_%d", j); ^~ constraints.c:1028:35: note: directive argument in the range [0, 2147483647] else sprintf(var, "c_%d", j); ^~~~~~ constraints.c:1028:22: note: 'sprintf' output between 4 and 13 bytes into a destination of size 6 else sprintf(var, "c_%d", j); ^~~~~~~~~~~~~~~~~~~~~~~ mv -f .deps/pluto-constraints.Tpo .deps/pluto-constraints.Po make[3]: Leaving directory '/tmp/B.S4L0dx/BUILD/pluto-0.11.4/src' make[2]: *** [Makefile:1015: all-recursive] Error 1 make[1]: *** [Makefile:518: all-recursive] Error 1 make: *** [Makefile:390: all] Error 2 error: Bad exit status from /tmp/B.S4L0dx/BUILD/tmp/rpm-tmp.85336 (%build) RPM build errors: Bad exit status from /tmp/B.S4L0dx/BUILD/tmp/rpm-tmp.85336 (%build) ended at: Sat Jul 28 23:02:54 2018, done in 0:00:16.282368 error: No files produced. + chmod -R u+rwX /tmp/B.S4L0dx/BUILD + rm -rf /tmp/B.S4L0dx/tmp /tmp/B.S4L0dx/BUILD + rm -rf /tmp/B.S4L0dx Begin-PLD-Builder-Info Build-Time: user:26.88s sys:3.93s real:37.81s (faults io:0 non-io:1343642) End-PLD-Builder-Info
[Back to list of logs] [View rpm -qa of builder]