FailedOk

th/SRPMS[OK]
th/x32[OK]
th/i686[OK]
th/x86_64[OK]

ac/SRPMS[OK]
ac/i386[OK]
ac/i586[OK]
ac/i686[OK]
ac/alpha[OK]
ac/amd64[OK]
ac/athlon[OK]
ac/ppc[OK]
ac/sparc[OK]
ac/sparc64[OK]

Advanced Search
main()
Powered by PLD Linux
(c) 2002-2018 PLD Team
$Revision: 1.37 $
Powered by GNOME.
Your IP: 54.90.109.231

postgresql 90a51fa4-c894-4f55-bf98-8e91e58e07a1

Status:Failed
Source URL:ftp://buildlogs.pld-linux.org/th/i686/FAIL/postgresql,90a51fa4-c894-4f55-bf98-8e91e58e07a1.bz2
text/plain URL:View!
full text:View!
rpm -qa of builder:View!
Date:2018/12/05 08:50:20
Runtime:0:02:45.807604

Toc:

  • error 1
  • make[1]: *** [GNUmakefile:130: check] Error 1
  • error 2
  • error: Bad exit status from /tmp/B.gfrpxy/BUILD/tmp/rpm-tmp.95322 (%build)
  • error 3
  • RPM build errors:
  • error 4
  • error: No files produced.

Content:

     select_having            ... ok
     subselect                ... ok
     union                    ... ok
     case                     ... ok
     join                     ... ok
     aggregates               ... ok
     transactions             ... ok
     random                   ... ok
     portals                  ... ok
     arrays                   ... ok
     btree_index              ... ok
     hash_index               ... ok
     update                   ... ok
     namespace                ... ok
     prepared_xacts           ... ok
     delete                   ... ok
parallel group (16 tests):  drop_operator init_privs security_label lock tablesample groupingsets object_address replica_identity collate matview gin rowsecurity privileges spgist gist brin
     brin                     ... ok
     gin                      ... ok
     gist                     ... ok
     spgist                   ... ok
     privileges               ... ok
     init_privs               ... ok
     security_label           ... ok
     collate                  ... ok
     matview                  ... ok
     lock                     ... ok
     replica_identity         ... ok
     rowsecurity              ... ok
     object_address           ... ok
     tablesample              ... ok
     groupingsets             ... ok
     drop_operator            ... ok
parallel group (7 tests):  async dbsize misc_functions alter_operator psql alter_generic misc
     alter_generic            ... ok
     alter_operator           ... ok
     misc                     ... ok
     psql                     ... ok
     async                    ... ok
     dbsize                   ... ok
     misc_functions           ... ok
parallel group (4 tests):  amutils psql_crosstab select_parallel rules
     rules                    ... ok
     psql_crosstab            ... ok
     select_parallel          ... ok
     amutils                  ... ok
parallel group (20 tests):  portals_p2 json_encoding advisory_lock combocid guc tsdicts xmlmap equivclass json select_views functional_deps dependency tsearch window jsonb indirect_toast cluster bitmapops foreign_key foreign_data
     select_views             ... FAILED
     portals_p2               ... ok
     foreign_key              ... ok
     cluster                  ... ok
     dependency               ... ok
     guc                      ... ok
     bitmapops                ... ok
     combocid                 ... ok
     tsearch                  ... ok
     tsdicts                  ... ok
     foreign_data             ... ok
     window                   ... ok
     xmlmap                   ... ok
     functional_deps          ... ok
     advisory_lock            ... ok
     json                     ... ok
     jsonb                    ... ok
     json_encoding            ... ok
     indirect_toast           ... ok
     equivclass               ... ok
parallel group (19 tests):  conversion prepare limit plancache xml temp returning polymorphism without_oid rowtypes copy2 sequence with truncate largeobject domain rangefuncs alter_table plpgsql
     plancache                ... ok
     limit                    ... ok
     plpgsql                  ... ok
     copy2                    ... ok
     temp                     ... ok
     domain                   ... ok
     rangefuncs               ... ok
     prepare                  ... ok
     without_oid              ... ok
     conversion               ... ok
     truncate                 ... ok
     alter_table              ... ok
     sequence                 ... ok
     polymorphism             ... ok
     rowtypes                 ... ok
     returning                ... ok
     largeobject              ... ok
     with                     ... ok
     xml                      ... ok
test event_trigger            ... ok
test stats                    ... ok
============== shutting down postmaster               ==============

========================
 1 of 167 tests failed. 
========================

The differences that caused some tests to fail can be viewed in the
file "/tmp/B.gfrpxy/BUILD/postgresql-9.6.11/src/test/regress/regression.diffs".  A copy of the test summary that you see
above is saved in the file "/tmp/B.gfrpxy/BUILD/postgresql-9.6.11/src/test/regress/regression.out".

make[1]: *** [GNUmakefile:130: check] Error 1
make[1]: Leaving directory '/tmp/B.gfrpxy/BUILD/postgresql-9.6.11/src/test/regress'
make: *** [GNUmakefile:67: check] Error 2
error: Bad exit status from /tmp/B.gfrpxy/BUILD/tmp/rpm-tmp.95322 (%build)


RPM build errors:
    Bad exit status from /tmp/B.gfrpxy/BUILD/tmp/rpm-tmp.95322 (%build)
ended at: Wed Dec  5 08:50:19 2018, done in 0:02:45.807604
error: No files produced.
+ chmod -R u+rwX /tmp/B.gfrpxy/BUILD
+ rm -rf /tmp/B.gfrpxy/tmp /tmp/B.gfrpxy/BUILD
+ rm -rf /tmp/B.gfrpxy
Begin-PLD-Builder-Info
Build-Time: user:521.03s sys:57.24s real:173.90s (faults io:1 non-io:7824398)

End-PLD-Builder-Info
[Back to list of logs] [View rpm -qa of builder]