FailedOk

th/SRPMS[OK]
th/x32[OK]
th/i686[OK]
th/x86_64[OK]

ac/SRPMS[OK]
ac/i386[OK]
ac/i586[OK]
ac/i686[OK]
ac/alpha[OK]
ac/amd64[OK]
ac/athlon[OK]
ac/ppc[OK]
ac/sparc[OK]
ac/sparc64[OK]

Advanced Search
main()
Powered by PLD Linux
(c) 2002-2020 PLD Team
$Revision: 1.37 $
Powered by php.
Your IP: 3.226.248.180

protobuf 4f96ae83-9fe3-470a-92af-20e03097af08

Status:Failed
Source URL:https://buildlogs.pld-linux.org/pld/th/i686/FAIL/protobuf,4f96ae83-9fe3-470a-92af-20e03097af08.bz2
text/plain URL:View!
full text:View!
rpm -qa of builder:View!
Date:2020/09/08 21:43:48
Runtime:0:08:55.206661

Toc:

  • error 1
  • ./google/protobuf/parse_context.h:398:17: error: comparison is always false due to limited range of data type [-Werror=type-limits]
  • error 2
  • ./google/protobuf/parse_context.h:398:17: error: comparison is always false due to limited range of data type [-Werror=type-limits]
  • error 3
  • ./google/protobuf/parse_context.h:398:17: error: comparison is always false due to limited range of data type [-Werror=type-limits]
  • error 4
  • ./google/protobuf/parse_context.h:398:17: error: comparison is always false due to limited range of data type [-Werror=type-limits]
  • error 5
  • ./google/protobuf/parse_context.h:398:17: error: comparison is always false due to limited range of data type [-Werror=type-limits]
  • error 6
  • ./google/protobuf/parse_context.h:398:17: error: comparison is always false due to limited range of data type [-Werror=type-limits]
  • error 7
  • ./google/protobuf/parse_context.h:398:17: error: comparison is always false due to limited range of data type [-Werror=type-limits]
  • error 8
  • ./google/protobuf/parse_context.h:398:17: error: comparison is always false due to limited range of data type [-Werror=type-limits]
  • error 9
  • ./google/protobuf/parse_context.h:398:17: error: comparison is always false due to limited range of data type [-Werror=type-limits]
  • error 10
  • ./google/protobuf/parse_context.h:398:17: error: comparison is always false due to limited range of data type [-Werror=type-limits]
  • error 11
  • ./google/protobuf/parse_context.h:398:17: error: comparison is always false due to limited range of data type [-Werror=type-limits]
  • error 12
  • ./google/protobuf/parse_context.h:398:17: error: comparison is always false due to limited range of data type [-Werror=type-limits]
  • error 13
  • ./google/protobuf/parse_context.h:398:17: error: comparison is always false due to limited range of data type [-Werror=type-limits]
  • error 14
  • ./google/protobuf/parse_context.h:398:17: error: comparison is always false due to limited range of data type [-Werror=type-limits]
  • error 15
  • ./google/protobuf/parse_context.h:398:17: error: comparison is always false due to limited range of data type [-Werror=type-limits]
  • error 16
  • ./google/protobuf/parse_context.h:398:17: error: comparison is always false due to limited range of data type [-Werror=type-limits]
  • error 17
  • ./google/protobuf/parse_context.h:398:17: error: comparison is always false due to limited range of data type [-Werror=type-limits]
  • error 18
  • ./google/protobuf/parse_context.h:398:17: error: comparison is always false due to limited range of data type [-Werror=type-limits]
  • error 19
  • ./google/protobuf/parse_context.h:398:17: error: comparison is always false due to limited range of data type [-Werror=type-limits]
  • error 20
  • ./google/protobuf/parse_context.h:398:17: error: comparison is always false due to limited range of data type [-Werror=type-limits]
  • error 21
  • ./google/protobuf/parse_context.h:398:17: error: comparison is always false due to limited range of data type [-Werror=type-limits]
  • error 22
  • ./google/protobuf/parse_context.h:398:17: error: comparison is always false due to limited range of data type [-Werror=type-limits]
  • error 23
  • ./google/protobuf/parse_context.h:398:17: error: comparison is always false due to limited range of data type [-Werror=type-limits]
  • error 24
  • ./google/protobuf/parse_context.h:398:17: error: comparison is always false due to limited range of data type [-Werror=type-limits]
  • error 25
  • ./google/protobuf/parse_context.h:398:17: error: comparison is always false due to limited range of data type [-Werror=type-limits]
  • error 26
  • ./google/protobuf/parse_context.h:398:17: error: comparison is always false due to limited range of data type [-Werror=type-limits]
  • error 27
  • ./google/protobuf/parse_context.h:398:17: error: comparison is always false due to limited range of data type [-Werror=type-limits]
  • error 28
  • ./google/protobuf/parse_context.h:398:17: error: comparison is always false due to limited range of data type [-Werror=type-limits]
  • error 29
  • make[2]: *** [Makefile:4406: google/protobuf/no_warning_test-unittest_lite.pb.o] Error 1
  • error 30
  • ./google/protobuf/parse_context.h:398:17: error: comparison is always false due to limited range of data type [-Werror=type-limits]
  • error 31
  • ./google/protobuf/parse_context.h:398:17: error: comparison is always false due to limited range of data type [-Werror=type-limits]
  • error 32
  • ./google/protobuf/parse_context.h:398:17: error: comparison is always false due to limited range of data type [-Werror=type-limits]
  • error 33
  • ./google/protobuf/parse_context.h:398:17: error: comparison is always false due to limited range of data type [-Werror=type-limits]
  • error 34
  • ./google/protobuf/parse_context.h:398:17: error: comparison is always false due to limited range of data type [-Werror=type-limits]
  • error 35
  • make[2]: *** [Makefile:4392: google/protobuf/no_warning_test-map_lite_unittest.pb.o] Error 1
  • error 36
  • ./google/protobuf/parse_context.h:398:17: error: comparison is always false due to limited range of data type [-Werror=type-limits]
  • error 37
  • ./google/protobuf/parse_context.h:398:17: error: comparison is always false due to limited range of data type [-Werror=type-limits]
  • error 38
  • make[2]: *** [Makefile:4490: google/protobuf/no_warning_test-map_proto2_unittest.pb.o] Error 1
  • error 39
  • ./google/protobuf/parse_context.h:398:17: error: comparison is always false due to limited range of data type [-Werror=type-limits]
  • error 40
  • ./google/protobuf/parse_context.h:398:17: error: comparison is always false due to limited range of data type [-Werror=type-limits]
  • error 41
  • ./google/protobuf/parse_context.h:398:17: error: comparison is always false due to limited range of data type [-Werror=type-limits]
  • error 42
  • ./google/protobuf/parse_context.h:398:17: error: comparison is always false due to limited range of data type [-Werror=type-limits]
  • error 43
  • make[2]: *** [Makefile:4504: google/protobuf/no_warning_test-map_unittest.pb.o] Error 1
  • error 44
  • make[1]: *** [Makefile:8180: check-am] Error 2
  • error 45
  • error: Bad exit status from /tmp/B.I0bZvk/BUILD/tmp/rpm-tmp.71591 (%build)
  • error 46
  • RPM build errors:
  • error 47
  • error: No files produced.

Content:

mv -f google/protobuf/.deps/protobuf_lazy_descriptor_test-unittest.pb.Tpo google/protobuf/.deps/protobuf_lazy_descriptor_test-unittest.pb.Po
make[2]: Leaving directory '/tmp/B.I0bZvk/BUILD/protobuf-3.13.0/src'
make[2]: Entering directory '/tmp/B.I0bZvk/BUILD/protobuf-3.13.0/src'
i686-pld-linux-g++ -DHAVE_CONFIG_H -I. -I..  -I/usr/include/gmock -I/usr/include/gtest -DGOOGLE_PROTOBUF_NO_RTTI -pthread -DHAVE_PTHREAD=1 -DHAVE_ZLIB=1 -Wall -Wno-sign-compare -O2 -pipe -Wformat -Werror=format-security -gdwarf-4 -fno-debug-types-section -fvar-tracking-assignments -g2 -Wp,-D_FORTIFY_SOURCE=2 -fstack-protector-strong --param=ssp-buffer-size=4 -Werror=trampolines -fomit-frame-pointer -march=i686 -fasynchronous-unwind-tables -mtune=pentium4 -gdwarf-4 -fno-debug-types-section -fvar-tracking-assignments -g2  -MT google/protobuf/protobuf_lite_test-lite_unittest.o -MD -MP -MF google/protobuf/.deps/protobuf_lite_test-lite_unittest.Tpo -c -o google/protobuf/protobuf_lite_test-lite_unittest.o `test -f 'google/protobuf/lite_unittest.cc' || echo './'`google/protobuf/lite_unittest.cc
mv -f google/protobuf/.deps/protobuf_lite_test-lite_unittest.Tpo google/protobuf/.deps/protobuf_lite_test-lite_unittest.Po
make[2]: Leaving directory '/tmp/B.I0bZvk/BUILD/protobuf-3.13.0/src'
make[2]: Entering directory '/tmp/B.I0bZvk/BUILD/protobuf-3.13.0/src'
i686-pld-linux-g++ -DHAVE_CONFIG_H -I. -I..  -I/usr/include/gmock -I/usr/include/gtest -DGOOGLE_PROTOBUF_NO_RTTI -pthread -DHAVE_PTHREAD=1 -DHAVE_ZLIB=1 -Wall -Wno-sign-compare -O2 -pipe -Wformat -Werror=format-security -gdwarf-4 -fno-debug-types-section -fvar-tracking-assignments -g2 -Wp,-D_FORTIFY_SOURCE=2 -fstack-protector-strong --param=ssp-buffer-size=4 -Werror=trampolines -fomit-frame-pointer -march=i686 -fasynchronous-unwind-tables -mtune=pentium4 -gdwarf-4 -fno-debug-types-section -fvar-tracking-assignments -g2  -MT google/protobuf/protobuf_lite_test-unittest_import_lite.pb.o -MD -MP -MF google/protobuf/.deps/protobuf_lite_test-unittest_import_lite.pb.Tpo -c -o google/protobuf/protobuf_lite_test-unittest_import_lite.pb.o `test -f 'google/protobuf/unittest_import_lite.pb.cc' || echo './'`google/protobuf/unittest_import_lite.pb.cc
mv -f google/protobuf/.deps/protobuf_lite_test-unittest_import_lite.pb.Tpo google/protobuf/.deps/protobuf_lite_test-unittest_import_lite.pb.Po
make[2]: Leaving directory '/tmp/B.I0bZvk/BUILD/protobuf-3.13.0/src'
make[2]: Entering directory '/tmp/B.I0bZvk/BUILD/protobuf-3.13.0/src'
i686-pld-linux-g++ -DHAVE_CONFIG_H -I. -I..  -I/usr/include/gmock -I/usr/include/gtest -DPROTOBUF_TEST_NO_DESCRIPTORS -DGOOGLE_PROTOBUF_NO_RTTI -pthread -DHAVE_PTHREAD=1 -DHAVE_ZLIB=1 -Wall -Wno-sign-compare -O2 -pipe -Wformat -Werror=format-security -gdwarf-4 -fno-debug-types-section -fvar-tracking-assignments -g2 -Wp,-D_FORTIFY_SOURCE=2 -fstack-protector-strong --param=ssp-buffer-size=4 -Werror=trampolines -fomit-frame-pointer -march=i686 -fasynchronous-unwind-tables -mtune=pentium4 -gdwarf-4 -fno-debug-types-section -fvar-tracking-assignments -g2  -MT google/protobuf/util/internal/testdata/protobuf_lazy_descriptor_test-maps.pb.o -MD -MP -MF google/protobuf/util/internal/testdata/.deps/protobuf_lazy_descriptor_test-maps.pb.Tpo -c -o google/protobuf/util/internal/testdata/protobuf_lazy_descriptor_test-maps.pb.o `test -f 'google/protobuf/util/internal/testdata/maps.pb.cc' || echo './'`google/protobuf/util/internal/testdata/maps.pb.cc
mv -f google/protobuf/util/internal/testdata/.deps/protobuf_lazy_descriptor_test-maps.pb.Tpo google/protobuf/util/internal/testdata/.deps/protobuf_lazy_descriptor_test-maps.pb.Po
make[2]: Leaving directory '/tmp/B.I0bZvk/BUILD/protobuf-3.13.0/src'
make[2]: Entering directory '/tmp/B.I0bZvk/BUILD/protobuf-3.13.0/src'
i686-pld-linux-g++ -DHAVE_CONFIG_H -I. -I..  -I/usr/include/gmock -I/usr/include/gtest -DGOOGLE_PROTOBUF_NO_RTTI -pthread -DHAVE_PTHREAD=1 -DHAVE_ZLIB=1 -Wall -Wno-sign-compare -O2 -pipe -Wformat -Werror=format-security -gdwarf-4 -fno-debug-types-section -fvar-tracking-assignments -g2 -Wp,-D_FORTIFY_SOURCE=2 -fstack-protector-strong --param=ssp-buffer-size=4 -Werror=trampolines -fomit-frame-pointer -march=i686 -fasynchronous-unwind-tables -mtune=pentium4 -gdwarf-4 -fno-debug-types-section -fvar-tracking-assignments -g2  -MT google/protobuf/protobuf_lite_test-map_lite_test_util.o -MD -MP -MF google/protobuf/.deps/protobuf_lite_test-map_lite_test_util.Tpo -c -o google/protobuf/protobuf_lite_test-map_lite_test_util.o `test -f 'google/protobuf/map_lite_test_util.cc' || echo './'`google/protobuf/map_lite_test_util.cc
mv -f google/protobuf/.deps/protobuf_lite_test-map_lite_test_util.Tpo google/protobuf/.deps/protobuf_lite_test-map_lite_test_util.Po
make[2]: Leaving directory '/tmp/B.I0bZvk/BUILD/protobuf-3.13.0/src'
make[2]: Entering directory '/tmp/B.I0bZvk/BUILD/protobuf-3.13.0/src'
i686-pld-linux-g++ -DHAVE_CONFIG_H -I. -I..  -I/usr/include/gmock -I/usr/include/gtest -DGOOGLE_PROTOBUF_NO_RTTI -pthread -DHAVE_PTHREAD=1 -DHAVE_ZLIB=1 -Wall -Wno-sign-compare -O2 -pipe -Wformat -Werror=format-security -gdwarf-4 -fno-debug-types-section -fvar-tracking-assignments -g2 -Wp,-D_FORTIFY_SOURCE=2 -fstack-protector-strong --param=ssp-buffer-size=4 -Werror=trampolines -fomit-frame-pointer -march=i686 -fasynchronous-unwind-tables -mtune=pentium4 -gdwarf-4 -fno-debug-types-section -fvar-tracking-assignments -g2  -MT google/protobuf/protobuf_lite_test-unittest_import_public_lite.pb.o -MD -MP -MF google/protobuf/.deps/protobuf_lite_test-unittest_import_public_lite.pb.Tpo -c -o google/protobuf/protobuf_lite_test-unittest_import_public_lite.pb.o `test -f 'google/protobuf/unittest_import_public_lite.pb.cc' || echo './'`google/protobuf/unittest_import_public_lite.pb.cc
mv -f google/protobuf/.deps/protobuf_lite_test-unittest_import_public_lite.pb.Tpo google/protobuf/.deps/protobuf_lite_test-unittest_import_public_lite.pb.Po
make[2]: Leaving directory '/tmp/B.I0bZvk/BUILD/protobuf-3.13.0/src'
make[2]: Entering directory '/tmp/B.I0bZvk/BUILD/protobuf-3.13.0/src'
i686-pld-linux-g++ -DHAVE_CONFIG_H -I. -I..  -I/usr/include/gmock -I/usr/include/gtest -DGOOGLE_PROTOBUF_NO_RTTI -pthread -DHAVE_PTHREAD=1 -DHAVE_ZLIB=1 -Wall -Wno-sign-compare -O2 -pipe -Wformat -Werror=format-security -gdwarf-4 -fno-debug-types-section -fvar-tracking-assignments -g2 -Wp,-D_FORTIFY_SOURCE=2 -fstack-protector-strong --param=ssp-buffer-size=4 -Werror=trampolines -fomit-frame-pointer -march=i686 -fasynchronous-unwind-tables -mtune=pentium4 -gdwarf-4 -fno-debug-types-section -fvar-tracking-assignments -g2  -MT google/protobuf/protobuf_lite_arena_test-arena_test_util.o -MD -MP -MF google/protobuf/.deps/protobuf_lite_arena_test-arena_test_util.Tpo -c -o google/protobuf/protobuf_lite_arena_test-arena_test_util.o `test -f 'google/protobuf/arena_test_util.cc' || echo './'`google/protobuf/arena_test_util.cc
mv -f google/protobuf/.deps/protobuf_lite_arena_test-arena_test_util.Tpo google/protobuf/.deps/protobuf_lite_arena_test-arena_test_util.Po
make[2]: Leaving directory '/tmp/B.I0bZvk/BUILD/protobuf-3.13.0/src'
make[2]: Entering directory '/tmp/B.I0bZvk/BUILD/protobuf-3.13.0/src'
i686-pld-linux-g++ -DHAVE_CONFIG_H -I. -I..  -I/usr/include/gmock -I/usr/include/gtest -DPROTOBUF_TEST_NO_DESCRIPTORS -DGOOGLE_PROTOBUF_NO_RTTI -pthread -DHAVE_PTHREAD=1 -DHAVE_ZLIB=1 -Wall -Wno-sign-compare -O2 -pipe -Wformat -Werror=format-security -gdwarf-4 -fno-debug-types-section -fvar-tracking-assignments -g2 -Wp,-D_FORTIFY_SOURCE=2 -fstack-protector-strong --param=ssp-buffer-size=4 -Werror=trampolines -fomit-frame-pointer -march=i686 -fasynchronous-unwind-tables -mtune=pentium4 -gdwarf-4 -fno-debug-types-section -fvar-tracking-assignments -g2  -MT google/protobuf/protobuf_lazy_descriptor_test-unittest_well_known_types.pb.o -MD -MP -MF google/protobuf/.deps/protobuf_lazy_descriptor_test-unittest_well_known_types.pb.Tpo -c -o google/protobuf/protobuf_lazy_descriptor_test-unittest_well_known_types.pb.o `test -f 'google/protobuf/unittest_well_known_types.pb.cc' || echo './'`google/protobuf/unittest_well_known_types.pb.cc
mv -f google/protobuf/.deps/protobuf_lazy_descriptor_test-unittest_well_known_types.pb.Tpo google/protobuf/.deps/protobuf_lazy_descriptor_test-unittest_well_known_types.pb.Po
make[2]: Leaving directory '/tmp/B.I0bZvk/BUILD/protobuf-3.13.0/src'
make[2]: Entering directory '/tmp/B.I0bZvk/BUILD/protobuf-3.13.0/src'
/bin/sh ../libtool  --tag=CXX   --mode=link i686-pld-linux-g++ -pthread -DHAVE_PTHREAD=1 -DHAVE_ZLIB=1 -Wall -Wno-sign-compare  -O2 -pipe -Wformat -Werror=format-security -gdwarf-4 -fno-debug-types-section -fvar-tracking-assignments -g2 -Wp,-D_FORTIFY_SOURCE=2 -fstack-protector-strong --param=ssp-buffer-size=4 -Werror=trampolines -fomit-frame-pointer -march=i686 -fasynchronous-unwind-tables -mtune=pentium4 -gdwarf-4 -fno-debug-types-section -fvar-tracking-assignments -g2  -pthread -Wl,--as-needed -Wl,--no-copy-dt-needed-entries -Wl,-z,relro -Wl,-z,combreloc  -o test_plugin google/protobuf/compiler/test_plugin-mock_code_generator.o google/protobuf/testing/test_plugin-file.o google/protobuf/compiler/test_plugin-test_plugin.o  libprotobuf.la libprotoc.la -lgtest -lz 
libtool: link: i686-pld-linux-g++ -pthread -DHAVE_PTHREAD=1 -DHAVE_ZLIB=1 -Wall -Wno-sign-compare -O2 -pipe -Wformat -Werror=format-security -gdwarf-4 -fno-debug-types-section -fvar-tracking-assignments -g2 -Wp,-D_FORTIFY_SOURCE=2 -fstack-protector-strong --param=ssp-buffer-size=4 -Werror=trampolines -fomit-frame-pointer -march=i686 -fasynchronous-unwind-tables -mtune=pentium4 -gdwarf-4 -fno-debug-types-section -fvar-tracking-assignments -g2 -pthread -Wl,--as-needed -Wl,--no-copy-dt-needed-entries -Wl,-z -Wl,relro -Wl,-z -Wl,combreloc -o .libs/test_plugin google/protobuf/compiler/test_plugin-mock_code_generator.o google/protobuf/testing/test_plugin-file.o google/protobuf/compiler/test_plugin-test_plugin.o  ./.libs/libprotobuf.so ./.libs/libprotoc.so /tmp/B.I0bZvk/BUILD/protobuf-3.13.0/src/.libs/libprotobuf.so /usr/lib/libstdc++.so -lm -lgtest -lz -pthread
make[2]: Leaving directory '/tmp/B.I0bZvk/BUILD/protobuf-3.13.0/src'
make[2]: Entering directory '/tmp/B.I0bZvk/BUILD/protobuf-3.13.0/src'
i686-pld-linux-g++ -DHAVE_CONFIG_H -I. -I..  -I/usr/include/gmock -I/usr/include/gtest -DGOOGLE_PROTOBUF_NO_RTTI -pthread -DHAVE_PTHREAD=1 -DHAVE_ZLIB=1 -Wall -Wno-sign-compare -O2 -pipe -Wformat -Werror=format-security -gdwarf-4 -fno-debug-types-section -fvar-tracking-assignments -g2 -Wp,-D_FORTIFY_SOURCE=2 -fstack-protector-strong --param=ssp-buffer-size=4 -Werror=trampolines -fomit-frame-pointer -march=i686 -fasynchronous-unwind-tables -mtune=pentium4 -gdwarf-4 -fno-debug-types-section -fvar-tracking-assignments -g2  -MT google/protobuf/protobuf_lite_arena_test-lite_arena_unittest.o -MD -MP -MF google/protobuf/.deps/protobuf_lite_arena_test-lite_arena_unittest.Tpo -c -o google/protobuf/protobuf_lite_arena_test-lite_arena_unittest.o `test -f 'google/protobuf/lite_arena_unittest.cc' || echo './'`google/protobuf/lite_arena_unittest.cc
mv -f google/protobuf/.deps/protobuf_lite_arena_test-lite_arena_unittest.Tpo google/protobuf/.deps/protobuf_lite_arena_test-lite_arena_unittest.Po
make[2]: Leaving directory '/tmp/B.I0bZvk/BUILD/protobuf-3.13.0/src'
make[2]: Entering directory '/tmp/B.I0bZvk/BUILD/protobuf-3.13.0/src'
i686-pld-linux-g++ -DHAVE_CONFIG_H -I. -I..  -I/usr/include/gmock -I/usr/include/gtest -DGOOGLE_PROTOBUF_NO_RTTI -pthread -DHAVE_PTHREAD=1 -DHAVE_ZLIB=1 -Wall -Wno-sign-compare -O2 -pipe -Wformat -Werror=format-security -gdwarf-4 -fno-debug-types-section -fvar-tracking-assignments -g2 -Wp,-D_FORTIFY_SOURCE=2 -fstack-protector-strong --param=ssp-buffer-size=4 -Werror=trampolines -fomit-frame-pointer -march=i686 -fasynchronous-unwind-tables -mtune=pentium4 -gdwarf-4 -fno-debug-types-section -fvar-tracking-assignments -g2  -MT google/protobuf/protobuf_lite_test-unittest_lite.pb.o -MD -MP -MF google/protobuf/.deps/protobuf_lite_test-unittest_lite.pb.Tpo -c -o google/protobuf/protobuf_lite_test-unittest_lite.pb.o `test -f 'google/protobuf/unittest_lite.pb.cc' || echo './'`google/protobuf/unittest_lite.pb.cc
mv -f google/protobuf/.deps/protobuf_lite_test-unittest_lite.pb.Tpo google/protobuf/.deps/protobuf_lite_test-unittest_lite.pb.Po
make[2]: Leaving directory '/tmp/B.I0bZvk/BUILD/protobuf-3.13.0/src'
make[2]: Entering directory '/tmp/B.I0bZvk/BUILD/protobuf-3.13.0/src'
i686-pld-linux-g++ -DHAVE_CONFIG_H -I. -I..  -I/usr/include/gmock -I/usr/include/gtest -DGOOGLE_PROTOBUF_NO_RTTI -pthread -DHAVE_PTHREAD=1 -DHAVE_ZLIB=1 -Wall -Wno-sign-compare -O2 -pipe -Wformat -Werror=format-security -gdwarf-4 -fno-debug-types-section -fvar-tracking-assignments -g2 -Wp,-D_FORTIFY_SOURCE=2 -fstack-protector-strong --param=ssp-buffer-size=4 -Werror=trampolines -fomit-frame-pointer -march=i686 -fasynchronous-unwind-tables -mtune=pentium4 -gdwarf-4 -fno-debug-types-section -fvar-tracking-assignments -g2  -MT google/protobuf/protobuf_lite_arena_test-unittest_import_lite.pb.o -MD -MP -MF google/protobuf/.deps/protobuf_lite_arena_test-unittest_import_lite.pb.Tpo -c -o google/protobuf/protobuf_lite_arena_test-unittest_import_lite.pb.o `test -f 'google/protobuf/unittest_import_lite.pb.cc' || echo './'`google/protobuf/unittest_import_lite.pb.cc
mv -f google/protobuf/.deps/protobuf_lite_arena_test-unittest_import_lite.pb.Tpo google/protobuf/.deps/protobuf_lite_arena_test-unittest_import_lite.pb.Po
make[2]: Leaving directory '/tmp/B.I0bZvk/BUILD/protobuf-3.13.0/src'
make[2]: Entering directory '/tmp/B.I0bZvk/BUILD/protobuf-3.13.0/src'
i686-pld-linux-g++ -DHAVE_CONFIG_H -I. -I..  -I/usr/include/gmock -I/usr/include/gtest -DPROTOBUF_TEST_NO_DESCRIPTORS -DGOOGLE_PROTOBUF_NO_RTTI -pthread -DHAVE_PTHREAD=1 -DHAVE_ZLIB=1 -Wall -Wno-sign-compare -O2 -pipe -Wformat -Werror=format-security -gdwarf-4 -fno-debug-types-section -fvar-tracking-assignments -g2 -Wp,-D_FORTIFY_SOURCE=2 -fstack-protector-strong --param=ssp-buffer-size=4 -Werror=trampolines -fomit-frame-pointer -march=i686 -fasynchronous-unwind-tables -mtune=pentium4 -gdwarf-4 -fno-debug-types-section -fvar-tracking-assignments -g2  -MT google/protobuf/util/protobuf_lazy_descriptor_test-json_format_proto3.pb.o -MD -MP -MF google/protobuf/util/.deps/protobuf_lazy_descriptor_test-json_format_proto3.pb.Tpo -c -o google/protobuf/util/protobuf_lazy_descriptor_test-json_format_proto3.pb.o `test -f 'google/protobuf/util/json_format_proto3.pb.cc' || echo './'`google/protobuf/util/json_format_proto3.pb.cc
mv -f google/protobuf/util/.deps/protobuf_lazy_descriptor_test-json_format_proto3.pb.Tpo google/protobuf/util/.deps/protobuf_lazy_descriptor_test-json_format_proto3.pb.Po
make[2]: Leaving directory '/tmp/B.I0bZvk/BUILD/protobuf-3.13.0/src'
make[2]: Entering directory '/tmp/B.I0bZvk/BUILD/protobuf-3.13.0/src'
i686-pld-linux-g++ -DHAVE_CONFIG_H -I. -I..  -I/usr/include/gmock -I/usr/include/gtest -DGOOGLE_PROTOBUF_NO_RTTI -pthread -DHAVE_PTHREAD=1 -DHAVE_ZLIB=1 -Wall -Wno-sign-compare -O2 -pipe -Wformat -Werror=format-security -gdwarf-4 -fno-debug-types-section -fvar-tracking-assignments -g2 -Wp,-D_FORTIFY_SOURCE=2 -fstack-protector-strong --param=ssp-buffer-size=4 -Werror=trampolines -fomit-frame-pointer -march=i686 -fasynchronous-unwind-tables -mtune=pentium4 -gdwarf-4 -fno-debug-types-section -fvar-tracking-assignments -g2  -MT google/protobuf/protobuf_lite_arena_test-unittest_import_public_lite.pb.o -MD -MP -MF google/protobuf/.deps/protobuf_lite_arena_test-unittest_import_public_lite.pb.Tpo -c -o google/protobuf/protobuf_lite_arena_test-unittest_import_public_lite.pb.o `test -f 'google/protobuf/unittest_import_public_lite.pb.cc' || echo './'`google/protobuf/unittest_import_public_lite.pb.cc
mv -f google/protobuf/.deps/protobuf_lite_arena_test-unittest_import_public_lite.pb.Tpo google/protobuf/.deps/protobuf_lite_arena_test-unittest_import_public_lite.pb.Po
make[2]: Leaving directory '/tmp/B.I0bZvk/BUILD/protobuf-3.13.0/src'
make[2]: Entering directory '/tmp/B.I0bZvk/BUILD/protobuf-3.13.0/src'
i686-pld-linux-g++ -DHAVE_CONFIG_H -I. -I..  -I/usr/include/gmock -I/usr/include/gtest -DGOOGLE_PROTOBUF_NO_RTTI -pthread -DHAVE_PTHREAD=1 -DHAVE_ZLIB=1 -Wall -Wno-sign-compare -O2 -pipe -Wformat -Werror=format-security -gdwarf-4 -fno-debug-types-section -fvar-tracking-assignments -g2 -Wp,-D_FORTIFY_SOURCE=2 -fstack-protector-strong --param=ssp-buffer-size=4 -Werror=trampolines -fomit-frame-pointer -march=i686 -fasynchronous-unwind-tables -mtune=pentium4 -gdwarf-4 -fno-debug-types-section -fvar-tracking-assignments -g2  -MT google/protobuf/protobuf_lite_arena_test-map_lite_test_util.o -MD -MP -MF google/protobuf/.deps/protobuf_lite_arena_test-map_lite_test_util.Tpo -c -o google/protobuf/protobuf_lite_arena_test-map_lite_test_util.o `test -f 'google/protobuf/map_lite_test_util.cc' || echo './'`google/protobuf/map_lite_test_util.cc
mv -f google/protobuf/.deps/protobuf_lite_arena_test-map_lite_test_util.Tpo google/protobuf/.deps/protobuf_lite_arena_test-map_lite_test_util.Po
make[2]: Leaving directory '/tmp/B.I0bZvk/BUILD/protobuf-3.13.0/src'
make[2]: Entering directory '/tmp/B.I0bZvk/BUILD/protobuf-3.13.0/src'
i686-pld-linux-g++ -DHAVE_CONFIG_H -I. -I..   -DGOOGLE_PROTOBUF_NO_RTTI -pthread -DHAVE_PTHREAD=1 -DHAVE_ZLIB=1 -Wall -Wextra -Werror -Wno-unused-parameter -O2 -pipe -Wformat -Werror=format-security -gdwarf-4 -fno-debug-types-section -fvar-tracking-assignments -g2 -Wp,-D_FORTIFY_SOURCE=2 -fstack-protector-strong --param=ssp-buffer-size=4 -Werror=trampolines -fomit-frame-pointer -march=i686 -fasynchronous-unwind-tables -mtune=pentium4 -gdwarf-4 -fno-debug-types-section -fvar-tracking-assignments -g2  -MT google/protobuf/no_warning_test-unittest_import_lite.pb.o -MD -MP -MF google/protobuf/.deps/no_warning_test-unittest_import_lite.pb.Tpo -c -o google/protobuf/no_warning_test-unittest_import_lite.pb.o `test -f 'google/protobuf/unittest_import_lite.pb.cc' || echo './'`google/protobuf/unittest_import_lite.pb.cc
mv -f google/protobuf/.deps/no_warning_test-unittest_import_lite.pb.Tpo google/protobuf/.deps/no_warning_test-unittest_import_lite.pb.Po
make[2]: Leaving directory '/tmp/B.I0bZvk/BUILD/protobuf-3.13.0/src'
make[2]: Entering directory '/tmp/B.I0bZvk/BUILD/protobuf-3.13.0/src'
i686-pld-linux-g++ -DHAVE_CONFIG_H -I. -I..   -DGOOGLE_PROTOBUF_NO_RTTI -pthread -DHAVE_PTHREAD=1 -DHAVE_ZLIB=1 -Wall -Wextra -Werror -Wno-unused-parameter -O2 -pipe -Wformat -Werror=format-security -gdwarf-4 -fno-debug-types-section -fvar-tracking-assignments -g2 -Wp,-D_FORTIFY_SOURCE=2 -fstack-protector-strong --param=ssp-buffer-size=4 -Werror=trampolines -fomit-frame-pointer -march=i686 -fasynchronous-unwind-tables -mtune=pentium4 -gdwarf-4 -fno-debug-types-section -fvar-tracking-assignments -g2  -MT google/protobuf/no_warning_test-unittest_import_public_lite.pb.o -MD -MP -MF google/protobuf/.deps/no_warning_test-unittest_import_public_lite.pb.Tpo -c -o google/protobuf/no_warning_test-unittest_import_public_lite.pb.o `test -f 'google/protobuf/unittest_import_public_lite.pb.cc' || echo './'`google/protobuf/unittest_import_public_lite.pb.cc
mv -f google/protobuf/.deps/no_warning_test-unittest_import_public_lite.pb.Tpo google/protobuf/.deps/no_warning_test-unittest_import_public_lite.pb.Po
make[2]: Leaving directory '/tmp/B.I0bZvk/BUILD/protobuf-3.13.0/src'
make[2]: Entering directory '/tmp/B.I0bZvk/BUILD/protobuf-3.13.0/src'
i686-pld-linux-g++ -DHAVE_CONFIG_H -I. -I..  -I/usr/include/gmock -I/usr/include/gtest -DGOOGLE_PROTOBUF_NO_RTTI -pthread -DHAVE_PTHREAD=1 -DHAVE_ZLIB=1 -Wall -Wno-sign-compare -O2 -pipe -Wformat -Werror=format-security -gdwarf-4 -fno-debug-types-section -fvar-tracking-assignments -g2 -Wp,-D_FORTIFY_SOURCE=2 -fstack-protector-strong --param=ssp-buffer-size=4 -Werror=trampolines -fomit-frame-pointer -march=i686 -fasynchronous-unwind-tables -mtune=pentium4 -gdwarf-4 -fno-debug-types-section -fvar-tracking-assignments -g2  -MT google/protobuf/protobuf_lite_arena_test-unittest_lite.pb.o -MD -MP -MF google/protobuf/.deps/protobuf_lite_arena_test-unittest_lite.pb.Tpo -c -o google/protobuf/protobuf_lite_arena_test-unittest_lite.pb.o `test -f 'google/protobuf/unittest_lite.pb.cc' || echo './'`google/protobuf/unittest_lite.pb.cc
mv -f google/protobuf/.deps/protobuf_lite_arena_test-unittest_lite.pb.Tpo google/protobuf/.deps/protobuf_lite_arena_test-unittest_lite.pb.Po
make[2]: Leaving directory '/tmp/B.I0bZvk/BUILD/protobuf-3.13.0/src'
make[2]: Entering directory '/tmp/B.I0bZvk/BUILD/protobuf-3.13.0/src'
i686-pld-linux-g++ -DHAVE_CONFIG_H -I. -I..   -DGOOGLE_PROTOBUF_NO_RTTI -pthread -DHAVE_PTHREAD=1 -DHAVE_ZLIB=1 -Wall -Wextra -Werror -Wno-unused-parameter -O2 -pipe -Wformat -Werror=format-security -gdwarf-4 -fno-debug-types-section -fvar-tracking-assignments -g2 -Wp,-D_FORTIFY_SOURCE=2 -fstack-protector-strong --param=ssp-buffer-size=4 -Werror=trampolines -fomit-frame-pointer -march=i686 -fasynchronous-unwind-tables -mtune=pentium4 -gdwarf-4 -fno-debug-types-section -fvar-tracking-assignments -g2  -MT google/protobuf/no_warning_test-any_test.pb.o -MD -MP -MF google/protobuf/.deps/no_warning_test-any_test.pb.Tpo -c -o google/protobuf/no_warning_test-any_test.pb.o `test -f 'google/protobuf/any_test.pb.cc' || echo './'`google/protobuf/any_test.pb.cc
mv -f google/protobuf/.deps/no_warning_test-any_test.pb.Tpo google/protobuf/.deps/no_warning_test-any_test.pb.Po
make[2]: Leaving directory '/tmp/B.I0bZvk/BUILD/protobuf-3.13.0/src'
make[2]: Entering directory '/tmp/B.I0bZvk/BUILD/protobuf-3.13.0/src'
i686-pld-linux-g++ -DHAVE_CONFIG_H -I. -I..   -DGOOGLE_PROTOBUF_NO_RTTI -pthread -DHAVE_PTHREAD=1 -DHAVE_ZLIB=1 -Wall -Wextra -Werror -Wno-unused-parameter -O2 -pipe -Wformat -Werror=format-security -gdwarf-4 -fno-debug-types-section -fvar-tracking-assignments -g2 -Wp,-D_FORTIFY_SOURCE=2 -fstack-protector-strong --param=ssp-buffer-size=4 -Werror=trampolines -fomit-frame-pointer -march=i686 -fasynchronous-unwind-tables -mtune=pentium4 -gdwarf-4 -fno-debug-types-section -fvar-tracking-assignments -g2  -MT google/protobuf/compiler/cpp/no_warning_test-cpp_test_large_enum_value.pb.o -MD -MP -MF google/protobuf/compiler/cpp/.deps/no_warning_test-cpp_test_large_enum_value.pb.Tpo -c -o google/protobuf/compiler/cpp/no_warning_test-cpp_test_large_enum_value.pb.o `test -f 'google/protobuf/compiler/cpp/cpp_test_large_enum_value.pb.cc' || echo './'`google/protobuf/compiler/cpp/cpp_test_large_enum_value.pb.cc
mv -f google/protobuf/compiler/cpp/.deps/no_warning_test-cpp_test_large_enum_value.pb.Tpo google/protobuf/compiler/cpp/.deps/no_warning_test-cpp_test_large_enum_value.pb.Po
make[2]: Leaving directory '/tmp/B.I0bZvk/BUILD/protobuf-3.13.0/src'
make[2]: Entering directory '/tmp/B.I0bZvk/BUILD/protobuf-3.13.0/src'
i686-pld-linux-g++ -DHAVE_CONFIG_H -I. -I..  -I/usr/include/gmock -I/usr/include/gtest -DGOOGLE_PROTOBUF_NO_RTTI -pthread -DHAVE_PTHREAD=1 -DHAVE_ZLIB=1 -Wall -Wno-sign-compare -O2 -pipe -Wformat -Werror=format-security -gdwarf-4 -fno-debug-types-section -fvar-tracking-assignments -g2 -Wp,-D_FORTIFY_SOURCE=2 -fstack-protector-strong --param=ssp-buffer-size=4 -Werror=trampolines -fomit-frame-pointer -march=i686 -fasynchronous-unwind-tables -mtune=pentium4 -gdwarf-4 -fno-debug-types-section -fvar-tracking-assignments -g2  -MT google/protobuf/protobuf_lite_test-map_lite_unittest.pb.o -MD -MP -MF google/protobuf/.deps/protobuf_lite_test-map_lite_unittest.pb.Tpo -c -o google/protobuf/protobuf_lite_test-map_lite_unittest.pb.o `test -f 'google/protobuf/map_lite_unittest.pb.cc' || echo './'`google/protobuf/map_lite_unittest.pb.cc
mv -f google/protobuf/.deps/protobuf_lite_test-map_lite_unittest.pb.Tpo google/protobuf/.deps/protobuf_lite_test-map_lite_unittest.pb.Po
make[2]: Leaving directory '/tmp/B.I0bZvk/BUILD/protobuf-3.13.0/src'
make[2]: Entering directory '/tmp/B.I0bZvk/BUILD/protobuf-3.13.0/src'
i686-pld-linux-g++ -DHAVE_CONFIG_H -I. -I..   -DGOOGLE_PROTOBUF_NO_RTTI -pthread -DHAVE_PTHREAD=1 -DHAVE_ZLIB=1 -Wall -Wextra -Werror -Wno-unused-parameter -O2 -pipe -Wformat -Werror=format-security -gdwarf-4 -fno-debug-types-section -fvar-tracking-assignments -g2 -Wp,-D_FORTIFY_SOURCE=2 -fstack-protector-strong --param=ssp-buffer-size=4 -Werror=trampolines -fomit-frame-pointer -march=i686 -fasynchronous-unwind-tables -mtune=pentium4 -gdwarf-4 -fno-debug-types-section -fvar-tracking-assignments -g2  -MT google/protobuf/compiler/cpp/no_warning_test-cpp_test_bad_identifiers.pb.o -MD -MP -MF google/protobuf/compiler/cpp/.deps/no_warning_test-cpp_test_bad_identifiers.pb.Tpo -c -o google/protobuf/compiler/cpp/no_warning_test-cpp_test_bad_identifiers.pb.o `test -f 'google/protobuf/compiler/cpp/cpp_test_bad_identifiers.pb.cc' || echo './'`google/protobuf/compiler/cpp/cpp_test_bad_identifiers.pb.cc
mv -f google/protobuf/compiler/cpp/.deps/no_warning_test-cpp_test_bad_identifiers.pb.Tpo google/protobuf/compiler/cpp/.deps/no_warning_test-cpp_test_bad_identifiers.pb.Po
make[2]: Leaving directory '/tmp/B.I0bZvk/BUILD/protobuf-3.13.0/src'
make[2]: Entering directory '/tmp/B.I0bZvk/BUILD/protobuf-3.13.0/src'
i686-pld-linux-g++ -DHAVE_CONFIG_H -I. -I..  -I/usr/include/gmock -I/usr/include/gtest -DGOOGLE_PROTOBUF_NO_RTTI -pthread -DHAVE_PTHREAD=1 -DHAVE_ZLIB=1 -Wall -Wno-sign-compare -O2 -pipe -Wformat -Werror=format-security -gdwarf-4 -fno-debug-types-section -fvar-tracking-assignments -g2 -Wp,-D_FORTIFY_SOURCE=2 -fstack-protector-strong --param=ssp-buffer-size=4 -Werror=trampolines -fomit-frame-pointer -march=i686 -fasynchronous-unwind-tables -mtune=pentium4 -gdwarf-4 -fno-debug-types-section -fvar-tracking-assignments -g2  -MT google/protobuf/protobuf_lite_test-test_util_lite.o -MD -MP -MF google/protobuf/.deps/protobuf_lite_test-test_util_lite.Tpo -c -o google/protobuf/protobuf_lite_test-test_util_lite.o `test -f 'google/protobuf/test_util_lite.cc' || echo './'`google/protobuf/test_util_lite.cc
mv -f google/protobuf/.deps/protobuf_lite_test-test_util_lite.Tpo google/protobuf/.deps/protobuf_lite_test-test_util_lite.Po
make[2]: Leaving directory '/tmp/B.I0bZvk/BUILD/protobuf-3.13.0/src'
make[2]: Entering directory '/tmp/B.I0bZvk/BUILD/protobuf-3.13.0/src'
i686-pld-linux-g++ -DHAVE_CONFIG_H -I. -I..   -DGOOGLE_PROTOBUF_NO_RTTI -pthread -DHAVE_PTHREAD=1 -DHAVE_ZLIB=1 -Wall -Wextra -Werror -Wno-unused-parameter -O2 -pipe -Wformat -Werror=format-security -gdwarf-4 -fno-debug-types-section -fvar-tracking-assignments -g2 -Wp,-D_FORTIFY_SOURCE=2 -fstack-protector-strong --param=ssp-buffer-size=4 -Werror=trampolines -fomit-frame-pointer -march=i686 -fasynchronous-unwind-tables -mtune=pentium4 -gdwarf-4 -fno-debug-types-section -fvar-tracking-assignments -g2  -MT google/protobuf/no_warning_test-unittest_lite.pb.o -MD -MP -MF google/protobuf/.deps/no_warning_test-unittest_lite.pb.Tpo -c -o google/protobuf/no_warning_test-unittest_lite.pb.o `test -f 'google/protobuf/unittest_lite.pb.cc' || echo './'`google/protobuf/unittest_lite.pb.cc
In file included from ./google/protobuf/map_type_handler.h:34,
                 from ./google/protobuf/map.h:56,
                 from ./google/protobuf/generated_message_table_driven.h:34,
                 from ./google/protobuf/unittest_lite.pb.h:26,
                 from google/protobuf/unittest_lite.pb.cc:4:
./google/protobuf/parse_context.h: In instantiation of 'bool google::protobuf::internal::ExpectTag(const char*) [with unsigned int tag = 248]':
google/protobuf/unittest_lite.pb.cc:2446:73:   required from here
./google/protobuf/parse_context.h:398:17: error: comparison is always false due to limited range of data type [-Werror=type-limits]
  398 |     return *ptr == tag;
      |            ~~~~~^~~~~~
./google/protobuf/parse_context.h: In instantiation of 'bool google::protobuf::internal::ExpectTag(const char*) [with unsigned int tag = 256]':
google/protobuf/unittest_lite.pb.cc:2461:73:   required from here
./google/protobuf/parse_context.h:398:17: error: comparison is always false due to limited range of data type [-Werror=type-limits]
./google/protobuf/parse_context.h: In instantiation of 'bool google::protobuf::internal::ExpectTag(const char*) [with unsigned int tag = 264]':
google/protobuf/unittest_lite.pb.cc:2476:73:   required from here
./google/protobuf/parse_context.h:398:17: error: comparison is always false due to limited range of data type [-Werror=type-limits]
./google/protobuf/parse_context.h: In instantiation of 'bool google::protobuf::internal::ExpectTag(const char*) [with unsigned int tag = 272]':
google/protobuf/unittest_lite.pb.cc:2491:73:   required from here
./google/protobuf/parse_context.h:398:17: error: comparison is always false due to limited range of data type [-Werror=type-limits]
./google/protobuf/parse_context.h: In instantiation of 'bool google::protobuf::internal::ExpectTag(const char*) [with unsigned int tag = 280]':
google/protobuf/unittest_lite.pb.cc:2506:73:   required from here
./google/protobuf/parse_context.h:398:17: error: comparison is always false due to limited range of data type [-Werror=type-limits]
./google/protobuf/parse_context.h: In instantiation of 'bool google::protobuf::internal::ExpectTag(const char*) [with unsigned int tag = 288]':
google/protobuf/unittest_lite.pb.cc:2521:73:   required from here
./google/protobuf/parse_context.h:398:17: error: comparison is always false due to limited range of data type [-Werror=type-limits]
./google/protobuf/parse_context.h: In instantiation of 'bool google::protobuf::internal::ExpectTag(const char*) [with unsigned int tag = 301]':
google/protobuf/unittest_lite.pb.cc:2536:73:   required from here
./google/protobuf/parse_context.h:398:17: error: comparison is always false due to limited range of data type [-Werror=type-limits]
./google/protobuf/parse_context.h: In instantiation of 'bool google::protobuf::internal::ExpectTag(const char*) [with unsigned int tag = 305]':
google/protobuf/unittest_lite.pb.cc:2551:73:   required from here
./google/protobuf/parse_context.h:398:17: error: comparison is always false due to limited range of data type [-Werror=type-limits]
./google/protobuf/parse_context.h: In instantiation of 'bool google::protobuf::internal::ExpectTag(const char*) [with unsigned int tag = 317]':
google/protobuf/unittest_lite.pb.cc:2566:73:   required from here
./google/protobuf/parse_context.h:398:17: error: comparison is always false due to limited range of data type [-Werror=type-limits]
./google/protobuf/parse_context.h: In instantiation of 'bool google::protobuf::internal::ExpectTag(const char*) [with unsigned int tag = 321]':
google/protobuf/unittest_lite.pb.cc:2581:73:   required from here
./google/protobuf/parse_context.h:398:17: error: comparison is always false due to limited range of data type [-Werror=type-limits]
./google/protobuf/parse_context.h: In instantiation of 'bool google::protobuf::internal::ExpectTag(const char*) [with unsigned int tag = 333]':
google/protobuf/unittest_lite.pb.cc:2596:73:   required from here
./google/protobuf/parse_context.h:398:17: error: comparison is always false due to limited range of data type [-Werror=type-limits]
./google/protobuf/parse_context.h: In instantiation of 'bool google::protobuf::internal::ExpectTag(const char*) [with unsigned int tag = 337]':
google/protobuf/unittest_lite.pb.cc:2611:73:   required from here
./google/protobuf/parse_context.h:398:17: error: comparison is always false due to limited range of data type [-Werror=type-limits]
./google/protobuf/parse_context.h: In instantiation of 'bool google::protobuf::internal::ExpectTag(const char*) [with unsigned int tag = 344]':
google/protobuf/unittest_lite.pb.cc:2626:73:   required from here
./google/protobuf/parse_context.h:398:17: error: comparison is always false due to limited range of data type [-Werror=type-limits]
./google/protobuf/parse_context.h: In instantiation of 'bool google::protobuf::internal::ExpectTag(const char*) [with unsigned int tag = 354]':
google/protobuf/unittest_lite.pb.cc:2642:73:   required from here
./google/protobuf/parse_context.h:398:17: error: comparison is always false due to limited range of data type [-Werror=type-limits]
./google/protobuf/parse_context.h: In instantiation of 'bool google::protobuf::internal::ExpectTag(const char*) [with unsigned int tag = 362]':
google/protobuf/unittest_lite.pb.cc:2655:73:   required from here
./google/protobuf/parse_context.h:398:17: error: comparison is always false due to limited range of data type [-Werror=type-limits]
./google/protobuf/parse_context.h: In instantiation of 'bool google::protobuf::internal::ExpectTag(const char*) [with unsigned int tag = 371]':
google/protobuf/unittest_lite.pb.cc:2667:73:   required from here
./google/protobuf/parse_context.h:398:17: error: comparison is always false due to limited range of data type [-Werror=type-limits]
./google/protobuf/parse_context.h: In instantiation of 'bool google::protobuf::internal::ExpectTag(const char*) [with unsigned int tag = 386]':
google/protobuf/unittest_lite.pb.cc:2679:73:   required from here
./google/protobuf/parse_context.h:398:17: error: comparison is always false due to limited range of data type [-Werror=type-limits]
./google/protobuf/parse_context.h: In instantiation of 'bool google::protobuf::internal::ExpectTag(const char*) [with unsigned int tag = 394]':
google/protobuf/unittest_lite.pb.cc:2691:73:   required from here
./google/protobuf/parse_context.h:398:17: error: comparison is always false due to limited range of data type [-Werror=type-limits]
./google/protobuf/parse_context.h: In instantiation of 'bool google::protobuf::internal::ExpectTag(const char*) [with unsigned int tag = 402]':
google/protobuf/unittest_lite.pb.cc:2703:73:   required from here
./google/protobuf/parse_context.h:398:17: error: comparison is always false due to limited range of data type [-Werror=type-limits]
./google/protobuf/parse_context.h: In instantiation of 'bool google::protobuf::internal::ExpectTag(const char*) [with unsigned int tag = 408]':
google/protobuf/unittest_lite.pb.cc:2720:73:   required from here
./google/protobuf/parse_context.h:398:17: error: comparison is always false due to limited range of data type [-Werror=type-limits]
./google/protobuf/parse_context.h: In instantiation of 'bool google::protobuf::internal::ExpectTag(const char*) [with unsigned int tag = 416]':
google/protobuf/unittest_lite.pb.cc:2740:73:   required from here
./google/protobuf/parse_context.h:398:17: error: comparison is always false due to limited range of data type [-Werror=type-limits]
./google/protobuf/parse_context.h: In instantiation of 'bool google::protobuf::internal::ExpectTag(const char*) [with unsigned int tag = 424]':
google/protobuf/unittest_lite.pb.cc:2760:73:   required from here
./google/protobuf/parse_context.h:398:17: error: comparison is always false due to limited range of data type [-Werror=type-limits]
./google/protobuf/parse_context.h: In instantiation of 'bool google::protobuf::internal::ExpectTag(const char*) [with unsigned int tag = 434]':
google/protobuf/unittest_lite.pb.cc:2776:73:   required from here
./google/protobuf/parse_context.h:398:17: error: comparison is always false due to limited range of data type [-Werror=type-limits]
./google/protobuf/parse_context.h: In instantiation of 'bool google::protobuf::internal::ExpectTag(const char*) [with unsigned int tag = 442]':
google/protobuf/unittest_lite.pb.cc:2789:73:   required from here
./google/protobuf/parse_context.h:398:17: error: comparison is always false due to limited range of data type [-Werror=type-limits]
./google/protobuf/parse_context.h: In instantiation of 'bool google::protobuf::internal::ExpectTag(const char*) [with unsigned int tag = 458]':
google/protobuf/unittest_lite.pb.cc:2801:73:   required from here
./google/protobuf/parse_context.h:398:17: error: comparison is always false due to limited range of data type [-Werror=type-limits]
./google/protobuf/parse_context.h: In instantiation of 'bool google::protobuf::internal::ExpectTag(const char*) [with unsigned int tag = 163]':
google/protobuf/unittest_lite.pb.cc:7080:73:   required from here
./google/protobuf/parse_context.h:398:17: error: comparison is always false due to limited range of data type [-Werror=type-limits]
./google/protobuf/parse_context.h: In instantiation of 'bool google::protobuf::internal::ExpectTag(const char*) [with unsigned int tag = 8002]':
google/protobuf/unittest_lite.pb.cc:7092:74:   required from here
./google/protobuf/parse_context.h:398:17: error: comparison is always false due to limited range of data type [-Werror=type-limits]
./google/protobuf/parse_context.h: In instantiation of 'bool google::protobuf::internal::ExpectTag(const char*) [with unsigned int tag = 8010]':
google/protobuf/unittest_lite.pb.cc:7104:74:   required from here
./google/protobuf/parse_context.h:398:17: error: comparison is always false due to limited range of data type [-Werror=type-limits]
cc1plus: all warnings being treated as errors
make[2]: *** [Makefile:4406: google/protobuf/no_warning_test-unittest_lite.pb.o] Error 1
make[2]: Leaving directory '/tmp/B.I0bZvk/BUILD/protobuf-3.13.0/src'
make[2]: *** Waiting for unfinished jobs....
make[2]: Entering directory '/tmp/B.I0bZvk/BUILD/protobuf-3.13.0/src'
i686-pld-linux-g++ -DHAVE_CONFIG_H -I. -I..   -DGOOGLE_PROTOBUF_NO_RTTI -pthread -DHAVE_PTHREAD=1 -DHAVE_ZLIB=1 -Wall -Wextra -Werror -Wno-unused-parameter -O2 -pipe -Wformat -Werror=format-security -gdwarf-4 -fno-debug-types-section -fvar-tracking-assignments -g2 -Wp,-D_FORTIFY_SOURCE=2 -fstack-protector-strong --param=ssp-buffer-size=4 -Werror=trampolines -fomit-frame-pointer -march=i686 -fasynchronous-unwind-tables -mtune=pentium4 -gdwarf-4 -fno-debug-types-section -fvar-tracking-assignments -g2  -MT google/protobuf/no_warning_test-unittest_arena.pb.o -MD -MP -MF google/protobuf/.deps/no_warning_test-unittest_arena.pb.Tpo -c -o google/protobuf/no_warning_test-unittest_arena.pb.o `test -f 'google/protobuf/unittest_arena.pb.cc' || echo './'`google/protobuf/unittest_arena.pb.cc
mv -f google/protobuf/.deps/no_warning_test-unittest_arena.pb.Tpo google/protobuf/.deps/no_warning_test-unittest_arena.pb.Po
make[2]: Leaving directory '/tmp/B.I0bZvk/BUILD/protobuf-3.13.0/src'
make[2]: Entering directory '/tmp/B.I0bZvk/BUILD/protobuf-3.13.0/src'
i686-pld-linux-g++ -DHAVE_CONFIG_H -I. -I..  -I/usr/include/gmock -I/usr/include/gtest -DPROTOBUF_TEST_NO_DESCRIPTORS -DGOOGLE_PROTOBUF_NO_RTTI -pthread -DHAVE_PTHREAD=1 -DHAVE_ZLIB=1 -Wall -Wno-sign-compare -O2 -pipe -Wformat -Werror=format-security -gdwarf-4 -fno-debug-types-section -fvar-tracking-assignments -g2 -Wp,-D_FORTIFY_SOURCE=2 -fstack-protector-strong --param=ssp-buffer-size=4 -Werror=trampolines -fomit-frame-pointer -march=i686 -fasynchronous-unwind-tables -mtune=pentium4 -gdwarf-4 -fno-debug-types-section -fvar-tracking-assignments -g2  -MT google/protobuf/protobuf_lazy_descriptor_test-unittest_enormous_descriptor.pb.o -MD -MP -MF google/protobuf/.deps/protobuf_lazy_descriptor_test-unittest_enormous_descriptor.pb.Tpo -c -o google/protobuf/protobuf_lazy_descriptor_test-unittest_enormous_descriptor.pb.o `test -f 'google/protobuf/unittest_enormous_descriptor.pb.cc' || echo './'`google/protobuf/unittest_enormous_descriptor.pb.cc
mv -f google/protobuf/.deps/protobuf_lazy_descriptor_test-unittest_enormous_descriptor.pb.Tpo google/protobuf/.deps/protobuf_lazy_descriptor_test-unittest_enormous_descriptor.pb.Po
make[2]: Leaving directory '/tmp/B.I0bZvk/BUILD/protobuf-3.13.0/src'
make[2]: Entering directory '/tmp/B.I0bZvk/BUILD/protobuf-3.13.0/src'
i686-pld-linux-g++ -DHAVE_CONFIG_H -I. -I..  -I/usr/include/gmock -I/usr/include/gtest -DGOOGLE_PROTOBUF_NO_RTTI -pthread -DHAVE_PTHREAD=1 -DHAVE_ZLIB=1 -Wall -Wno-sign-compare -O2 -pipe -Wformat -Werror=format-security -gdwarf-4 -fno-debug-types-section -fvar-tracking-assignments -g2 -Wp,-D_FORTIFY_SOURCE=2 -fstack-protector-strong --param=ssp-buffer-size=4 -Werror=trampolines -fomit-frame-pointer -march=i686 -fasynchronous-unwind-tables -mtune=pentium4 -gdwarf-4 -fno-debug-types-section -fvar-tracking-assignments -g2  -MT google/protobuf/protobuf_lite_arena_test-map_lite_unittest.pb.o -MD -MP -MF google/protobuf/.deps/protobuf_lite_arena_test-map_lite_unittest.pb.Tpo -c -o google/protobuf/protobuf_lite_arena_test-map_lite_unittest.pb.o `test -f 'google/protobuf/map_lite_unittest.pb.cc' || echo './'`google/protobuf/map_lite_unittest.pb.cc
mv -f google/protobuf/.deps/protobuf_lite_arena_test-map_lite_unittest.pb.Tpo google/protobuf/.deps/protobuf_lite_arena_test-map_lite_unittest.pb.Po
make[2]: Leaving directory '/tmp/B.I0bZvk/BUILD/protobuf-3.13.0/src'
make[2]: Entering directory '/tmp/B.I0bZvk/BUILD/protobuf-3.13.0/src'
i686-pld-linux-g++ -DHAVE_CONFIG_H -I. -I..   -DGOOGLE_PROTOBUF_NO_RTTI -pthread -DHAVE_PTHREAD=1 -DHAVE_ZLIB=1 -Wall -Wextra -Werror -Wno-unused-parameter -O2 -pipe -Wformat -Werror=format-security -gdwarf-4 -fno-debug-types-section -fvar-tracking-assignments -g2 -Wp,-D_FORTIFY_SOURCE=2 -fstack-protector-strong --param=ssp-buffer-size=4 -Werror=trampolines -fomit-frame-pointer -march=i686 -fasynchronous-unwind-tables -mtune=pentium4 -gdwarf-4 -fno-debug-types-section -fvar-tracking-assignments -g2  -MT google/protobuf/no_warning_test-unittest_custom_options.pb.o -MD -MP -MF google/protobuf/.deps/no_warning_test-unittest_custom_options.pb.Tpo -c -o google/protobuf/no_warning_test-unittest_custom_options.pb.o `test -f 'google/protobuf/unittest_custom_options.pb.cc' || echo './'`google/protobuf/unittest_custom_options.pb.cc
mv -f google/protobuf/.deps/no_warning_test-unittest_custom_options.pb.Tpo google/protobuf/.deps/no_warning_test-unittest_custom_options.pb.Po
make[2]: Leaving directory '/tmp/B.I0bZvk/BUILD/protobuf-3.13.0/src'
make[2]: Entering directory '/tmp/B.I0bZvk/BUILD/protobuf-3.13.0/src'
i686-pld-linux-g++ -DHAVE_CONFIG_H -I. -I..  -I/usr/include/gmock -I/usr/include/gtest -DGOOGLE_PROTOBUF_NO_RTTI -pthread -DHAVE_PTHREAD=1 -DHAVE_ZLIB=1 -Wall -Wno-sign-compare -O2 -pipe -Wformat -Werror=format-security -gdwarf-4 -fno-debug-types-section -fvar-tracking-assignments -g2 -Wp,-D_FORTIFY_SOURCE=2 -fstack-protector-strong --param=ssp-buffer-size=4 -Werror=trampolines -fomit-frame-pointer -march=i686 -fasynchronous-unwind-tables -mtune=pentium4 -gdwarf-4 -fno-debug-types-section -fvar-tracking-assignments -g2  -MT google/protobuf/protobuf_lite_arena_test-test_util_lite.o -MD -MP -MF google/protobuf/.deps/protobuf_lite_arena_test-test_util_lite.Tpo -c -o google/protobuf/protobuf_lite_arena_test-test_util_lite.o `test -f 'google/protobuf/test_util_lite.cc' || echo './'`google/protobuf/test_util_lite.cc
mv -f google/protobuf/.deps/protobuf_lite_arena_test-test_util_lite.Tpo google/protobuf/.deps/protobuf_lite_arena_test-test_util_lite.Po
make[2]: Leaving directory '/tmp/B.I0bZvk/BUILD/protobuf-3.13.0/src'
make[2]: Entering directory '/tmp/B.I0bZvk/BUILD/protobuf-3.13.0/src'
i686-pld-linux-g++ -DHAVE_CONFIG_H -I. -I..   -DGOOGLE_PROTOBUF_NO_RTTI -pthread -DHAVE_PTHREAD=1 -DHAVE_ZLIB=1 -Wall -Wextra -Werror -Wno-unused-parameter -O2 -pipe -Wformat -Werror=format-security -gdwarf-4 -fno-debug-types-section -fvar-tracking-assignments -g2 -Wp,-D_FORTIFY_SOURCE=2 -fstack-protector-strong --param=ssp-buffer-size=4 -Werror=trampolines -fomit-frame-pointer -march=i686 -fasynchronous-unwind-tables -mtune=pentium4 -gdwarf-4 -fno-debug-types-section -fvar-tracking-assignments -g2  -MT google/protobuf/no_warning_test-map_lite_unittest.pb.o -MD -MP -MF google/protobuf/.deps/no_warning_test-map_lite_unittest.pb.Tpo -c -o google/protobuf/no_warning_test-map_lite_unittest.pb.o `test -f 'google/protobuf/map_lite_unittest.pb.cc' || echo './'`google/protobuf/map_lite_unittest.pb.cc
In file included from ./google/protobuf/map_type_handler.h:34,
                 from ./google/protobuf/map.h:56,
                 from ./google/protobuf/generated_message_table_driven.h:34,
                 from ./google/protobuf/map_lite_unittest.pb.h:26,
                 from google/protobuf/map_lite_unittest.pb.cc:4:
./google/protobuf/parse_context.h: In instantiation of 'bool google::protobuf::internal::ExpectTag(const char*) [with unsigned int tag = 130]':
google/protobuf/map_lite_unittest.pb.cc:1593:73:   required from here
./google/protobuf/parse_context.h:398:17: error: comparison is always false due to limited range of data type [-Werror=type-limits]
  398 |     return *ptr == tag;
      |            ~~~~~^~~~~~
./google/protobuf/parse_context.h: In instantiation of 'bool google::protobuf::internal::ExpectTag(const char*) [with unsigned int tag = 138]':
google/protobuf/map_lite_unittest.pb.cc:1605:73:   required from here
./google/protobuf/parse_context.h:398:17: error: comparison is always false due to limited range of data type [-Werror=type-limits]
./google/protobuf/parse_context.h: In instantiation of 'bool google::protobuf::internal::ExpectTag(const char*) [with unsigned int tag = 146]':
google/protobuf/map_lite_unittest.pb.cc:1617:73:   required from here
./google/protobuf/parse_context.h:398:17: error: comparison is always false due to limited range of data type [-Werror=type-limits]
./google/protobuf/parse_context.h: In instantiation of 'bool google::protobuf::internal::ExpectTag(const char*) [with unsigned int tag = 810]':
google/protobuf/map_lite_unittest.pb.cc:4074:73:   required from here
./google/protobuf/parse_context.h:398:17: error: comparison is always false due to limited range of data type [-Werror=type-limits]
./google/protobuf/parse_context.h: In instantiation of 'bool google::protobuf::internal::ExpectTag(const char*) [with unsigned int tag = 818]':
google/protobuf/map_lite_unittest.pb.cc:4087:73:   required from here
./google/protobuf/parse_context.h:398:17: error: comparison is always false due to limited range of data type [-Werror=type-limits]
cc1plus: all warnings being treated as errors
make[2]: *** [Makefile:4392: google/protobuf/no_warning_test-map_lite_unittest.pb.o] Error 1
make[2]: Leaving directory '/tmp/B.I0bZvk/BUILD/protobuf-3.13.0/src'
make[2]: Entering directory '/tmp/B.I0bZvk/BUILD/protobuf-3.13.0/src'
i686-pld-linux-g++ -DHAVE_CONFIG_H -I. -I..   -DGOOGLE_PROTOBUF_NO_RTTI -pthread -DHAVE_PTHREAD=1 -DHAVE_ZLIB=1 -Wall -Wextra -Werror -Wno-unused-parameter -O2 -pipe -Wformat -Werror=format-security -gdwarf-4 -fno-debug-types-section -fvar-tracking-assignments -g2 -Wp,-D_FORTIFY_SOURCE=2 -fstack-protector-strong --param=ssp-buffer-size=4 -Werror=trampolines -fomit-frame-pointer -march=i686 -fasynchronous-unwind-tables -mtune=pentium4 -gdwarf-4 -fno-debug-types-section -fvar-tracking-assignments -g2  -MT google/protobuf/no_warning_test-map_proto2_unittest.pb.o -MD -MP -MF google/protobuf/.deps/no_warning_test-map_proto2_unittest.pb.Tpo -c -o google/protobuf/no_warning_test-map_proto2_unittest.pb.o `test -f 'google/protobuf/map_proto2_unittest.pb.cc' || echo './'`google/protobuf/map_proto2_unittest.pb.cc
In file included from ./google/protobuf/map_type_handler.h:34,
                 from ./google/protobuf/map.h:56,
                 from ./google/protobuf/generated_message_table_driven.h:34,
                 from ./google/protobuf/map_proto2_unittest.pb.h:26,
                 from google/protobuf/map_proto2_unittest.pb.cc:4:
./google/protobuf/parse_context.h: In instantiation of 'bool google::protobuf::internal::ExpectTag(const char*) [with unsigned int tag = 810]':
google/protobuf/map_proto2_unittest.pb.cc:1026:73:   required from here
./google/protobuf/parse_context.h:398:17: error: comparison is always false due to limited range of data type [-Werror=type-limits]
  398 |     return *ptr == tag;
      |            ~~~~~^~~~~~
./google/protobuf/parse_context.h: In instantiation of 'bool google::protobuf::internal::ExpectTag(const char*) [with unsigned int tag = 818]':
google/protobuf/map_proto2_unittest.pb.cc:1039:73:   required from here
./google/protobuf/parse_context.h:398:17: error: comparison is always false due to limited range of data type [-Werror=type-limits]
cc1plus: all warnings being treated as errors
make[2]: *** [Makefile:4490: google/protobuf/no_warning_test-map_proto2_unittest.pb.o] Error 1
make[2]: Leaving directory '/tmp/B.I0bZvk/BUILD/protobuf-3.13.0/src'
make[2]: Entering directory '/tmp/B.I0bZvk/BUILD/protobuf-3.13.0/src'
i686-pld-linux-g++ -DHAVE_CONFIG_H -I. -I..   -DGOOGLE_PROTOBUF_NO_RTTI -pthread -DHAVE_PTHREAD=1 -DHAVE_ZLIB=1 -Wall -Wextra -Werror -Wno-unused-parameter -O2 -pipe -Wformat -Werror=format-security -gdwarf-4 -fno-debug-types-section -fvar-tracking-assignments -g2 -Wp,-D_FORTIFY_SOURCE=2 -fstack-protector-strong --param=ssp-buffer-size=4 -Werror=trampolines -fomit-frame-pointer -march=i686 -fasynchronous-unwind-tables -mtune=pentium4 -gdwarf-4 -fno-debug-types-section -fvar-tracking-assignments -g2  -MT google/protobuf/no_warning_test-map_unittest.pb.o -MD -MP -MF google/protobuf/.deps/no_warning_test-map_unittest.pb.Tpo -c -o google/protobuf/no_warning_test-map_unittest.pb.o `test -f 'google/protobuf/map_unittest.pb.cc' || echo './'`google/protobuf/map_unittest.pb.cc
In file included from ./google/protobuf/map_type_handler.h:34,
                 from ./google/protobuf/map.h:56,
                 from ./google/protobuf/generated_message_table_driven.h:34,
                 from ./google/protobuf/map_unittest.pb.h:26,
                 from google/protobuf/map_unittest.pb.cc:4:
./google/protobuf/parse_context.h: In instantiation of 'bool google::protobuf::internal::ExpectTag(const char*) [with unsigned int tag = 130]':
google/protobuf/map_unittest.pb.cc:2493:73:   required from here
./google/protobuf/parse_context.h:398:17: error: comparison is always false due to limited range of data type [-Werror=type-limits]
  398 |     return *ptr == tag;
      |            ~~~~~^~~~~~
./google/protobuf/parse_context.h: In instantiation of 'bool google::protobuf::internal::ExpectTag(const char*) [with unsigned int tag = 138]':
google/protobuf/map_unittest.pb.cc:2505:73:   required from here
./google/protobuf/parse_context.h:398:17: error: comparison is always false due to limited range of data type [-Werror=type-limits]
./google/protobuf/parse_context.h: In instantiation of 'bool google::protobuf::internal::ExpectTag(const char*) [with unsigned int tag = 146]':
google/protobuf/map_unittest.pb.cc:2517:73:   required from here
./google/protobuf/parse_context.h:398:17: error: comparison is always false due to limited range of data type [-Werror=type-limits]
./google/protobuf/parse_context.h: In instantiation of 'bool google::protobuf::internal::ExpectTag(const char*) [with unsigned int tag = 154]':
google/protobuf/map_unittest.pb.cc:2529:73:   required from here
./google/protobuf/parse_context.h:398:17: error: comparison is always false due to limited range of data type [-Werror=type-limits]
cc1plus: all warnings being treated as errors
make[2]: *** [Makefile:4504: google/protobuf/no_warning_test-map_unittest.pb.o] Error 1
make[2]: Leaving directory '/tmp/B.I0bZvk/BUILD/protobuf-3.13.0/src'
make[1]: *** [Makefile:8180: check-am] Error 2
make: *** [Makefile:1866: check-recursive] Error 1
error: Bad exit status from /tmp/B.I0bZvk/BUILD/tmp/rpm-tmp.71591 (%build)


RPM build errors:
    Bad exit status from /tmp/B.I0bZvk/BUILD/tmp/rpm-tmp.71591 (%build)
ended at: Tue Sep  8 21:43:47 2020, done in 0:08:55.206661
error: No files produced.
+ chmod -R u+rwX /tmp/B.I0bZvk/BUILD
+ rm -rf /tmp/B.I0bZvk/tmp /tmp/B.I0bZvk/BUILD
+ rm -rf /tmp/B.I0bZvk
Begin-PLD-Builder-Info
Build-Time: user:3617.75s sys:124.51s real:541.75s (faults io:6 non-io:28865982)

End-PLD-Builder-Info
[Back to list of logs] [View rpm -qa of builder]