FailedOk

th/SRPMS[OK]
th/x32[OK]
th/i686[OK]
th/x86_64[OK]

ac/SRPMS[OK]
ac/i386[OK]
ac/i586[OK]
ac/i686[OK]
ac/alpha[OK]
ac/amd64[OK]
ac/athlon[OK]
ac/ppc[OK]
ac/sparc[OK]
ac/sparc64[OK]

Advanced Search
main()
Powered by PLD Linux
(c) 2002-2020 PLD Team
$Revision: 1.37 $
Powered by Multics.
Your IP: 18.204.229.70

pulseview 5ac16081-83ff-48b3-8b96-a1978771e8bc

Status:Failed
Source URL:https://buildlogs.pld-linux.org/pld/th/i686/FAIL/pulseview,5ac16081-83ff-48b3-8b96-a1978771e8bc.bz2
text/plain URL:View!
full text:View!
rpm -qa of builder:View!
Date:2020/07/31 06:31:06
Runtime:0:00:25.612594

Toc:

  • error 1
  • /tmp/B.tU9xM8/BUILD/pulseview-0.4.2/pv/util.cpp:140:6: error: no match for 'operator<<' (operand types are 'QTextStream' and '<unresolved overloaded function type>')
  • error 2
  • /tmp/B.tU9xM8/BUILD/pulseview-0.4.2/pv/util.cpp:178:6: error: no match for 'operator<<' (operand types are 'QTextStream' and '<unresolved overloaded function type>')
  • error 3
  • make[2]: *** [CMakeFiles/pulseview.dir/build.make:417: CMakeFiles/pulseview.dir/pv/util.cpp.o] Error 1
  • error 4
  • make[1]: *** [CMakeFiles/Makefile2:122: CMakeFiles/pulseview.dir/all] Error 2
  • error 5
  • error: Bad exit status from /tmp/B.tU9xM8/BUILD/tmp/rpm-tmp.12808 (%build)
  • error 6
  • RPM build errors:
  • error 7
  • error: No files produced.

Content:

-- Performing Test HAVE_UNALIGNED_LITTLE_ENDIAN_ACCESS - Success
-- PulseView version: 0.4.2
-- Configuring done
-- Generating done
CMake Warning:
  Manually-specified variables were not used by the project:

    CMAKE_Fortran_FLAGS_PLD
    CMAKE_INSTALL_LOCALSTATEDIRPATH
    CMAKE_INSTALL_SHAREDSTATEDIRPATH
    SYSCONF_INSTALL_DIR


-- Build files have been written to: /tmp/B.tU9xM8/BUILD/pulseview-0.4.2/build
+ /usr/bin/make -Otarget -j9
/usr/bin/cmake -S/tmp/B.tU9xM8/BUILD/pulseview-0.4.2 -B/tmp/B.tU9xM8/BUILD/pulseview-0.4.2/build --check-build-system CMakeFiles/Makefile.cmake 0
/usr/bin/cmake -E cmake_progress_start /tmp/B.tU9xM8/BUILD/pulseview-0.4.2/build/CMakeFiles /tmp/B.tU9xM8/BUILD/pulseview-0.4.2/build/CMakeFiles/progress.marks
/usr/bin/make  -f CMakeFiles/Makefile2 all
/usr/bin/make  -f CMakeFiles/pulseview_autogen.dir/build.make CMakeFiles/pulseview_autogen.dir/depend
make[2]: Entering directory '/tmp/B.tU9xM8/BUILD/pulseview-0.4.2/build'
cd /tmp/B.tU9xM8/BUILD/pulseview-0.4.2/build && /usr/bin/cmake -E cmake_depends "Unix Makefiles" /tmp/B.tU9xM8/BUILD/pulseview-0.4.2 /tmp/B.tU9xM8/BUILD/pulseview-0.4.2 /tmp/B.tU9xM8/BUILD/pulseview-0.4.2/build /tmp/B.tU9xM8/BUILD/pulseview-0.4.2/build /tmp/B.tU9xM8/BUILD/pulseview-0.4.2/build/CMakeFiles/pulseview_autogen.dir/DependInfo.cmake --color=
Scanning dependencies of target pulseview_autogen
make[2]: Leaving directory '/tmp/B.tU9xM8/BUILD/pulseview-0.4.2/build'
/usr/bin/make  -f CMakeFiles/pulseview_autogen.dir/build.make CMakeFiles/pulseview_autogen.dir/build
make[2]: Entering directory '/tmp/B.tU9xM8/BUILD/pulseview-0.4.2/build'
[  1%] Automatic MOC for target pulseview
/usr/bin/cmake -E cmake_autogen /tmp/B.tU9xM8/BUILD/pulseview-0.4.2/build/CMakeFiles/pulseview_autogen.dir/AutogenInfo.json PLD
make[2]: Leaving directory '/tmp/B.tU9xM8/BUILD/pulseview-0.4.2/build'
make[1]: Entering directory '/tmp/B.tU9xM8/BUILD/pulseview-0.4.2/build'
[  1%] Built target pulseview_autogen
make[1]: Leaving directory '/tmp/B.tU9xM8/BUILD/pulseview-0.4.2/build'
/usr/bin/make  -f CMakeFiles/pulseview.dir/build.make CMakeFiles/pulseview.dir/depend
make[2]: Entering directory '/tmp/B.tU9xM8/BUILD/pulseview-0.4.2/build'
[  3%] Generating l10n/de.qm
/usr/lib/qt5/bin/lrelease /tmp/B.tU9xM8/BUILD/pulseview-0.4.2/l10n/de.ts -qm /tmp/B.tU9xM8/BUILD/pulseview-0.4.2/build/l10n/de.qm
Updating '/tmp/B.tU9xM8/BUILD/pulseview-0.4.2/build/l10n/de.qm'...
    Generated 271 translation(s) (271 finished and 0 unfinished)
make[2]: Leaving directory '/tmp/B.tU9xM8/BUILD/pulseview-0.4.2/build'
make[2]: Entering directory '/tmp/B.tU9xM8/BUILD/pulseview-0.4.2/build'
[  2%] Generating qrc_pulseview.cpp
/usr/lib/qt5/bin/rcc --name pulseview --output /tmp/B.tU9xM8/BUILD/pulseview-0.4.2/build/qrc_pulseview.cpp /tmp/B.tU9xM8/BUILD/pulseview-0.4.2/pulseview.qrc
make[2]: Leaving directory '/tmp/B.tU9xM8/BUILD/pulseview-0.4.2/build'
make[2]: Entering directory '/tmp/B.tU9xM8/BUILD/pulseview-0.4.2/build'
[  4%] Generating qrc_translations.cpp
/usr/lib/qt5/bin/rcc --name translations --output /tmp/B.tU9xM8/BUILD/pulseview-0.4.2/build/qrc_translations.cpp /tmp/B.tU9xM8/BUILD/pulseview-0.4.2/build/translations.qrc
make[2]: Leaving directory '/tmp/B.tU9xM8/BUILD/pulseview-0.4.2/build'
make[2]: Entering directory '/tmp/B.tU9xM8/BUILD/pulseview-0.4.2/build'
cd /tmp/B.tU9xM8/BUILD/pulseview-0.4.2/build && /usr/bin/cmake -E cmake_depends "Unix Makefiles" /tmp/B.tU9xM8/BUILD/pulseview-0.4.2 /tmp/B.tU9xM8/BUILD/pulseview-0.4.2 /tmp/B.tU9xM8/BUILD/pulseview-0.4.2/build /tmp/B.tU9xM8/BUILD/pulseview-0.4.2/build /tmp/B.tU9xM8/BUILD/pulseview-0.4.2/build/CMakeFiles/pulseview.dir/DependInfo.cmake --color=
Scanning dependencies of target pulseview
make[2]: Leaving directory '/tmp/B.tU9xM8/BUILD/pulseview-0.4.2/build'
/usr/bin/make  -f CMakeFiles/pulseview.dir/build.make CMakeFiles/pulseview.dir/build
make[2]: Entering directory '/tmp/B.tU9xM8/BUILD/pulseview-0.4.2/build'
[ 10%] Building CXX object CMakeFiles/pulseview.dir/pv/logging.cpp.o
/usr/bin/i686-pld-linux-g++  -DBOOST_MATH_DISABLE_FLOAT128=1 -DENABLE_DECODE -DENABLE_SIGNALS -DQT_CORE_LIB -DQT_GUI_LIB -DQT_NO_DEBUG -DQT_NO_KEYWORDS -DQT_SVG_LIB -DQT_WIDGETS_LIB -D__STDC_LIMIT_MACROS -I/tmp/B.tU9xM8/BUILD/pulseview-0.4.2/build/pulseview_autogen/include -I/tmp/B.tU9xM8/BUILD/pulseview-0.4.2/build -I/tmp/B.tU9xM8/BUILD/pulseview-0.4.2 -I/usr/include/libftdi1 -I/usr/include/hidapi -I/usr/include/libusb-1.0 -I/usr/include/libmount -I/usr/include/blkid -I/usr/include/glibmm-2.4 -I/usr/lib/glibmm-2.4/include -I/usr/include/sigc++-2.0 -I/usr/lib/sigc++-2.0/include -I/usr/include/python3.8 -I/usr/include/glib-2.0 -I/usr/lib/glib-2.0/include -isystem /usr/include/qt5 -isystem /usr/include/qt5/QtGui -isystem /usr/include/qt5/QtCore -isystem /usr/lib/qt5/./mkspecs/linux-g++ -isystem /usr/include/qt5/QtWidgets -isystem /usr/include/qt5/QtSvg  -O2 -fwrapv -pipe -Wformat -Werror=format-security -gdwarf-4 -fno-debug-types-section -fvar-tracking-assignments -g2 -Wp,-D_FORTIFY_SOURCE=2 -fstack-protector-strong --param=ssp-buffer-size=4 -Werror=trampolines -fomit-frame-pointer -march=i686 -fasynchronous-unwind-tables -mtune=pentium4 -gdwarf-4 -fno-debug-types-section -fvar-tracking-assignments -g2  -DNDEBUG -DQT_NO_DEBUG   -Wall -Wextra -std=c++11 -fPIC -o CMakeFiles/pulseview.dir/pv/logging.cpp.o -c /tmp/B.tU9xM8/BUILD/pulseview-0.4.2/pv/logging.cpp
/tmp/B.tU9xM8/BUILD/pulseview-0.4.2/pv/logging.cpp: In static member function 'static int pv::Logging::log_srd(void*, int, const char*, va_list)':
/tmp/B.tU9xM8/BUILD/pulseview-0.4.2/pv/logging.cpp:194:65: warning: 'QStringList QString::split(const QString&, QString::SplitBehavior, Qt::CaseSensitivity) const' is deprecated: Use Qt::SplitBehavior variant instead [-Wdeprecated-declarations]
  194 |  for (QString& substring : s.split("\n", QString::SkipEmptyParts))
      |                                                                 ^
In file included from /usr/include/qt5/QtCore/qhashfunctions.h:44,
                 from /usr/include/qt5/QtCore/qlist.h:47,
                 from /usr/include/qt5/QtCore/qstringlist.h:41,
                 from /usr/include/qt5/QtGui/qcolor.h:46,
                 from /usr/include/qt5/QtGui/qpalette.h:45,
                 from /usr/include/qt5/QtGui/QPalette:1,
                 from /tmp/B.tU9xM8/BUILD/pulseview-0.4.2/pv/globalsettings.hpp:28,
                 from /tmp/B.tU9xM8/BUILD/pulseview-0.4.2/pv/logging.hpp:23,
                 from /tmp/B.tU9xM8/BUILD/pulseview-0.4.2/pv/logging.cpp:20:
/usr/include/qt5/QtCore/qstring.h:604:17: note: declared here
  604 |     QStringList split(const QString &sep, SplitBehavior behavior,
      |                 ^~~~~
make[2]: Leaving directory '/tmp/B.tU9xM8/BUILD/pulseview-0.4.2/build'
make[2]: Entering directory '/tmp/B.tU9xM8/BUILD/pulseview-0.4.2/build'
[  6%] Building CXX object CMakeFiles/pulseview.dir/main.cpp.o
/usr/bin/i686-pld-linux-g++  -DBOOST_MATH_DISABLE_FLOAT128=1 -DENABLE_DECODE -DENABLE_SIGNALS -DQT_CORE_LIB -DQT_GUI_LIB -DQT_NO_DEBUG -DQT_NO_KEYWORDS -DQT_SVG_LIB -DQT_WIDGETS_LIB -D__STDC_LIMIT_MACROS -I/tmp/B.tU9xM8/BUILD/pulseview-0.4.2/build/pulseview_autogen/include -I/tmp/B.tU9xM8/BUILD/pulseview-0.4.2/build -I/tmp/B.tU9xM8/BUILD/pulseview-0.4.2 -I/usr/include/libftdi1 -I/usr/include/hidapi -I/usr/include/libusb-1.0 -I/usr/include/libmount -I/usr/include/blkid -I/usr/include/glibmm-2.4 -I/usr/lib/glibmm-2.4/include -I/usr/include/sigc++-2.0 -I/usr/lib/sigc++-2.0/include -I/usr/include/python3.8 -I/usr/include/glib-2.0 -I/usr/lib/glib-2.0/include -isystem /usr/include/qt5 -isystem /usr/include/qt5/QtGui -isystem /usr/include/qt5/QtCore -isystem /usr/lib/qt5/./mkspecs/linux-g++ -isystem /usr/include/qt5/QtWidgets -isystem /usr/include/qt5/QtSvg  -O2 -fwrapv -pipe -Wformat -Werror=format-security -gdwarf-4 -fno-debug-types-section -fvar-tracking-assignments -g2 -Wp,-D_FORTIFY_SOURCE=2 -fstack-protector-strong --param=ssp-buffer-size=4 -Werror=trampolines -fomit-frame-pointer -march=i686 -fasynchronous-unwind-tables -mtune=pentium4 -gdwarf-4 -fno-debug-types-section -fvar-tracking-assignments -g2  -DNDEBUG -DQT_NO_DEBUG   -Wall -Wextra -std=c++11 -fPIC -o CMakeFiles/pulseview.dir/main.cpp.o -c /tmp/B.tU9xM8/BUILD/pulseview-0.4.2/main.cpp
make[2]: Leaving directory '/tmp/B.tU9xM8/BUILD/pulseview-0.4.2/build'
make[2]: Entering directory '/tmp/B.tU9xM8/BUILD/pulseview-0.4.2/build'
[  8%] Building CXX object CMakeFiles/pulseview.dir/pv/application.cpp.o
/usr/bin/i686-pld-linux-g++  -DBOOST_MATH_DISABLE_FLOAT128=1 -DENABLE_DECODE -DENABLE_SIGNALS -DQT_CORE_LIB -DQT_GUI_LIB -DQT_NO_DEBUG -DQT_NO_KEYWORDS -DQT_SVG_LIB -DQT_WIDGETS_LIB -D__STDC_LIMIT_MACROS -I/tmp/B.tU9xM8/BUILD/pulseview-0.4.2/build/pulseview_autogen/include -I/tmp/B.tU9xM8/BUILD/pulseview-0.4.2/build -I/tmp/B.tU9xM8/BUILD/pulseview-0.4.2 -I/usr/include/libftdi1 -I/usr/include/hidapi -I/usr/include/libusb-1.0 -I/usr/include/libmount -I/usr/include/blkid -I/usr/include/glibmm-2.4 -I/usr/lib/glibmm-2.4/include -I/usr/include/sigc++-2.0 -I/usr/lib/sigc++-2.0/include -I/usr/include/python3.8 -I/usr/include/glib-2.0 -I/usr/lib/glib-2.0/include -isystem /usr/include/qt5 -isystem /usr/include/qt5/QtGui -isystem /usr/include/qt5/QtCore -isystem /usr/lib/qt5/./mkspecs/linux-g++ -isystem /usr/include/qt5/QtWidgets -isystem /usr/include/qt5/QtSvg  -O2 -fwrapv -pipe -Wformat -Werror=format-security -gdwarf-4 -fno-debug-types-section -fvar-tracking-assignments -g2 -Wp,-D_FORTIFY_SOURCE=2 -fstack-protector-strong --param=ssp-buffer-size=4 -Werror=trampolines -fomit-frame-pointer -march=i686 -fasynchronous-unwind-tables -mtune=pentium4 -gdwarf-4 -fno-debug-types-section -fvar-tracking-assignments -g2  -DNDEBUG -DQT_NO_DEBUG   -Wall -Wextra -std=c++11 -fPIC -o CMakeFiles/pulseview.dir/pv/application.cpp.o -c /tmp/B.tU9xM8/BUILD/pulseview-0.4.2/pv/application.cpp
make[2]: Leaving directory '/tmp/B.tU9xM8/BUILD/pulseview-0.4.2/build'
make[2]: Entering directory '/tmp/B.tU9xM8/BUILD/pulseview-0.4.2/build'
[ 13%] Building CXX object CMakeFiles/pulseview.dir/pv/storesession.cpp.o
/usr/bin/i686-pld-linux-g++  -DBOOST_MATH_DISABLE_FLOAT128=1 -DENABLE_DECODE -DENABLE_SIGNALS -DQT_CORE_LIB -DQT_GUI_LIB -DQT_NO_DEBUG -DQT_NO_KEYWORDS -DQT_SVG_LIB -DQT_WIDGETS_LIB -D__STDC_LIMIT_MACROS -I/tmp/B.tU9xM8/BUILD/pulseview-0.4.2/build/pulseview_autogen/include -I/tmp/B.tU9xM8/BUILD/pulseview-0.4.2/build -I/tmp/B.tU9xM8/BUILD/pulseview-0.4.2 -I/usr/include/libftdi1 -I/usr/include/hidapi -I/usr/include/libusb-1.0 -I/usr/include/libmount -I/usr/include/blkid -I/usr/include/glibmm-2.4 -I/usr/lib/glibmm-2.4/include -I/usr/include/sigc++-2.0 -I/usr/lib/sigc++-2.0/include -I/usr/include/python3.8 -I/usr/include/glib-2.0 -I/usr/lib/glib-2.0/include -isystem /usr/include/qt5 -isystem /usr/include/qt5/QtGui -isystem /usr/include/qt5/QtCore -isystem /usr/lib/qt5/./mkspecs/linux-g++ -isystem /usr/include/qt5/QtWidgets -isystem /usr/include/qt5/QtSvg  -O2 -fwrapv -pipe -Wformat -Werror=format-security -gdwarf-4 -fno-debug-types-section -fvar-tracking-assignments -g2 -Wp,-D_FORTIFY_SOURCE=2 -fstack-protector-strong --param=ssp-buffer-size=4 -Werror=trampolines -fomit-frame-pointer -march=i686 -fasynchronous-unwind-tables -mtune=pentium4 -gdwarf-4 -fno-debug-types-section -fvar-tracking-assignments -g2  -DNDEBUG -DQT_NO_DEBUG   -Wall -Wextra -std=c++11 -fPIC -o CMakeFiles/pulseview.dir/pv/storesession.cpp.o -c /tmp/B.tU9xM8/BUILD/pulseview-0.4.2/pv/storesession.cpp
make[2]: Leaving directory '/tmp/B.tU9xM8/BUILD/pulseview-0.4.2/build'
make[2]: Entering directory '/tmp/B.tU9xM8/BUILD/pulseview-0.4.2/build'
[  9%] Building CXX object CMakeFiles/pulseview.dir/pv/globalsettings.cpp.o
/usr/bin/i686-pld-linux-g++  -DBOOST_MATH_DISABLE_FLOAT128=1 -DENABLE_DECODE -DENABLE_SIGNALS -DQT_CORE_LIB -DQT_GUI_LIB -DQT_NO_DEBUG -DQT_NO_KEYWORDS -DQT_SVG_LIB -DQT_WIDGETS_LIB -D__STDC_LIMIT_MACROS -I/tmp/B.tU9xM8/BUILD/pulseview-0.4.2/build/pulseview_autogen/include -I/tmp/B.tU9xM8/BUILD/pulseview-0.4.2/build -I/tmp/B.tU9xM8/BUILD/pulseview-0.4.2 -I/usr/include/libftdi1 -I/usr/include/hidapi -I/usr/include/libusb-1.0 -I/usr/include/libmount -I/usr/include/blkid -I/usr/include/glibmm-2.4 -I/usr/lib/glibmm-2.4/include -I/usr/include/sigc++-2.0 -I/usr/lib/sigc++-2.0/include -I/usr/include/python3.8 -I/usr/include/glib-2.0 -I/usr/lib/glib-2.0/include -isystem /usr/include/qt5 -isystem /usr/include/qt5/QtGui -isystem /usr/include/qt5/QtCore -isystem /usr/lib/qt5/./mkspecs/linux-g++ -isystem /usr/include/qt5/QtWidgets -isystem /usr/include/qt5/QtSvg  -O2 -fwrapv -pipe -Wformat -Werror=format-security -gdwarf-4 -fno-debug-types-section -fvar-tracking-assignments -g2 -Wp,-D_FORTIFY_SOURCE=2 -fstack-protector-strong --param=ssp-buffer-size=4 -Werror=trampolines -fomit-frame-pointer -march=i686 -fasynchronous-unwind-tables -mtune=pentium4 -gdwarf-4 -fno-debug-types-section -fvar-tracking-assignments -g2  -DNDEBUG -DQT_NO_DEBUG   -Wall -Wextra -std=c++11 -fPIC -o CMakeFiles/pulseview.dir/pv/globalsettings.cpp.o -c /tmp/B.tU9xM8/BUILD/pulseview-0.4.2/pv/globalsettings.cpp
make[2]: Leaving directory '/tmp/B.tU9xM8/BUILD/pulseview-0.4.2/build'
make[2]: Entering directory '/tmp/B.tU9xM8/BUILD/pulseview-0.4.2/build'
[ 15%] Building CXX object CMakeFiles/pulseview.dir/pv/binding/binding.cpp.o
/usr/bin/i686-pld-linux-g++  -DBOOST_MATH_DISABLE_FLOAT128=1 -DENABLE_DECODE -DENABLE_SIGNALS -DQT_CORE_LIB -DQT_GUI_LIB -DQT_NO_DEBUG -DQT_NO_KEYWORDS -DQT_SVG_LIB -DQT_WIDGETS_LIB -D__STDC_LIMIT_MACROS -I/tmp/B.tU9xM8/BUILD/pulseview-0.4.2/build/pulseview_autogen/include -I/tmp/B.tU9xM8/BUILD/pulseview-0.4.2/build -I/tmp/B.tU9xM8/BUILD/pulseview-0.4.2 -I/usr/include/libftdi1 -I/usr/include/hidapi -I/usr/include/libusb-1.0 -I/usr/include/libmount -I/usr/include/blkid -I/usr/include/glibmm-2.4 -I/usr/lib/glibmm-2.4/include -I/usr/include/sigc++-2.0 -I/usr/lib/sigc++-2.0/include -I/usr/include/python3.8 -I/usr/include/glib-2.0 -I/usr/lib/glib-2.0/include -isystem /usr/include/qt5 -isystem /usr/include/qt5/QtGui -isystem /usr/include/qt5/QtCore -isystem /usr/lib/qt5/./mkspecs/linux-g++ -isystem /usr/include/qt5/QtWidgets -isystem /usr/include/qt5/QtSvg  -O2 -fwrapv -pipe -Wformat -Werror=format-security -gdwarf-4 -fno-debug-types-section -fvar-tracking-assignments -g2 -Wp,-D_FORTIFY_SOURCE=2 -fstack-protector-strong --param=ssp-buffer-size=4 -Werror=trampolines -fomit-frame-pointer -march=i686 -fasynchronous-unwind-tables -mtune=pentium4 -gdwarf-4 -fno-debug-types-section -fvar-tracking-assignments -g2  -DNDEBUG -DQT_NO_DEBUG   -Wall -Wextra -std=c++11 -fPIC -o CMakeFiles/pulseview.dir/pv/binding/binding.cpp.o -c /tmp/B.tU9xM8/BUILD/pulseview-0.4.2/pv/binding/binding.cpp
make[2]: Leaving directory '/tmp/B.tU9xM8/BUILD/pulseview-0.4.2/build'
make[2]: Entering directory '/tmp/B.tU9xM8/BUILD/pulseview-0.4.2/build'
[  7%] Building CXX object CMakeFiles/pulseview.dir/pv/devicemanager.cpp.o
/usr/bin/i686-pld-linux-g++  -DBOOST_MATH_DISABLE_FLOAT128=1 -DENABLE_DECODE -DENABLE_SIGNALS -DQT_CORE_LIB -DQT_GUI_LIB -DQT_NO_DEBUG -DQT_NO_KEYWORDS -DQT_SVG_LIB -DQT_WIDGETS_LIB -D__STDC_LIMIT_MACROS -I/tmp/B.tU9xM8/BUILD/pulseview-0.4.2/build/pulseview_autogen/include -I/tmp/B.tU9xM8/BUILD/pulseview-0.4.2/build -I/tmp/B.tU9xM8/BUILD/pulseview-0.4.2 -I/usr/include/libftdi1 -I/usr/include/hidapi -I/usr/include/libusb-1.0 -I/usr/include/libmount -I/usr/include/blkid -I/usr/include/glibmm-2.4 -I/usr/lib/glibmm-2.4/include -I/usr/include/sigc++-2.0 -I/usr/lib/sigc++-2.0/include -I/usr/include/python3.8 -I/usr/include/glib-2.0 -I/usr/lib/glib-2.0/include -isystem /usr/include/qt5 -isystem /usr/include/qt5/QtGui -isystem /usr/include/qt5/QtCore -isystem /usr/lib/qt5/./mkspecs/linux-g++ -isystem /usr/include/qt5/QtWidgets -isystem /usr/include/qt5/QtSvg  -O2 -fwrapv -pipe -Wformat -Werror=format-security -gdwarf-4 -fno-debug-types-section -fvar-tracking-assignments -g2 -Wp,-D_FORTIFY_SOURCE=2 -fstack-protector-strong --param=ssp-buffer-size=4 -Werror=trampolines -fomit-frame-pointer -march=i686 -fasynchronous-unwind-tables -mtune=pentium4 -gdwarf-4 -fno-debug-types-section -fvar-tracking-assignments -g2  -DNDEBUG -DQT_NO_DEBUG   -Wall -Wextra -std=c++11 -fPIC -o CMakeFiles/pulseview.dir/pv/devicemanager.cpp.o -c /tmp/B.tU9xM8/BUILD/pulseview-0.4.2/pv/devicemanager.cpp
make[2]: Leaving directory '/tmp/B.tU9xM8/BUILD/pulseview-0.4.2/build'
make[2]: Entering directory '/tmp/B.tU9xM8/BUILD/pulseview-0.4.2/build'
[ 14%] Building CXX object CMakeFiles/pulseview.dir/pv/util.cpp.o
/usr/bin/i686-pld-linux-g++  -DBOOST_MATH_DISABLE_FLOAT128=1 -DENABLE_DECODE -DENABLE_SIGNALS -DQT_CORE_LIB -DQT_GUI_LIB -DQT_NO_DEBUG -DQT_NO_KEYWORDS -DQT_SVG_LIB -DQT_WIDGETS_LIB -D__STDC_LIMIT_MACROS -I/tmp/B.tU9xM8/BUILD/pulseview-0.4.2/build/pulseview_autogen/include -I/tmp/B.tU9xM8/BUILD/pulseview-0.4.2/build -I/tmp/B.tU9xM8/BUILD/pulseview-0.4.2 -I/usr/include/libftdi1 -I/usr/include/hidapi -I/usr/include/libusb-1.0 -I/usr/include/libmount -I/usr/include/blkid -I/usr/include/glibmm-2.4 -I/usr/lib/glibmm-2.4/include -I/usr/include/sigc++-2.0 -I/usr/lib/sigc++-2.0/include -I/usr/include/python3.8 -I/usr/include/glib-2.0 -I/usr/lib/glib-2.0/include -isystem /usr/include/qt5 -isystem /usr/include/qt5/QtGui -isystem /usr/include/qt5/QtCore -isystem /usr/lib/qt5/./mkspecs/linux-g++ -isystem /usr/include/qt5/QtWidgets -isystem /usr/include/qt5/QtSvg  -O2 -fwrapv -pipe -Wformat -Werror=format-security -gdwarf-4 -fno-debug-types-section -fvar-tracking-assignments -g2 -Wp,-D_FORTIFY_SOURCE=2 -fstack-protector-strong --param=ssp-buffer-size=4 -Werror=trampolines -fomit-frame-pointer -march=i686 -fasynchronous-unwind-tables -mtune=pentium4 -gdwarf-4 -fno-debug-types-section -fvar-tracking-assignments -g2  -DNDEBUG -DQT_NO_DEBUG   -Wall -Wextra -std=c++11 -fPIC -o CMakeFiles/pulseview.dir/pv/util.cpp.o -c /tmp/B.tU9xM8/BUILD/pulseview-0.4.2/pv/util.cpp
/tmp/B.tU9xM8/BUILD/pulseview-0.4.2/pv/util.cpp: In function 'QString pv::util::format_time_si(const Timestamp&, pv::util::SIPrefix, unsigned int, QString, bool)':
/tmp/B.tU9xM8/BUILD/pulseview-0.4.2/pv/util.cpp:140:6: error: no match for 'operator<<' (operand types are 'QTextStream' and '<unresolved overloaded function type>')
  140 |   ts << forcesign;
      |   ~~~^~~~~~~~~~~~
In file included from /usr/include/qt5/QtCore/qdebug.h:49,
                 from /usr/include/qt5/QtCore/QDebug:1,
                 from /tmp/B.tU9xM8/BUILD/pulseview-0.4.2/pv/util.cpp:28:
/usr/include/qt5/QtCore/qtextstream.h:174:18: note: candidate: 'QTextStream& QTextStream::operator<<(QChar)'
  174 |     QTextStream &operator<<(QChar ch);
      |                  ^~~~~~~~
/usr/include/qt5/QtCore/qtextstream.h:174:35: note:   no known conversion for argument 1 from '<unresolved overloaded function type>' to 'QChar'
  174 |     QTextStream &operator<<(QChar ch);
      |                             ~~~~~~^~
/usr/include/qt5/QtCore/qtextstream.h:175:18: note: candidate: 'QTextStream& QTextStream::operator<<(char)'
  175 |     QTextStream &operator<<(char ch);
      |                  ^~~~~~~~
/usr/include/qt5/QtCore/qtextstream.h:175:34: note:   no known conversion for argument 1 from '<unresolved overloaded function type>' to 'char'
  175 |     QTextStream &operator<<(char ch);
      |                             ~~~~~^~
/usr/include/qt5/QtCore/qtextstream.h:176:18: note: candidate: 'QTextStream& QTextStream::operator<<(short int)'
  176 |     QTextStream &operator<<(signed short i);
      |                  ^~~~~~~~
/usr/include/qt5/QtCore/qtextstream.h:176:42: note:   no known conversion for argument 1 from '<unresolved overloaded function type>' to 'short int'
  176 |     QTextStream &operator<<(signed short i);
      |                             ~~~~~~~~~~~~~^
/usr/include/qt5/QtCore/qtextstream.h:177:18: note: candidate: 'QTextStream& QTextStream::operator<<(short unsigned int)'
  177 |     QTextStream &operator<<(unsigned short i);
      |                  ^~~~~~~~
/usr/include/qt5/QtCore/qtextstream.h:177:44: note:   no known conversion for argument 1 from '<unresolved overloaded function type>' to 'short unsigned int'
  177 |     QTextStream &operator<<(unsigned short i);
      |                             ~~~~~~~~~~~~~~~^
/usr/include/qt5/QtCore/qtextstream.h:178:18: note: candidate: 'QTextStream& QTextStream::operator<<(int)'
  178 |     QTextStream &operator<<(signed int i);
      |                  ^~~~~~~~
/usr/include/qt5/QtCore/qtextstream.h:178:40: note:   no known conversion for argument 1 from '<unresolved overloaded function type>' to 'int'
  178 |     QTextStream &operator<<(signed int i);
      |                             ~~~~~~~~~~~^
/usr/include/qt5/QtCore/qtextstream.h:179:18: note: candidate: 'QTextStream& QTextStream::operator<<(unsigned int)'
  179 |     QTextStream &operator<<(unsigned int i);
      |                  ^~~~~~~~
/usr/include/qt5/QtCore/qtextstream.h:179:42: note:   no known conversion for argument 1 from '<unresolved overloaded function type>' to 'unsigned int'
  179 |     QTextStream &operator<<(unsigned int i);
      |                             ~~~~~~~~~~~~~^
/usr/include/qt5/QtCore/qtextstream.h:180:18: note: candidate: 'QTextStream& QTextStream::operator<<(long int)'
  180 |     QTextStream &operator<<(signed long i);
      |                  ^~~~~~~~
/usr/include/qt5/QtCore/qtextstream.h:180:41: note:   no known conversion for argument 1 from '<unresolved overloaded function type>' to 'long int'
  180 |     QTextStream &operator<<(signed long i);
      |                             ~~~~~~~~~~~~^
/usr/include/qt5/QtCore/qtextstream.h:181:18: note: candidate: 'QTextStream& QTextStream::operator<<(long unsigned int)'
  181 |     QTextStream &operator<<(unsigned long i);
      |                  ^~~~~~~~
/usr/include/qt5/QtCore/qtextstream.h:181:43: note:   no known conversion for argument 1 from '<unresolved overloaded function type>' to 'long unsigned int'
  181 |     QTextStream &operator<<(unsigned long i);
      |                             ~~~~~~~~~~~~~~^
/usr/include/qt5/QtCore/qtextstream.h:182:18: note: candidate: 'QTextStream& QTextStream::operator<<(qlonglong)'
  182 |     QTextStream &operator<<(qlonglong i);
      |                  ^~~~~~~~
/usr/include/qt5/QtCore/qtextstream.h:182:39: note:   no known conversion for argument 1 from '<unresolved overloaded function type>' to 'qlonglong' {aka 'long long int'}
  182 |     QTextStream &operator<<(qlonglong i);
      |                             ~~~~~~~~~~^
/usr/include/qt5/QtCore/qtextstream.h:183:18: note: candidate: 'QTextStream& QTextStream::operator<<(qulonglong)'
  183 |     QTextStream &operator<<(qulonglong i);
      |                  ^~~~~~~~
/usr/include/qt5/QtCore/qtextstream.h:183:40: note:   no known conversion for argument 1 from '<unresolved overloaded function type>' to 'qulonglong' {aka 'long long unsigned int'}
  183 |     QTextStream &operator<<(qulonglong i);
      |                             ~~~~~~~~~~~^
/usr/include/qt5/QtCore/qtextstream.h:184:18: note: candidate: 'QTextStream& QTextStream::operator<<(float)'
  184 |     QTextStream &operator<<(float f);
      |                  ^~~~~~~~
/usr/include/qt5/QtCore/qtextstream.h:184:35: note:   no known conversion for argument 1 from '<unresolved overloaded function type>' to 'float'
  184 |     QTextStream &operator<<(float f);
      |                             ~~~~~~^
/usr/include/qt5/QtCore/qtextstream.h:185:18: note: candidate: 'QTextStream& QTextStream::operator<<(double)'
  185 |     QTextStream &operator<<(double f);
      |                  ^~~~~~~~
/usr/include/qt5/QtCore/qtextstream.h:185:36: note:   no known conversion for argument 1 from '<unresolved overloaded function type>' to 'double'
  185 |     QTextStream &operator<<(double f);
      |                             ~~~~~~~^
/usr/include/qt5/QtCore/qtextstream.h:186:18: note: candidate: 'QTextStream& QTextStream::operator<<(const QString&)'
  186 |     QTextStream &operator<<(const QString &s);
      |                  ^~~~~~~~
/usr/include/qt5/QtCore/qtextstream.h:186:44: note:   no known conversion for argument 1 from '<unresolved overloaded function type>' to 'const QString&'
  186 |     QTextStream &operator<<(const QString &s);
      |                             ~~~~~~~~~~~~~~~^
/usr/include/qt5/QtCore/qtextstream.h:187:18: note: candidate: 'QTextStream& QTextStream::operator<<(QStringView)'
  187 |     QTextStream &operator<<(QStringView s);
      |                  ^~~~~~~~
/usr/include/qt5/QtCore/qtextstream.h:187:41: note:   no known conversion for argument 1 from '<unresolved overloaded function type>' to 'QStringView'
  187 |     QTextStream &operator<<(QStringView s);
      |                             ~~~~~~~~~~~~^
/usr/include/qt5/QtCore/qtextstream.h:188:18: note: candidate: 'QTextStream& QTextStream::operator<<(QLatin1String)'
  188 |     QTextStream &operator<<(QLatin1String s);
      |                  ^~~~~~~~
/usr/include/qt5/QtCore/qtextstream.h:188:43: note:   no known conversion for argument 1 from '<unresolved overloaded function type>' to 'QLatin1String'
  188 |     QTextStream &operator<<(QLatin1String s);
      |                             ~~~~~~~~~~~~~~^
/usr/include/qt5/QtCore/qtextstream.h:189:18: note: candidate: 'QTextStream& QTextStream::operator<<(const QStringRef&)'
  189 |     QTextStream &operator<<(const QStringRef &s);
      |                  ^~~~~~~~
/usr/include/qt5/QtCore/qtextstream.h:189:47: note:   no known conversion for argument 1 from '<unresolved overloaded function type>' to 'const QStringRef&'
  189 |     QTextStream &operator<<(const QStringRef &s);
      |                             ~~~~~~~~~~~~~~~~~~^
/usr/include/qt5/QtCore/qtextstream.h:190:18: note: candidate: 'QTextStream& QTextStream::operator<<(const QByteArray&)'
  190 |     QTextStream &operator<<(const QByteArray &array);
      |                  ^~~~~~~~
/usr/include/qt5/QtCore/qtextstream.h:190:47: note:   no known conversion for argument 1 from '<unresolved overloaded function type>' to 'const QByteArray&'
  190 |     QTextStream &operator<<(const QByteArray &array);
      |                             ~~~~~~~~~~~~~~~~~~^~~~~
/usr/include/qt5/QtCore/qtextstream.h:191:18: note: candidate: 'QTextStream& QTextStream::operator<<(const char*)'
  191 |     QTextStream &operator<<(const char *c);
      |                  ^~~~~~~~
/usr/include/qt5/QtCore/qtextstream.h:191:41: note:   no known conversion for argument 1 from '<unresolved overloaded function type>' to 'const char*'
  191 |     QTextStream &operator<<(const char *c);
      |                             ~~~~~~~~~~~~^
/usr/include/qt5/QtCore/qtextstream.h:192:18: note: candidate: 'QTextStream& QTextStream::operator<<(const void*)'
  192 |     QTextStream &operator<<(const void *ptr);
      |                  ^~~~~~~~
/usr/include/qt5/QtCore/qtextstream.h:192:41: note:   no known conversion for argument 1 from '<unresolved overloaded function type>' to 'const void*'
  192 |     QTextStream &operator<<(const void *ptr);
      |                             ~~~~~~~~~~~~^~~
/tmp/B.tU9xM8/BUILD/pulseview-0.4.2/pv/util.cpp:44:21: note: candidate: 'QTextStream& pv::util::operator<<(QTextStream&, pv::util::SIPrefix)'
   44 | static QTextStream& operator<<(QTextStream& stream, SIPrefix prefix)
      |                     ^~~~~~~~
/tmp/B.tU9xM8/BUILD/pulseview-0.4.2/pv/util.cpp:44:62: note:   no known conversion for argument 2 from '<unresolved overloaded function type>' to 'pv::util::SIPrefix'
   44 | static QTextStream& operator<<(QTextStream& stream, SIPrefix prefix)
      |                                                     ~~~~~~~~~^~~~~~
/tmp/B.tU9xM8/BUILD/pulseview-0.4.2/pv/util.cpp:81:21: note: candidate: 'QTextStream& pv::util::operator<<(QTextStream&, const Timestamp&)'
   81 | static QTextStream& operator<<(QTextStream& stream, const Timestamp& t)
      |                     ^~~~~~~~
/tmp/B.tU9xM8/BUILD/pulseview-0.4.2/pv/util.cpp:81:70: note:   no known conversion for argument 2 from '<unresolved overloaded function type>' to 'const Timestamp&' {aka 'const boost::multiprecision::number<boost::multiprecision::backends::cpp_dec_float<24>, boost::multiprecision::et_off>&'}
   81 | static QTextStream& operator<<(QTextStream& stream, const Timestamp& t)
      |                                                     ~~~~~~~~~~~~~~~~~^
In file included from /usr/include/qt5/QtCore/qmetatype.h:47,
                 from /usr/include/qt5/QtCore/QMetaType:1,
                 from /tmp/B.tU9xM8/BUILD/pulseview-0.4.2/pv/util.hpp:31,
                 from /tmp/B.tU9xM8/BUILD/pulseview-0.4.2/pv/util.cpp:20:
/usr/include/qt5/QtCore/qbytearray.h:751:28: note: candidate: 'QDataStream& operator<<(QDataStream&, const QByteArray&)'
  751 | Q_CORE_EXPORT QDataStream &operator<<(QDataStream &, const QByteArray &);
      |                            ^~~~~~~~
/usr/include/qt5/QtCore/qbytearray.h:751:39: note:   no known conversion for argument 1 from 'QTextStream' to 'QDataStream&'
  751 | Q_CORE_EXPORT QDataStream &operator<<(QDataStream &, const QByteArray &);
      |                                       ^~~~~~~~~~~~~
In file included from /usr/include/qt5/QtCore/qstring.h:49,
                 from /usr/include/qt5/QtCore/qhashfunctions.h:44,
                 from /usr/include/qt5/QtCore/qvarlengtharray.h:47,
                 from /usr/include/qt5/QtCore/qmetatype.h:48,
                 from /usr/include/qt5/QtCore/QMetaType:1,
                 from /tmp/B.tU9xM8/BUILD/pulseview-0.4.2/pv/util.hpp:31,
                 from /tmp/B.tU9xM8/BUILD/pulseview-0.4.2/pv/util.cpp:20:
/usr/include/qt5/QtCore/qchar.h:662:28: note: candidate: 'QDataStream& operator<<(QDataStream&, QChar)'
  662 | Q_CORE_EXPORT QDataStream &operator<<(QDataStream &, QChar);
      |                            ^~~~~~~~
/usr/include/qt5/QtCore/qchar.h:662:39: note:   no known conversion for argument 1 from 'QTextStream' to 'QDataStream&'
  662 | Q_CORE_EXPORT QDataStream &operator<<(QDataStream &, QChar);
      |                                       ^~~~~~~~~~~~~
In file included from /usr/include/qt5/QtCore/qhashfunctions.h:44,
                 from /usr/include/qt5/QtCore/qvarlengtharray.h:47,
                 from /usr/include/qt5/QtCore/qmetatype.h:48,
                 from /usr/include/qt5/QtCore/QMetaType:1,
                 from /tmp/B.tU9xM8/BUILD/pulseview-0.4.2/pv/util.hpp:31,
                 from /tmp/B.tU9xM8/BUILD/pulseview-0.4.2/pv/util.cpp:20:
/usr/include/qt5/QtCore/qstring.h:1583:28: note: candidate: 'QDataStream& operator<<(QDataStream&, const QString&)'
 1583 | Q_CORE_EXPORT QDataStream &operator<<(QDataStream &, const QString &);
      |                            ^~~~~~~~
/usr/include/qt5/QtCore/qstring.h:1583:39: note:   no known conversion for argument 1 from 'QTextStream' to 'QDataStream&'
 1583 | Q_CORE_EXPORT QDataStream &operator<<(QDataStream &, const QString &);
      |                                       ^~~~~~~~~~~~~
In file included from /usr/include/qt5/QtCore/qstringlist.h:48,
                 from /usr/include/qt5/QtCore/qlist.h:1196,
                 from /usr/include/qt5/QtCore/qhash.h:46,
                 from /usr/include/qt5/QtCore/qdebug.h:45,
                 from /usr/include/qt5/QtCore/QDebug:1,
                 from /tmp/B.tU9xM8/BUILD/pulseview-0.4.2/pv/util.cpp:28:
/usr/include/qt5/QtCore/qregexp.h:122:28: note: candidate: 'QDataStream& operator<<(QDataStream&, const QRegExp&)'
  122 | Q_CORE_EXPORT QDataStream &operator<<(QDataStream &out, const QRegExp &regExp);
      |                            ^~~~~~~~
/usr/include/qt5/QtCore/qregexp.h:122:52: note:   no known conversion for argument 1 from 'QTextStream' to 'QDataStream&'
  122 | Q_CORE_EXPORT QDataStream &operator<<(QDataStream &out, const QRegExp &regExp);
      |                                       ~~~~~~~~~~~~~^~~
/usr/include/qt5/QtCore/qregexp.h:127:22: note: candidate: 'QDebug operator<<(QDebug, const QRegExp&)'
  127 | Q_CORE_EXPORT QDebug operator<<(QDebug, const QRegExp &);
      |                      ^~~~~~~~
/usr/include/qt5/QtCore/qregexp.h:127:33: note:   no known conversion for argument 1 from 'QTextStream' to 'QDebug'
  127 | Q_CORE_EXPORT QDebug operator<<(QDebug, const QRegExp &);
      |                                 ^~~~~~
In file included from /usr/include/qt5/QtCore/qiodevice.h:45,
                 from /usr/include/qt5/QtCore/qtextstream.h:43,
                 from /usr/include/qt5/QtCore/qdebug.h:49,
                 from /usr/include/qt5/QtCore/QDebug:1,
                 from /tmp/B.tU9xM8/BUILD/pulseview-0.4.2/pv/util.cpp:28:
/usr/include/qt5/QtCore/qobject.h:554:22: note: candidate: 'QDebug operator<<(QDebug, const QObject*)'
  554 | Q_CORE_EXPORT QDebug operator<<(QDebug, const QObject *);
      |                      ^~~~~~~~
/usr/include/qt5/QtCore/qobject.h:554:33: note:   no known conversion for argument 1 from 'QTextStream' to 'QDebug'
  554 | Q_CORE_EXPORT QDebug operator<<(QDebug, const QObject *);
      |                                 ^~~~~~
In file included from /usr/include/qt5/QtCore/qtextstream.h:43,
                 from /usr/include/qt5/QtCore/qdebug.h:49,
                 from /usr/include/qt5/QtCore/QDebug:1,
                 from /tmp/B.tU9xM8/BUILD/pulseview-0.4.2/pv/util.cpp:28:
/usr/include/qt5/QtCore/qiodevice.h:189:22: note: candidate: 'QDebug operator<<(QDebug, QIODevice::OpenMode)'
  189 | Q_CORE_EXPORT QDebug operator<<(QDebug debug, QIODevice::OpenMode modes);
      |                      ^~~~~~~~
/usr/include/qt5/QtCore/qiodevice.h:189:40: note:   no known conversion for argument 1 from 'QTextStream' to 'QDebug'
  189 | Q_CORE_EXPORT QDebug operator<<(QDebug debug, QIODevice::OpenMode modes);
      |                                 ~~~~~~~^~~~~
In file included from /usr/include/qt5/QtCore/qlocale.h:43,
                 from /usr/include/qt5/QtCore/qtextstream.h:46,
                 from /usr/include/qt5/QtCore/qdebug.h:49,
                 from /usr/include/qt5/QtCore/QDebug:1,
                 from /tmp/B.tU9xM8/BUILD/pulseview-0.4.2/pv/util.cpp:28:
/usr/include/qt5/QtCore/qvariant.h:584:28: note: candidate: 'QDataStream& operator<<(QDataStream&, const QVariant&)'
  584 | Q_CORE_EXPORT QDataStream& operator<< (QDataStream& s, const QVariant& p);
      |                            ^~~~~~~~
/usr/include/qt5/QtCore/qvariant.h:584:53: note:   no known conversion for argument 1 from 'QTextStream' to 'QDataStream&'
  584 | Q_CORE_EXPORT QDataStream& operator<< (QDataStream& s, const QVariant& p);
      |                                        ~~~~~~~~~~~~~^
/usr/include/qt5/QtCore/qvariant.h:586:28: note: candidate: 'QDataStream& operator<<(QDataStream&, QVariant::Type)'
  586 | Q_CORE_EXPORT QDataStream& operator<< (QDataStream& s, const QVariant::Type p);
      |                            ^~~~~~~~
/usr/include/qt5/QtCore/qvariant.h:586:53: note:   no known conversion for argument 1 from 'QTextStream' to 'QDataStream&'
  586 | Q_CORE_EXPORT QDataStream& operator<< (QDataStream& s, const QVariant::Type p);
      |                                        ~~~~~~~~~~~~~^
In file included from /usr/include/qt5/QtCore/qlocale.h:43,
                 from /usr/include/qt5/QtCore/qtextstream.h:46,
                 from /usr/include/qt5/QtCore/qdebug.h:49,
                 from /usr/include/qt5/QtCore/QDebug:1,
                 from /tmp/B.tU9xM8/BUILD/pulseview-0.4.2/pv/util.cpp:28:
/usr/include/qt5/QtCore/qvariant.h:902:22: note: candidate: 'QDebug operator<<(QDebug, const QVariant&)'
  902 | Q_CORE_EXPORT QDebug operator<<(QDebug, const QVariant &);
      |                      ^~~~~~~~
In file included from /usr/include/qt5/QtCore/qlocale.h:43,
                 from /usr/include/qt5/QtCore/qtextstream.h:46,
                 from /usr/include/qt5/QtCore/qdebug.h:49,
                 from /usr/include/qt5/QtCore/QDebug:1,
                 from /tmp/B.tU9xM8/BUILD/pulseview-0.4.2/pv/util.cpp:28:
/usr/include/qt5/QtCore/qvariant.h:480:44: note:   no known conversion for argument 1 from 'QTextStream' to 'QDebug'
  480 |     friend Q_CORE_EXPORT QDebug operator<<(QDebug, const QVariant &);
      |                                            ^~~~~~
In file included from /usr/include/qt5/QtCore/qlocale.h:43,
                 from /usr/include/qt5/QtCore/qtextstream.h:46,
                 from /usr/include/qt5/QtCore/qdebug.h:49,
                 from /usr/include/qt5/QtCore/QDebug:1,
                 from /tmp/B.tU9xM8/BUILD/pulseview-0.4.2/pv/util.cpp:28:
/usr/include/qt5/QtCore/qvariant.h:903:22: note: candidate: 'QDebug operator<<(QDebug, QVariant::Type)'
  903 | Q_CORE_EXPORT QDebug operator<<(QDebug, const QVariant::Type);
      |                      ^~~~~~~~
/usr/include/qt5/QtCore/qvariant.h:903:33: note:   no known conversion for argument 1 from 'QTextStream' to 'QDebug'
  903 | Q_CORE_EXPORT QDebug operator<<(QDebug, const QVariant::Type);
      |                                 ^~~~~~
In file included from /usr/include/qt5/QtCore/qtextstream.h:46,
                 from /usr/include/qt5/QtCore/qdebug.h:49,
                 from /usr/include/qt5/QtCore/QDebug:1,
                 from /tmp/B.tU9xM8/BUILD/pulseview-0.4.2/pv/util.cpp:28:
/usr/include/qt5/QtCore/qlocale.h:1168:28: note: candidate: 'QDataStream& operator<<(QDataStream&, const QLocale&)'
 1168 | Q_CORE_EXPORT QDataStream &operator<<(QDataStream &, const QLocale &);
      |                            ^~~~~~~~
/usr/include/qt5/QtCore/qlocale.h:1168:39: note:   no known conversion for argument 1 from 'QTextStream' to 'QDataStream&'
 1168 | Q_CORE_EXPORT QDataStream &operator<<(QDataStream &, const QLocale &);
      |                                       ^~~~~~~~~~~~~
/usr/include/qt5/QtCore/qlocale.h:1173:22: note: candidate: 'QDebug operator<<(QDebug, const QLocale&)'
 1173 | Q_CORE_EXPORT QDebug operator<<(QDebug, const QLocale &);
      |                      ^~~~~~~~
/usr/include/qt5/QtCore/qlocale.h:1173:33: note:   no known conversion for argument 1 from 'QTextStream' to 'QDebug'
 1173 | Q_CORE_EXPORT QDebug operator<<(QDebug, const QLocale &);
      |                                 ^~~~~~
In file included from /usr/include/qt5/QtCore/qdebug.h:49,
                 from /usr/include/qt5/QtCore/QDebug:1,
                 from /tmp/B.tU9xM8/BUILD/pulseview-0.4.2/pv/util.cpp:28:
/usr/include/qt5/QtCore/qtextstream.h:230:21: note: candidate: 'QTextStream& operator<<(QTextStream&, QTextStreamFunction)'
  230 | inline QTextStream &operator<<(QTextStream &s, QTextStreamFunction f)
      |                     ^~~~~~~~
/usr/include/qt5/QtCore/qtextstream.h:230:68: note:   no known conversion for argument 2 from '<unresolved overloaded function type>' to 'QTextStreamFunction' {aka 'QTextStream& (*)(QTextStream&)'}
  230 | inline QTextStream &operator<<(QTextStream &s, QTextStreamFunction f)
      |                                                ~~~~~~~~~~~~~~~~~~~~^
/usr/include/qt5/QtCore/qtextstream.h:233:21: note: candidate: 'QTextStream& operator<<(QTextStream&, QTextStreamManipulator)'
  233 | inline QTextStream &operator<<(QTextStream &s, QTextStreamManipulator m)
      |                     ^~~~~~~~
/usr/include/qt5/QtCore/qtextstream.h:233:71: note:   no known conversion for argument 2 from '<unresolved overloaded function type>' to 'QTextStreamManipulator'
  233 | inline QTextStream &operator<<(QTextStream &s, QTextStreamManipulator m)
      |                                                ~~~~~~~~~~~~~~~~~~~~~~~^
In file included from /usr/include/qt5/QtCore/QDebug:1,
                 from /tmp/B.tU9xM8/BUILD/pulseview-0.4.2/pv/util.cpp:28:
/usr/include/qt5/QtCore/qdebug.h:238:15: note: candidate: 'template<class T> QDebug operator<<(QDebug, const QList<T>&)'
  238 | inline QDebug operator<<(QDebug debug, const QList<T> &list)
      |               ^~~~~~~~
/usr/include/qt5/QtCore/qdebug.h:238:15: note:   template argument deduction/substitution failed:
/tmp/B.tU9xM8/BUILD/pulseview-0.4.2/pv/util.cpp:140:9: note:   mismatched types 'const QList<T>' and 'QTextStream&(QTextStream&)'
  140 |   ts << forcesign;
      |         ^~~~~~~~~
/tmp/B.tU9xM8/BUILD/pulseview-0.4.2/pv/util.cpp:140:9: note:   mismatched types 'const QList<T>' and 'QTextStream&(QTextStream&)'
/tmp/B.tU9xM8/BUILD/pulseview-0.4.2/pv/util.cpp:140:9: note:   couldn't deduce template parameter 'T'
In file included from /usr/include/qt5/QtCore/QDebug:1,
                 from /tmp/B.tU9xM8/BUILD/pulseview-0.4.2/pv/util.cpp:28:
/usr/include/qt5/QtCore/qdebug.h:244:15: note: candidate: 'template<class T> QDebug operator<<(QDebug, const QVector<T>&)'
  244 | inline QDebug operator<<(QDebug debug, const QVector<T> &vec)
      |               ^~~~~~~~
/usr/include/qt5/QtCore/qdebug.h:244:15: note:   template argument deduction/substitution failed:
/tmp/B.tU9xM8/BUILD/pulseview-0.4.2/pv/util.cpp:140:9: note:   mismatched types 'const QVector<T>' and 'QTextStream&(QTextStream&)'
  140 |   ts << forcesign;
      |         ^~~~~~~~~
/tmp/B.tU9xM8/BUILD/pulseview-0.4.2/pv/util.cpp:140:9: note:   mismatched types 'const QVector<T>' and 'QTextStream&(QTextStream&)'
/tmp/B.tU9xM8/BUILD/pulseview-0.4.2/pv/util.cpp:140:9: note:   couldn't deduce template parameter 'T'
In file included from /usr/include/qt5/QtCore/QDebug:1,
                 from /tmp/B.tU9xM8/BUILD/pulseview-0.4.2/pv/util.cpp:28:
/usr/include/qt5/QtCore/qdebug.h:250:15: note: candidate: 'template<class T, class Alloc> QDebug operator<<(QDebug, const std::vector<_Tp, _Alloc>&)'
  250 | inline QDebug operator<<(QDebug debug, const std::vector<T, Alloc> &vec)
      |               ^~~~~~~~
/usr/include/qt5/QtCore/qdebug.h:250:15: note:   template argument deduction/substitution failed:
/tmp/B.tU9xM8/BUILD/pulseview-0.4.2/pv/util.cpp:140:9: note:   mismatched types 'const std::vector<_Tp, _Alloc>' and 'QTextStream&(QTextStream&)'
  140 |   ts << forcesign;
      |         ^~~~~~~~~
/tmp/B.tU9xM8/BUILD/pulseview-0.4.2/pv/util.cpp:140:9: note:   mismatched types 'const std::vector<_Tp, _Alloc>' and 'QTextStream&(QTextStream&)'
/tmp/B.tU9xM8/BUILD/pulseview-0.4.2/pv/util.cpp:140:9: note:   couldn't deduce template parameter 'T'
In file included from /usr/include/qt5/QtCore/QDebug:1,
                 from /tmp/B.tU9xM8/BUILD/pulseview-0.4.2/pv/util.cpp:28:
/usr/include/qt5/QtCore/qdebug.h:256:15: note: candidate: 'template<class T, class Alloc> QDebug operator<<(QDebug, const std::__cxx11::list<_Tp, _Alloc>&)'
  256 | inline QDebug operator<<(QDebug debug, const std::list<T, Alloc> &vec)
      |               ^~~~~~~~
/usr/include/qt5/QtCore/qdebug.h:256:15: note:   template argument deduction/substitution failed:
/tmp/B.tU9xM8/BUILD/pulseview-0.4.2/pv/util.cpp:140:9: note:   mismatched types 'const std::__cxx11::list<_Tp, _Alloc>' and 'QTextStream&(QTextStream&)'
  140 |   ts << forcesign;
      |         ^~~~~~~~~
/tmp/B.tU9xM8/BUILD/pulseview-0.4.2/pv/util.cpp:140:9: note:   mismatched types 'const std::__cxx11::list<_Tp, _Alloc>' and 'QTextStream&(QTextStream&)'
/tmp/B.tU9xM8/BUILD/pulseview-0.4.2/pv/util.cpp:140:9: note:   couldn't deduce template parameter 'T'
In file included from /usr/include/qt5/QtCore/QDebug:1,
                 from /tmp/B.tU9xM8/BUILD/pulseview-0.4.2/pv/util.cpp:28:
/usr/include/qt5/QtCore/qdebug.h:262:15: note: candidate: 'template<class Key, class T, class Compare, class Alloc> QDebug operator<<(QDebug, const std::map<_Key, _Tp, _Compare, _Alloc>&)'
  262 | inline QDebug operator<<(QDebug debug, const std::map<Key, T, Compare, Alloc> &map)
      |               ^~~~~~~~
/usr/include/qt5/QtCore/qdebug.h:262:15: note:   template argument deduction/substitution failed:
/tmp/B.tU9xM8/BUILD/pulseview-0.4.2/pv/util.cpp:140:9: note:   mismatched types 'const std::map<_Key, _Tp, _Compare, _Alloc>' and 'QTextStream&(QTextStream&)'
  140 |   ts << forcesign;
      |         ^~~~~~~~~
/tmp/B.tU9xM8/BUILD/pulseview-0.4.2/pv/util.cpp:140:9: note:   mismatched types 'const std::map<_Key, _Tp, _Compare, _Alloc>' and 'QTextStream&(QTextStream&)'
/tmp/B.tU9xM8/BUILD/pulseview-0.4.2/pv/util.cpp:140:9: note:   couldn't deduce template parameter 'Key'
In file included from /usr/include/qt5/QtCore/QDebug:1,
                 from /tmp/B.tU9xM8/BUILD/pulseview-0.4.2/pv/util.cpp:28:
/usr/include/qt5/QtCore/qdebug.h:268:15: note: candidate: 'template<class Key, class T, class Compare, class Alloc> QDebug operator<<(QDebug, const std::multimap<_Key, _Tp, _Compare, _Alloc>&)'
  268 | inline QDebug operator<<(QDebug debug, const std::multimap<Key, T, Compare, Alloc> &map)
      |               ^~~~~~~~
/usr/include/qt5/QtCore/qdebug.h:268:15: note:   template argument deduction/substitution failed:
/tmp/B.tU9xM8/BUILD/pulseview-0.4.2/pv/util.cpp:140:9: note:   mismatched types 'const std::multimap<_Key, _Tp, _Compare, _Alloc>' and 'QTextStream&(QTextStream&)'
  140 |   ts << forcesign;
      |         ^~~~~~~~~
/tmp/B.tU9xM8/BUILD/pulseview-0.4.2/pv/util.cpp:140:9: note:   mismatched types 'const std::multimap<_Key, _Tp, _Compare, _Alloc>' and 'QTextStream&(QTextStream&)'
/tmp/B.tU9xM8/BUILD/pulseview-0.4.2/pv/util.cpp:140:9: note:   couldn't deduce template parameter 'Key'
In file included from /usr/include/qt5/QtCore/QDebug:1,
                 from /tmp/B.tU9xM8/BUILD/pulseview-0.4.2/pv/util.cpp:28:
/usr/include/qt5/QtCore/qdebug.h:274:15: note: candidate: 'template<class Key, class T> QDebug operator<<(QDebug, const QMap<K, V>&)'
  274 | inline QDebug operator<<(QDebug debug, const QMap<Key, T> &map)
      |               ^~~~~~~~
/usr/include/qt5/QtCore/qdebug.h:274:15: note:   template argument deduction/substitution failed:
/tmp/B.tU9xM8/BUILD/pulseview-0.4.2/pv/util.cpp:140:9: note:   mismatched types 'const QMap<K, V>' and 'QTextStream&(QTextStream&)'
  140 |   ts << forcesign;
      |         ^~~~~~~~~
/tmp/B.tU9xM8/BUILD/pulseview-0.4.2/pv/util.cpp:140:9: note:   mismatched types 'const QMap<K, V>' and 'QTextStream&(QTextStream&)'
/tmp/B.tU9xM8/BUILD/pulseview-0.4.2/pv/util.cpp:140:9: note:   couldn't deduce template parameter 'Key'
In file included from /usr/include/qt5/QtCore/QDebug:1,
                 from /tmp/B.tU9xM8/BUILD/pulseview-0.4.2/pv/util.cpp:28:
/usr/include/qt5/QtCore/qdebug.h:288:15: note: candidate: 'template<class Key, class T> QDebug operator<<(QDebug, const QHash<K, V>&)'
  288 | inline QDebug operator<<(QDebug debug, const QHash<Key, T> &hash)
      |               ^~~~~~~~
/usr/include/qt5/QtCore/qdebug.h:288:15: note:   template argument deduction/substitution failed:
/tmp/B.tU9xM8/BUILD/pulseview-0.4.2/pv/util.cpp:140:9: note:   mismatched types 'const QHash<K, V>' and 'QTextStream&(QTextStream&)'
  140 |   ts << forcesign;
      |         ^~~~~~~~~
/tmp/B.tU9xM8/BUILD/pulseview-0.4.2/pv/util.cpp:140:9: note:   mismatched types 'const QHash<K, V>' and 'QTextStream&(QTextStream&)'
/tmp/B.tU9xM8/BUILD/pulseview-0.4.2/pv/util.cpp:140:9: note:   couldn't deduce template parameter 'Key'
In file included from /usr/include/qt5/QtCore/QDebug:1,
                 from /tmp/B.tU9xM8/BUILD/pulseview-0.4.2/pv/util.cpp:28:
/usr/include/qt5/QtCore/qdebug.h:301:15: note: candidate: 'template<class T1, class T2> QDebug operator<<(QDebug, const QPair<T1, T2>&)'
  301 | inline QDebug operator<<(QDebug debug, const QPair<T1, T2> &pair)
      |               ^~~~~~~~
/usr/include/qt5/QtCore/qdebug.h:301:15: note:   template argument deduction/substitution failed:
/tmp/B.tU9xM8/BUILD/pulseview-0.4.2/pv/util.cpp:140:9: note:   mismatched types 'const QPair<T1, T2>' and 'QTextStream&(QTextStream&)'
  140 |   ts << forcesign;
      |         ^~~~~~~~~
/tmp/B.tU9xM8/BUILD/pulseview-0.4.2/pv/util.cpp:140:9: note:   mismatched types 'const QPair<T1, T2>' and 'QTextStream&(QTextStream&)'
/tmp/B.tU9xM8/BUILD/pulseview-0.4.2/pv/util.cpp:140:9: note:   couldn't deduce template parameter 'T1'
In file included from /usr/include/qt5/QtCore/QDebug:1,
                 from /tmp/B.tU9xM8/BUILD/pulseview-0.4.2/pv/util.cpp:28:
/usr/include/qt5/QtCore/qdebug.h:310:15: note: candidate: 'template<class T1, class T2> QDebug operator<<(QDebug, const std::pair<_T1, _T2>&)'
  310 | inline QDebug operator<<(QDebug debug, const std::pair<T1, T2> &pair)
      |               ^~~~~~~~
/usr/include/qt5/QtCore/qdebug.h:310:15: note:   template argument deduction/substitution failed:
/tmp/B.tU9xM8/BUILD/pulseview-0.4.2/pv/util.cpp:140:9: note:   mismatched types 'const std::pair<_T1, _T2>' and 'QTextStream&(QTextStream&)'
  140 |   ts << forcesign;
      |         ^~~~~~~~~
/tmp/B.tU9xM8/BUILD/pulseview-0.4.2/pv/util.cpp:140:9: note:   mismatched types 'const std::pair<_T1, _T2>' and 'QTextStream&(QTextStream&)'
/tmp/B.tU9xM8/BUILD/pulseview-0.4.2/pv/util.cpp:140:9: note:   couldn't deduce template parameter 'T1'
In file included from /usr/include/qt5/QtCore/QDebug:1,
                 from /tmp/B.tU9xM8/BUILD/pulseview-0.4.2/pv/util.cpp:28:
/usr/include/qt5/QtCore/qdebug.h:319:15: note: candidate: 'template<class T> QDebug operator<<(QDebug, const QSet<T>&)'
  319 | inline QDebug operator<<(QDebug debug, const QSet<T> &set)
      |               ^~~~~~~~
/usr/include/qt5/QtCore/qdebug.h:319:15: note:   template argument deduction/substitution failed:
/tmp/B.tU9xM8/BUILD/pulseview-0.4.2/pv/util.cpp:140:9: note:   mismatched types 'const QSet<T>' and 'QTextStream&(QTextStream&)'
  140 |   ts << forcesign;
      |         ^~~~~~~~~
/tmp/B.tU9xM8/BUILD/pulseview-0.4.2/pv/util.cpp:140:9: note:   mismatched types 'const QSet<T>' and 'QTextStream&(QTextStream&)'
/tmp/B.tU9xM8/BUILD/pulseview-0.4.2/pv/util.cpp:140:9: note:   couldn't deduce template parameter 'T'
In file included from /usr/include/qt5/QtCore/QDebug:1,
                 from /tmp/B.tU9xM8/BUILD/pulseview-0.4.2/pv/util.cpp:28:
/usr/include/qt5/QtCore/qdebug.h:325:15: note: candidate: 'template<class T> QDebug operator<<(QDebug, const QContiguousCache<T>&)'
  325 | inline QDebug operator<<(QDebug debug, const QContiguousCache<T> &cache)
      |               ^~~~~~~~
/usr/include/qt5/QtCore/qdebug.h:325:15: note:   template argument deduction/substitution failed:
/tmp/B.tU9xM8/BUILD/pulseview-0.4.2/pv/util.cpp:140:9: note:   mismatched types 'const QContiguousCache<T>' and 'QTextStream&(QTextStream&)'
  140 |   ts << forcesign;
      |         ^~~~~~~~~
/tmp/B.tU9xM8/BUILD/pulseview-0.4.2/pv/util.cpp:140:9: note:   mismatched types 'const QContiguousCache<T>' and 'QTextStream&(QTextStream&)'
/tmp/B.tU9xM8/BUILD/pulseview-0.4.2/pv/util.cpp:140:9: note:   couldn't deduce template parameter 'T'
In file included from /usr/include/qt5/QtCore/QDebug:1,
                 from /tmp/B.tU9xM8/BUILD/pulseview-0.4.2/pv/util.cpp:28:
/usr/include/qt5/QtCore/qdebug.h:340:15: note: candidate: 'template<class T> QDebug operator<<(QDebug, const QSharedPointer<T>&)'
  340 | inline QDebug operator<<(QDebug debug, const QSharedPointer<T> &ptr)
      |               ^~~~~~~~
/usr/include/qt5/QtCore/qdebug.h:340:15: note:   template argument deduction/substitution failed:
/tmp/B.tU9xM8/BUILD/pulseview-0.4.2/pv/util.cpp:140:9: note:   mismatched types 'const QSharedPointer<T>' and 'QTextStream&(QTextStream&)'
  140 |   ts << forcesign;
      |         ^~~~~~~~~
/tmp/B.tU9xM8/BUILD/pulseview-0.4.2/pv/util.cpp:140:9: note:   mismatched types 'const QSharedPointer<T>' and 'QTextStream&(QTextStream&)'
/tmp/B.tU9xM8/BUILD/pulseview-0.4.2/pv/util.cpp:140:9: note:   couldn't deduce template parameter 'T'
In file included from /usr/include/qt5/QtCore/QDebug:1,
                 from /tmp/B.tU9xM8/BUILD/pulseview-0.4.2/pv/util.cpp:28:
/usr/include/qt5/QtCore/qdebug.h:374:1: note: candidate: 'template<class T> typename std::enable_if<QtPrivate::IsQEnumHelper<T>::Value, QDebug>::type operator<<(QDebug, T)'
  374 | operator<<(QDebug dbg, T value)
      | ^~~~~~~~
/usr/include/qt5/QtCore/qdebug.h:374:1: note:   template argument deduction/substitution failed:
/tmp/B.tU9xM8/BUILD/pulseview-0.4.2/pv/util.cpp:140:9: note:   couldn't deduce template parameter 'T'
  140 |   ts << forcesign;
      |         ^~~~~~~~~
In file included from /usr/include/qt5/QtCore/QDebug:1,
                 from /tmp/B.tU9xM8/BUILD/pulseview-0.4.2/pv/util.cpp:28:
/usr/include/qt5/QtCore/qdebug.h:386:15: note: candidate: 'template<class T, class A, class B, class C, class D> QDebug operator<<(QDebug, T)'
  386 | inline QDebug operator<<(QDebug dbg, T value)
      |               ^~~~~~~~
/usr/include/qt5/QtCore/qdebug.h:386:15: note:   template argument deduction/substitution failed:
/tmp/B.tU9xM8/BUILD/pulseview-0.4.2/pv/util.cpp:140:9: note:   couldn't deduce template parameter 'T'
  140 |   ts << forcesign;
      |         ^~~~~~~~~
In file included from /usr/include/qt5/QtCore/QDebug:1,
                 from /tmp/B.tU9xM8/BUILD/pulseview-0.4.2/pv/util.cpp:28:
/usr/include/qt5/QtCore/qdebug.h:420:15: note: candidate: 'template<class T> QDebug operator<<(QDebug, const QFlags<T>&)'
  420 | inline QDebug operator<<(QDebug debug, const QFlags<T> &flags)
      |               ^~~~~~~~
/usr/include/qt5/QtCore/qdebug.h:420:15: note:   template argument deduction/substitution failed:
/tmp/B.tU9xM8/BUILD/pulseview-0.4.2/pv/util.cpp:140:9: note:   mismatched types 'const QFlags<T>' and 'QTextStream&(QTextStream&)'
  140 |   ts << forcesign;
      |         ^~~~~~~~~
/tmp/B.tU9xM8/BUILD/pulseview-0.4.2/pv/util.cpp:140:9: note:   mismatched types 'const QFlags<T>' and 'QTextStream&(QTextStream&)'
/tmp/B.tU9xM8/BUILD/pulseview-0.4.2/pv/util.cpp:140:9: note:   couldn't deduce template parameter 'T'
/tmp/B.tU9xM8/BUILD/pulseview-0.4.2/pv/util.cpp: In function 'QString pv::util::format_value_si(double, pv::util::SIPrefix, unsigned int, QString, bool)':
/tmp/B.tU9xM8/BUILD/pulseview-0.4.2/pv/util.cpp:178:6: error: no match for 'operator<<' (operand types are 'QTextStream' and '<unresolved overloaded function type>')
  178 |   ts << forcesign;
      |   ~~~^~~~~~~~~~~~
In file included from /usr/include/qt5/QtCore/qdebug.h:49,
                 from /usr/include/qt5/QtCore/QDebug:1,
                 from /tmp/B.tU9xM8/BUILD/pulseview-0.4.2/pv/util.cpp:28:
/usr/include/qt5/QtCore/qtextstream.h:174:18: note: candidate: 'QTextStream& QTextStream::operator<<(QChar)'
  174 |     QTextStream &operator<<(QChar ch);
      |                  ^~~~~~~~
/usr/include/qt5/QtCore/qtextstream.h:174:35: note:   no known conversion for argument 1 from '<unresolved overloaded function type>' to 'QChar'
  174 |     QTextStream &operator<<(QChar ch);
      |                             ~~~~~~^~
/usr/include/qt5/QtCore/qtextstream.h:175:18: note: candidate: 'QTextStream& QTextStream::operator<<(char)'
  175 |     QTextStream &operator<<(char ch);
      |                  ^~~~~~~~
/usr/include/qt5/QtCore/qtextstream.h:175:34: note:   no known conversion for argument 1 from '<unresolved overloaded function type>' to 'char'
  175 |     QTextStream &operator<<(char ch);
      |                             ~~~~~^~
/usr/include/qt5/QtCore/qtextstream.h:176:18: note: candidate: 'QTextStream& QTextStream::operator<<(short int)'
  176 |     QTextStream &operator<<(signed short i);
      |                  ^~~~~~~~
/usr/include/qt5/QtCore/qtextstream.h:176:42: note:   no known conversion for argument 1 from '<unresolved overloaded function type>' to 'short int'
  176 |     QTextStream &operator<<(signed short i);
      |                             ~~~~~~~~~~~~~^
/usr/include/qt5/QtCore/qtextstream.h:177:18: note: candidate: 'QTextStream& QTextStream::operator<<(short unsigned int)'
  177 |     QTextStream &operator<<(unsigned short i);
      |                  ^~~~~~~~
/usr/include/qt5/QtCore/qtextstream.h:177:44: note:   no known conversion for argument 1 from '<unresolved overloaded function type>' to 'short unsigned int'
  177 |     QTextStream &operator<<(unsigned short i);
      |                             ~~~~~~~~~~~~~~~^
/usr/include/qt5/QtCore/qtextstream.h:178:18: note: candidate: 'QTextStream& QTextStream::operator<<(int)'
  178 |     QTextStream &operator<<(signed int i);
      |                  ^~~~~~~~
/usr/include/qt5/QtCore/qtextstream.h:178:40: note:   no known conversion for argument 1 from '<unresolved overloaded function type>' to 'int'
  178 |     QTextStream &operator<<(signed int i);
      |                             ~~~~~~~~~~~^
/usr/include/qt5/QtCore/qtextstream.h:179:18: note: candidate: 'QTextStream& QTextStream::operator<<(unsigned int)'
  179 |     QTextStream &operator<<(unsigned int i);
      |                  ^~~~~~~~
/usr/include/qt5/QtCore/qtextstream.h:179:42: note:   no known conversion for argument 1 from '<unresolved overloaded function type>' to 'unsigned int'
  179 |     QTextStream &operator<<(unsigned int i);
      |                             ~~~~~~~~~~~~~^
/usr/include/qt5/QtCore/qtextstream.h:180:18: note: candidate: 'QTextStream& QTextStream::operator<<(long int)'
  180 |     QTextStream &operator<<(signed long i);
      |                  ^~~~~~~~
/usr/include/qt5/QtCore/qtextstream.h:180:41: note:   no known conversion for argument 1 from '<unresolved overloaded function type>' to 'long int'
  180 |     QTextStream &operator<<(signed long i);
      |                             ~~~~~~~~~~~~^
/usr/include/qt5/QtCore/qtextstream.h:181:18: note: candidate: 'QTextStream& QTextStream::operator<<(long unsigned int)'
  181 |     QTextStream &operator<<(unsigned long i);
      |                  ^~~~~~~~
/usr/include/qt5/QtCore/qtextstream.h:181:43: note:   no known conversion for argument 1 from '<unresolved overloaded function type>' to 'long unsigned int'
  181 |     QTextStream &operator<<(unsigned long i);
      |                             ~~~~~~~~~~~~~~^
/usr/include/qt5/QtCore/qtextstream.h:182:18: note: candidate: 'QTextStream& QTextStream::operator<<(qlonglong)'
  182 |     QTextStream &operator<<(qlonglong i);
      |                  ^~~~~~~~
/usr/include/qt5/QtCore/qtextstream.h:182:39: note:   no known conversion for argument 1 from '<unresolved overloaded function type>' to 'qlonglong' {aka 'long long int'}
  182 |     QTextStream &operator<<(qlonglong i);
      |                             ~~~~~~~~~~^
/usr/include/qt5/QtCore/qtextstream.h:183:18: note: candidate: 'QTextStream& QTextStream::operator<<(qulonglong)'
  183 |     QTextStream &operator<<(qulonglong i);
      |                  ^~~~~~~~
/usr/include/qt5/QtCore/qtextstream.h:183:40: note:   no known conversion for argument 1 from '<unresolved overloaded function type>' to 'qulonglong' {aka 'long long unsigned int'}
  183 |     QTextStream &operator<<(qulonglong i);
      |                             ~~~~~~~~~~~^
/usr/include/qt5/QtCore/qtextstream.h:184:18: note: candidate: 'QTextStream& QTextStream::operator<<(float)'
  184 |     QTextStream &operator<<(float f);
      |                  ^~~~~~~~
/usr/include/qt5/QtCore/qtextstream.h:184:35: note:   no known conversion for argument 1 from '<unresolved overloaded function type>' to 'float'
  184 |     QTextStream &operator<<(float f);
      |                             ~~~~~~^
/usr/include/qt5/QtCore/qtextstream.h:185:18: note: candidate: 'QTextStream& QTextStream::operator<<(double)'
  185 |     QTextStream &operator<<(double f);
      |                  ^~~~~~~~
/usr/include/qt5/QtCore/qtextstream.h:185:36: note:   no known conversion for argument 1 from '<unresolved overloaded function type>' to 'double'
  185 |     QTextStream &operator<<(double f);
      |                             ~~~~~~~^
/usr/include/qt5/QtCore/qtextstream.h:186:18: note: candidate: 'QTextStream& QTextStream::operator<<(const QString&)'
  186 |     QTextStream &operator<<(const QString &s);
      |                  ^~~~~~~~
/usr/include/qt5/QtCore/qtextstream.h:186:44: note:   no known conversion for argument 1 from '<unresolved overloaded function type>' to 'const QString&'
  186 |     QTextStream &operator<<(const QString &s);
      |                             ~~~~~~~~~~~~~~~^
/usr/include/qt5/QtCore/qtextstream.h:187:18: note: candidate: 'QTextStream& QTextStream::operator<<(QStringView)'
  187 |     QTextStream &operator<<(QStringView s);
      |                  ^~~~~~~~
/usr/include/qt5/QtCore/qtextstream.h:187:41: note:   no known conversion for argument 1 from '<unresolved overloaded function type>' to 'QStringView'
  187 |     QTextStream &operator<<(QStringView s);
      |                             ~~~~~~~~~~~~^
/usr/include/qt5/QtCore/qtextstream.h:188:18: note: candidate: 'QTextStream& QTextStream::operator<<(QLatin1String)'
  188 |     QTextStream &operator<<(QLatin1String s);
      |                  ^~~~~~~~
/usr/include/qt5/QtCore/qtextstream.h:188:43: note:   no known conversion for argument 1 from '<unresolved overloaded function type>' to 'QLatin1String'
  188 |     QTextStream &operator<<(QLatin1String s);
      |                             ~~~~~~~~~~~~~~^
/usr/include/qt5/QtCore/qtextstream.h:189:18: note: candidate: 'QTextStream& QTextStream::operator<<(const QStringRef&)'
  189 |     QTextStream &operator<<(const QStringRef &s);
      |                  ^~~~~~~~
/usr/include/qt5/QtCore/qtextstream.h:189:47: note:   no known conversion for argument 1 from '<unresolved overloaded function type>' to 'const QStringRef&'
  189 |     QTextStream &operator<<(const QStringRef &s);
      |                             ~~~~~~~~~~~~~~~~~~^
/usr/include/qt5/QtCore/qtextstream.h:190:18: note: candidate: 'QTextStream& QTextStream::operator<<(const QByteArray&)'
  190 |     QTextStream &operator<<(const QByteArray &array);
      |                  ^~~~~~~~
/usr/include/qt5/QtCore/qtextstream.h:190:47: note:   no known conversion for argument 1 from '<unresolved overloaded function type>' to 'const QByteArray&'
  190 |     QTextStream &operator<<(const QByteArray &array);
      |                             ~~~~~~~~~~~~~~~~~~^~~~~
/usr/include/qt5/QtCore/qtextstream.h:191:18: note: candidate: 'QTextStream& QTextStream::operator<<(const char*)'
  191 |     QTextStream &operator<<(const char *c);
      |                  ^~~~~~~~
/usr/include/qt5/QtCore/qtextstream.h:191:41: note:   no known conversion for argument 1 from '<unresolved overloaded function type>' to 'const char*'
  191 |     QTextStream &operator<<(const char *c);
      |                             ~~~~~~~~~~~~^
/usr/include/qt5/QtCore/qtextstream.h:192:18: note: candidate: 'QTextStream& QTextStream::operator<<(const void*)'
  192 |     QTextStream &operator<<(const void *ptr);
      |                  ^~~~~~~~
/usr/include/qt5/QtCore/qtextstream.h:192:41: note:   no known conversion for argument 1 from '<unresolved overloaded function type>' to 'const void*'
  192 |     QTextStream &operator<<(const void *ptr);
      |                             ~~~~~~~~~~~~^~~
/tmp/B.tU9xM8/BUILD/pulseview-0.4.2/pv/util.cpp:44:21: note: candidate: 'QTextStream& pv::util::operator<<(QTextStream&, pv::util::SIPrefix)'
   44 | static QTextStream& operator<<(QTextStream& stream, SIPrefix prefix)
      |                     ^~~~~~~~
/tmp/B.tU9xM8/BUILD/pulseview-0.4.2/pv/util.cpp:44:62: note:   no known conversion for argument 2 from '<unresolved overloaded function type>' to 'pv::util::SIPrefix'
   44 | static QTextStream& operator<<(QTextStream& stream, SIPrefix prefix)
      |                                                     ~~~~~~~~~^~~~~~
/tmp/B.tU9xM8/BUILD/pulseview-0.4.2/pv/util.cpp:81:21: note: candidate: 'QTextStream& pv::util::operator<<(QTextStream&, const Timestamp&)'
   81 | static QTextStream& operator<<(QTextStream& stream, const Timestamp& t)
      |                     ^~~~~~~~
/tmp/B.tU9xM8/BUILD/pulseview-0.4.2/pv/util.cpp:81:70: note:   no known conversion for argument 2 from '<unresolved overloaded function type>' to 'const Timestamp&' {aka 'const boost::multiprecision::number<boost::multiprecision::backends::cpp_dec_float<24>, boost::multiprecision::et_off>&'}
   81 | static QTextStream& operator<<(QTextStream& stream, const Timestamp& t)
      |                                                     ~~~~~~~~~~~~~~~~~^
In file included from /usr/include/qt5/QtCore/qmetatype.h:47,
                 from /usr/include/qt5/QtCore/QMetaType:1,
                 from /tmp/B.tU9xM8/BUILD/pulseview-0.4.2/pv/util.hpp:31,
                 from /tmp/B.tU9xM8/BUILD/pulseview-0.4.2/pv/util.cpp:20:
/usr/include/qt5/QtCore/qbytearray.h:751:28: note: candidate: 'QDataStream& operator<<(QDataStream&, const QByteArray&)'
  751 | Q_CORE_EXPORT QDataStream &operator<<(QDataStream &, const QByteArray &);
      |                            ^~~~~~~~
/usr/include/qt5/QtCore/qbytearray.h:751:39: note:   no known conversion for argument 1 from 'QTextStream' to 'QDataStream&'
  751 | Q_CORE_EXPORT QDataStream &operator<<(QDataStream &, const QByteArray &);
      |                                       ^~~~~~~~~~~~~
In file included from /usr/include/qt5/QtCore/qstring.h:49,
                 from /usr/include/qt5/QtCore/qhashfunctions.h:44,
                 from /usr/include/qt5/QtCore/qvarlengtharray.h:47,
                 from /usr/include/qt5/QtCore/qmetatype.h:48,
                 from /usr/include/qt5/QtCore/QMetaType:1,
                 from /tmp/B.tU9xM8/BUILD/pulseview-0.4.2/pv/util.hpp:31,
                 from /tmp/B.tU9xM8/BUILD/pulseview-0.4.2/pv/util.cpp:20:
/usr/include/qt5/QtCore/qchar.h:662:28: note: candidate: 'QDataStream& operator<<(QDataStream&, QChar)'
  662 | Q_CORE_EXPORT QDataStream &operator<<(QDataStream &, QChar);
      |                            ^~~~~~~~
/usr/include/qt5/QtCore/qchar.h:662:39: note:   no known conversion for argument 1 from 'QTextStream' to 'QDataStream&'
  662 | Q_CORE_EXPORT QDataStream &operator<<(QDataStream &, QChar);
      |                                       ^~~~~~~~~~~~~
In file included from /usr/include/qt5/QtCore/qhashfunctions.h:44,
                 from /usr/include/qt5/QtCore/qvarlengtharray.h:47,
                 from /usr/include/qt5/QtCore/qmetatype.h:48,
                 from /usr/include/qt5/QtCore/QMetaType:1,
                 from /tmp/B.tU9xM8/BUILD/pulseview-0.4.2/pv/util.hpp:31,
                 from /tmp/B.tU9xM8/BUILD/pulseview-0.4.2/pv/util.cpp:20:
/usr/include/qt5/QtCore/qstring.h:1583:28: note: candidate: 'QDataStream& operator<<(QDataStream&, const QString&)'
 1583 | Q_CORE_EXPORT QDataStream &operator<<(QDataStream &, const QString &);
      |                            ^~~~~~~~
/usr/include/qt5/QtCore/qstring.h:1583:39: note:   no known conversion for argument 1 from 'QTextStream' to 'QDataStream&'
 1583 | Q_CORE_EXPORT QDataStream &operator<<(QDataStream &, const QString &);
      |                                       ^~~~~~~~~~~~~
In file included from /usr/include/qt5/QtCore/qstringlist.h:48,
                 from /usr/include/qt5/QtCore/qlist.h:1196,
                 from /usr/include/qt5/QtCore/qhash.h:46,
                 from /usr/include/qt5/QtCore/qdebug.h:45,
                 from /usr/include/qt5/QtCore/QDebug:1,
                 from /tmp/B.tU9xM8/BUILD/pulseview-0.4.2/pv/util.cpp:28:
/usr/include/qt5/QtCore/qregexp.h:122:28: note: candidate: 'QDataStream& operator<<(QDataStream&, const QRegExp&)'
  122 | Q_CORE_EXPORT QDataStream &operator<<(QDataStream &out, const QRegExp &regExp);
      |                            ^~~~~~~~
/usr/include/qt5/QtCore/qregexp.h:122:52: note:   no known conversion for argument 1 from 'QTextStream' to 'QDataStream&'
  122 | Q_CORE_EXPORT QDataStream &operator<<(QDataStream &out, const QRegExp &regExp);
      |                                       ~~~~~~~~~~~~~^~~
/usr/include/qt5/QtCore/qregexp.h:127:22: note: candidate: 'QDebug operator<<(QDebug, const QRegExp&)'
  127 | Q_CORE_EXPORT QDebug operator<<(QDebug, const QRegExp &);
      |                      ^~~~~~~~
/usr/include/qt5/QtCore/qregexp.h:127:33: note:   no known conversion for argument 1 from 'QTextStream' to 'QDebug'
  127 | Q_CORE_EXPORT QDebug operator<<(QDebug, const QRegExp &);
      |                                 ^~~~~~
In file included from /usr/include/qt5/QtCore/qiodevice.h:45,
                 from /usr/include/qt5/QtCore/qtextstream.h:43,
                 from /usr/include/qt5/QtCore/qdebug.h:49,
                 from /usr/include/qt5/QtCore/QDebug:1,
                 from /tmp/B.tU9xM8/BUILD/pulseview-0.4.2/pv/util.cpp:28:
/usr/include/qt5/QtCore/qobject.h:554:22: note: candidate: 'QDebug operator<<(QDebug, const QObject*)'
  554 | Q_CORE_EXPORT QDebug operator<<(QDebug, const QObject *);
      |                      ^~~~~~~~
/usr/include/qt5/QtCore/qobject.h:554:33: note:   no known conversion for argument 1 from 'QTextStream' to 'QDebug'
  554 | Q_CORE_EXPORT QDebug operator<<(QDebug, const QObject *);
      |                                 ^~~~~~
In file included from /usr/include/qt5/QtCore/qtextstream.h:43,
                 from /usr/include/qt5/QtCore/qdebug.h:49,
                 from /usr/include/qt5/QtCore/QDebug:1,
                 from /tmp/B.tU9xM8/BUILD/pulseview-0.4.2/pv/util.cpp:28:
/usr/include/qt5/QtCore/qiodevice.h:189:22: note: candidate: 'QDebug operator<<(QDebug, QIODevice::OpenMode)'
  189 | Q_CORE_EXPORT QDebug operator<<(QDebug debug, QIODevice::OpenMode modes);
      |                      ^~~~~~~~
/usr/include/qt5/QtCore/qiodevice.h:189:40: note:   no known conversion for argument 1 from 'QTextStream' to 'QDebug'
  189 | Q_CORE_EXPORT QDebug operator<<(QDebug debug, QIODevice::OpenMode modes);
      |                                 ~~~~~~~^~~~~
In file included from /usr/include/qt5/QtCore/qlocale.h:43,
                 from /usr/include/qt5/QtCore/qtextstream.h:46,
                 from /usr/include/qt5/QtCore/qdebug.h:49,
                 from /usr/include/qt5/QtCore/QDebug:1,
                 from /tmp/B.tU9xM8/BUILD/pulseview-0.4.2/pv/util.cpp:28:
/usr/include/qt5/QtCore/qvariant.h:584:28: note: candidate: 'QDataStream& operator<<(QDataStream&, const QVariant&)'
  584 | Q_CORE_EXPORT QDataStream& operator<< (QDataStream& s, const QVariant& p);
      |                            ^~~~~~~~
/usr/include/qt5/QtCore/qvariant.h:584:53: note:   no known conversion for argument 1 from 'QTextStream' to 'QDataStream&'
  584 | Q_CORE_EXPORT QDataStream& operator<< (QDataStream& s, const QVariant& p);
      |                                        ~~~~~~~~~~~~~^
/usr/include/qt5/QtCore/qvariant.h:586:28: note: candidate: 'QDataStream& operator<<(QDataStream&, QVariant::Type)'
  586 | Q_CORE_EXPORT QDataStream& operator<< (QDataStream& s, const QVariant::Type p);
      |                            ^~~~~~~~
/usr/include/qt5/QtCore/qvariant.h:586:53: note:   no known conversion for argument 1 from 'QTextStream' to 'QDataStream&'
  586 | Q_CORE_EXPORT QDataStream& operator<< (QDataStream& s, const QVariant::Type p);
      |                                        ~~~~~~~~~~~~~^
In file included from /usr/include/qt5/QtCore/qlocale.h:43,
                 from /usr/include/qt5/QtCore/qtextstream.h:46,
                 from /usr/include/qt5/QtCore/qdebug.h:49,
                 from /usr/include/qt5/QtCore/QDebug:1,
                 from /tmp/B.tU9xM8/BUILD/pulseview-0.4.2/pv/util.cpp:28:
/usr/include/qt5/QtCore/qvariant.h:902:22: note: candidate: 'QDebug operator<<(QDebug, const QVariant&)'
  902 | Q_CORE_EXPORT QDebug operator<<(QDebug, const QVariant &);
      |                      ^~~~~~~~
In file included from /usr/include/qt5/QtCore/qlocale.h:43,
                 from /usr/include/qt5/QtCore/qtextstream.h:46,
                 from /usr/include/qt5/QtCore/qdebug.h:49,
                 from /usr/include/qt5/QtCore/QDebug:1,
                 from /tmp/B.tU9xM8/BUILD/pulseview-0.4.2/pv/util.cpp:28:
/usr/include/qt5/QtCore/qvariant.h:480:44: note:   no known conversion for argument 1 from 'QTextStream' to 'QDebug'
  480 |     friend Q_CORE_EXPORT QDebug operator<<(QDebug, const QVariant &);
      |                                            ^~~~~~
In file included from /usr/include/qt5/QtCore/qlocale.h:43,
                 from /usr/include/qt5/QtCore/qtextstream.h:46,
                 from /usr/include/qt5/QtCore/qdebug.h:49,
                 from /usr/include/qt5/QtCore/QDebug:1,
                 from /tmp/B.tU9xM8/BUILD/pulseview-0.4.2/pv/util.cpp:28:
/usr/include/qt5/QtCore/qvariant.h:903:22: note: candidate: 'QDebug operator<<(QDebug, QVariant::Type)'
  903 | Q_CORE_EXPORT QDebug operator<<(QDebug, const QVariant::Type);
      |                      ^~~~~~~~
/usr/include/qt5/QtCore/qvariant.h:903:33: note:   no known conversion for argument 1 from 'QTextStream' to 'QDebug'
  903 | Q_CORE_EXPORT QDebug operator<<(QDebug, const QVariant::Type);
      |                                 ^~~~~~
In file included from /usr/include/qt5/QtCore/qtextstream.h:46,
                 from /usr/include/qt5/QtCore/qdebug.h:49,
                 from /usr/include/qt5/QtCore/QDebug:1,
                 from /tmp/B.tU9xM8/BUILD/pulseview-0.4.2/pv/util.cpp:28:
/usr/include/qt5/QtCore/qlocale.h:1168:28: note: candidate: 'QDataStream& operator<<(QDataStream&, const QLocale&)'
 1168 | Q_CORE_EXPORT QDataStream &operator<<(QDataStream &, const QLocale &);
      |                            ^~~~~~~~
/usr/include/qt5/QtCore/qlocale.h:1168:39: note:   no known conversion for argument 1 from 'QTextStream' to 'QDataStream&'
 1168 | Q_CORE_EXPORT QDataStream &operator<<(QDataStream &, const QLocale &);
      |                                       ^~~~~~~~~~~~~
/usr/include/qt5/QtCore/qlocale.h:1173:22: note: candidate: 'QDebug operator<<(QDebug, const QLocale&)'
 1173 | Q_CORE_EXPORT QDebug operator<<(QDebug, const QLocale &);
      |                      ^~~~~~~~
/usr/include/qt5/QtCore/qlocale.h:1173:33: note:   no known conversion for argument 1 from 'QTextStream' to 'QDebug'
 1173 | Q_CORE_EXPORT QDebug operator<<(QDebug, const QLocale &);
      |                                 ^~~~~~
In file included from /usr/include/qt5/QtCore/qdebug.h:49,
                 from /usr/include/qt5/QtCore/QDebug:1,
                 from /tmp/B.tU9xM8/BUILD/pulseview-0.4.2/pv/util.cpp:28:
/usr/include/qt5/QtCore/qtextstream.h:230:21: note: candidate: 'QTextStream& operator<<(QTextStream&, QTextStreamFunction)'
  230 | inline QTextStream &operator<<(QTextStream &s, QTextStreamFunction f)
      |                     ^~~~~~~~
/usr/include/qt5/QtCore/qtextstream.h:230:68: note:   no known conversion for argument 2 from '<unresolved overloaded function type>' to 'QTextStreamFunction' {aka 'QTextStream& (*)(QTextStream&)'}
  230 | inline QTextStream &operator<<(QTextStream &s, QTextStreamFunction f)
      |                                                ~~~~~~~~~~~~~~~~~~~~^
/usr/include/qt5/QtCore/qtextstream.h:233:21: note: candidate: 'QTextStream& operator<<(QTextStream&, QTextStreamManipulator)'
  233 | inline QTextStream &operator<<(QTextStream &s, QTextStreamManipulator m)
      |                     ^~~~~~~~
/usr/include/qt5/QtCore/qtextstream.h:233:71: note:   no known conversion for argument 2 from '<unresolved overloaded function type>' to 'QTextStreamManipulator'
  233 | inline QTextStream &operator<<(QTextStream &s, QTextStreamManipulator m)
      |                                                ~~~~~~~~~~~~~~~~~~~~~~~^
In file included from /usr/include/qt5/QtCore/QDebug:1,
                 from /tmp/B.tU9xM8/BUILD/pulseview-0.4.2/pv/util.cpp:28:
/usr/include/qt5/QtCore/qdebug.h:238:15: note: candidate: 'template<class T> QDebug operator<<(QDebug, const QList<T>&)'
  238 | inline QDebug operator<<(QDebug debug, const QList<T> &list)
      |               ^~~~~~~~
/usr/include/qt5/QtCore/qdebug.h:238:15: note:   template argument deduction/substitution failed:
/tmp/B.tU9xM8/BUILD/pulseview-0.4.2/pv/util.cpp:178:9: note:   mismatched types 'const QList<T>' and 'QTextStream&(QTextStream&)'
  178 |   ts << forcesign;
      |         ^~~~~~~~~
/tmp/B.tU9xM8/BUILD/pulseview-0.4.2/pv/util.cpp:178:9: note:   mismatched types 'const QList<T>' and 'QTextStream&(QTextStream&)'
/tmp/B.tU9xM8/BUILD/pulseview-0.4.2/pv/util.cpp:178:9: note:   couldn't deduce template parameter 'T'
In file included from /usr/include/qt5/QtCore/QDebug:1,
                 from /tmp/B.tU9xM8/BUILD/pulseview-0.4.2/pv/util.cpp:28:
/usr/include/qt5/QtCore/qdebug.h:244:15: note: candidate: 'template<class T> QDebug operator<<(QDebug, const QVector<T>&)'
  244 | inline QDebug operator<<(QDebug debug, const QVector<T> &vec)
      |               ^~~~~~~~
/usr/include/qt5/QtCore/qdebug.h:244:15: note:   template argument deduction/substitution failed:
/tmp/B.tU9xM8/BUILD/pulseview-0.4.2/pv/util.cpp:178:9: note:   mismatched types 'const QVector<T>' and 'QTextStream&(QTextStream&)'
  178 |   ts << forcesign;
      |         ^~~~~~~~~
/tmp/B.tU9xM8/BUILD/pulseview-0.4.2/pv/util.cpp:178:9: note:   mismatched types 'const QVector<T>' and 'QTextStream&(QTextStream&)'
/tmp/B.tU9xM8/BUILD/pulseview-0.4.2/pv/util.cpp:178:9: note:   couldn't deduce template parameter 'T'
In file included from /usr/include/qt5/QtCore/QDebug:1,
                 from /tmp/B.tU9xM8/BUILD/pulseview-0.4.2/pv/util.cpp:28:
/usr/include/qt5/QtCore/qdebug.h:250:15: note: candidate: 'template<class T, class Alloc> QDebug operator<<(QDebug, const std::vector<_Tp, _Alloc>&)'
  250 | inline QDebug operator<<(QDebug debug, const std::vector<T, Alloc> &vec)
      |               ^~~~~~~~
/usr/include/qt5/QtCore/qdebug.h:250:15: note:   template argument deduction/substitution failed:
/tmp/B.tU9xM8/BUILD/pulseview-0.4.2/pv/util.cpp:178:9: note:   mismatched types 'const std::vector<_Tp, _Alloc>' and 'QTextStream&(QTextStream&)'
  178 |   ts << forcesign;
      |         ^~~~~~~~~
/tmp/B.tU9xM8/BUILD/pulseview-0.4.2/pv/util.cpp:178:9: note:   mismatched types 'const std::vector<_Tp, _Alloc>' and 'QTextStream&(QTextStream&)'
/tmp/B.tU9xM8/BUILD/pulseview-0.4.2/pv/util.cpp:178:9: note:   couldn't deduce template parameter 'T'
In file included from /usr/include/qt5/QtCore/QDebug:1,
                 from /tmp/B.tU9xM8/BUILD/pulseview-0.4.2/pv/util.cpp:28:
/usr/include/qt5/QtCore/qdebug.h:256:15: note: candidate: 'template<class T, class Alloc> QDebug operator<<(QDebug, const std::__cxx11::list<_Tp, _Alloc>&)'
  256 | inline QDebug operator<<(QDebug debug, const std::list<T, Alloc> &vec)
      |               ^~~~~~~~
/usr/include/qt5/QtCore/qdebug.h:256:15: note:   template argument deduction/substitution failed:
/tmp/B.tU9xM8/BUILD/pulseview-0.4.2/pv/util.cpp:178:9: note:   mismatched types 'const std::__cxx11::list<_Tp, _Alloc>' and 'QTextStream&(QTextStream&)'
  178 |   ts << forcesign;
      |         ^~~~~~~~~
/tmp/B.tU9xM8/BUILD/pulseview-0.4.2/pv/util.cpp:178:9: note:   mismatched types 'const std::__cxx11::list<_Tp, _Alloc>' and 'QTextStream&(QTextStream&)'
/tmp/B.tU9xM8/BUILD/pulseview-0.4.2/pv/util.cpp:178:9: note:   couldn't deduce template parameter 'T'
In file included from /usr/include/qt5/QtCore/QDebug:1,
                 from /tmp/B.tU9xM8/BUILD/pulseview-0.4.2/pv/util.cpp:28:
/usr/include/qt5/QtCore/qdebug.h:262:15: note: candidate: 'template<class Key, class T, class Compare, class Alloc> QDebug operator<<(QDebug, const std::map<_Key, _Tp, _Compare, _Alloc>&)'
  262 | inline QDebug operator<<(QDebug debug, const std::map<Key, T, Compare, Alloc> &map)
      |               ^~~~~~~~
/usr/include/qt5/QtCore/qdebug.h:262:15: note:   template argument deduction/substitution failed:
/tmp/B.tU9xM8/BUILD/pulseview-0.4.2/pv/util.cpp:178:9: note:   mismatched types 'const std::map<_Key, _Tp, _Compare, _Alloc>' and 'QTextStream&(QTextStream&)'
  178 |   ts << forcesign;
      |         ^~~~~~~~~
/tmp/B.tU9xM8/BUILD/pulseview-0.4.2/pv/util.cpp:178:9: note:   mismatched types 'const std::map<_Key, _Tp, _Compare, _Alloc>' and 'QTextStream&(QTextStream&)'
/tmp/B.tU9xM8/BUILD/pulseview-0.4.2/pv/util.cpp:178:9: note:   couldn't deduce template parameter 'Key'
In file included from /usr/include/qt5/QtCore/QDebug:1,
                 from /tmp/B.tU9xM8/BUILD/pulseview-0.4.2/pv/util.cpp:28:
/usr/include/qt5/QtCore/qdebug.h:268:15: note: candidate: 'template<class Key, class T, class Compare, class Alloc> QDebug operator<<(QDebug, const std::multimap<_Key, _Tp, _Compare, _Alloc>&)'
  268 | inline QDebug operator<<(QDebug debug, const std::multimap<Key, T, Compare, Alloc> &map)
      |               ^~~~~~~~
/usr/include/qt5/QtCore/qdebug.h:268:15: note:   template argument deduction/substitution failed:
/tmp/B.tU9xM8/BUILD/pulseview-0.4.2/pv/util.cpp:178:9: note:   mismatched types 'const std::multimap<_Key, _Tp, _Compare, _Alloc>' and 'QTextStream&(QTextStream&)'
  178 |   ts << forcesign;
      |         ^~~~~~~~~
/tmp/B.tU9xM8/BUILD/pulseview-0.4.2/pv/util.cpp:178:9: note:   mismatched types 'const std::multimap<_Key, _Tp, _Compare, _Alloc>' and 'QTextStream&(QTextStream&)'
/tmp/B.tU9xM8/BUILD/pulseview-0.4.2/pv/util.cpp:178:9: note:   couldn't deduce template parameter 'Key'
In file included from /usr/include/qt5/QtCore/QDebug:1,
                 from /tmp/B.tU9xM8/BUILD/pulseview-0.4.2/pv/util.cpp:28:
/usr/include/qt5/QtCore/qdebug.h:274:15: note: candidate: 'template<class Key, class T> QDebug operator<<(QDebug, const QMap<K, V>&)'
  274 | inline QDebug operator<<(QDebug debug, const QMap<Key, T> &map)
      |               ^~~~~~~~
/usr/include/qt5/QtCore/qdebug.h:274:15: note:   template argument deduction/substitution failed:
/tmp/B.tU9xM8/BUILD/pulseview-0.4.2/pv/util.cpp:178:9: note:   mismatched types 'const QMap<K, V>' and 'QTextStream&(QTextStream&)'
  178 |   ts << forcesign;
      |         ^~~~~~~~~
/tmp/B.tU9xM8/BUILD/pulseview-0.4.2/pv/util.cpp:178:9: note:   mismatched types 'const QMap<K, V>' and 'QTextStream&(QTextStream&)'
/tmp/B.tU9xM8/BUILD/pulseview-0.4.2/pv/util.cpp:178:9: note:   couldn't deduce template parameter 'Key'
In file included from /usr/include/qt5/QtCore/QDebug:1,
                 from /tmp/B.tU9xM8/BUILD/pulseview-0.4.2/pv/util.cpp:28:
/usr/include/qt5/QtCore/qdebug.h:288:15: note: candidate: 'template<class Key, class T> QDebug operator<<(QDebug, const QHash<K, V>&)'
  288 | inline QDebug operator<<(QDebug debug, const QHash<Key, T> &hash)
      |               ^~~~~~~~
/usr/include/qt5/QtCore/qdebug.h:288:15: note:   template argument deduction/substitution failed:
/tmp/B.tU9xM8/BUILD/pulseview-0.4.2/pv/util.cpp:178:9: note:   mismatched types 'const QHash<K, V>' and 'QTextStream&(QTextStream&)'
  178 |   ts << forcesign;
      |         ^~~~~~~~~
/tmp/B.tU9xM8/BUILD/pulseview-0.4.2/pv/util.cpp:178:9: note:   mismatched types 'const QHash<K, V>' and 'QTextStream&(QTextStream&)'
/tmp/B.tU9xM8/BUILD/pulseview-0.4.2/pv/util.cpp:178:9: note:   couldn't deduce template parameter 'Key'
In file included from /usr/include/qt5/QtCore/QDebug:1,
                 from /tmp/B.tU9xM8/BUILD/pulseview-0.4.2/pv/util.cpp:28:
/usr/include/qt5/QtCore/qdebug.h:301:15: note: candidate: 'template<class T1, class T2> QDebug operator<<(QDebug, const QPair<T1, T2>&)'
  301 | inline QDebug operator<<(QDebug debug, const QPair<T1, T2> &pair)
      |               ^~~~~~~~
/usr/include/qt5/QtCore/qdebug.h:301:15: note:   template argument deduction/substitution failed:
/tmp/B.tU9xM8/BUILD/pulseview-0.4.2/pv/util.cpp:178:9: note:   mismatched types 'const QPair<T1, T2>' and 'QTextStream&(QTextStream&)'
  178 |   ts << forcesign;
      |         ^~~~~~~~~
/tmp/B.tU9xM8/BUILD/pulseview-0.4.2/pv/util.cpp:178:9: note:   mismatched types 'const QPair<T1, T2>' and 'QTextStream&(QTextStream&)'
/tmp/B.tU9xM8/BUILD/pulseview-0.4.2/pv/util.cpp:178:9: note:   couldn't deduce template parameter 'T1'
In file included from /usr/include/qt5/QtCore/QDebug:1,
                 from /tmp/B.tU9xM8/BUILD/pulseview-0.4.2/pv/util.cpp:28:
/usr/include/qt5/QtCore/qdebug.h:310:15: note: candidate: 'template<class T1, class T2> QDebug operator<<(QDebug, const std::pair<_T1, _T2>&)'
  310 | inline QDebug operator<<(QDebug debug, const std::pair<T1, T2> &pair)
      |               ^~~~~~~~
/usr/include/qt5/QtCore/qdebug.h:310:15: note:   template argument deduction/substitution failed:
/tmp/B.tU9xM8/BUILD/pulseview-0.4.2/pv/util.cpp:178:9: note:   mismatched types 'const std::pair<_T1, _T2>' and 'QTextStream&(QTextStream&)'
  178 |   ts << forcesign;
      |         ^~~~~~~~~
/tmp/B.tU9xM8/BUILD/pulseview-0.4.2/pv/util.cpp:178:9: note:   mismatched types 'const std::pair<_T1, _T2>' and 'QTextStream&(QTextStream&)'
/tmp/B.tU9xM8/BUILD/pulseview-0.4.2/pv/util.cpp:178:9: note:   couldn't deduce template parameter 'T1'
In file included from /usr/include/qt5/QtCore/QDebug:1,
                 from /tmp/B.tU9xM8/BUILD/pulseview-0.4.2/pv/util.cpp:28:
/usr/include/qt5/QtCore/qdebug.h:319:15: note: candidate: 'template<class T> QDebug operator<<(QDebug, const QSet<T>&)'
  319 | inline QDebug operator<<(QDebug debug, const QSet<T> &set)
      |               ^~~~~~~~
/usr/include/qt5/QtCore/qdebug.h:319:15: note:   template argument deduction/substitution failed:
/tmp/B.tU9xM8/BUILD/pulseview-0.4.2/pv/util.cpp:178:9: note:   mismatched types 'const QSet<T>' and 'QTextStream&(QTextStream&)'
  178 |   ts << forcesign;
      |         ^~~~~~~~~
/tmp/B.tU9xM8/BUILD/pulseview-0.4.2/pv/util.cpp:178:9: note:   mismatched types 'const QSet<T>' and 'QTextStream&(QTextStream&)'
/tmp/B.tU9xM8/BUILD/pulseview-0.4.2/pv/util.cpp:178:9: note:   couldn't deduce template parameter 'T'
In file included from /usr/include/qt5/QtCore/QDebug:1,
                 from /tmp/B.tU9xM8/BUILD/pulseview-0.4.2/pv/util.cpp:28:
/usr/include/qt5/QtCore/qdebug.h:325:15: note: candidate: 'template<class T> QDebug operator<<(QDebug, const QContiguousCache<T>&)'
  325 | inline QDebug operator<<(QDebug debug, const QContiguousCache<T> &cache)
      |               ^~~~~~~~
/usr/include/qt5/QtCore/qdebug.h:325:15: note:   template argument deduction/substitution failed:
/tmp/B.tU9xM8/BUILD/pulseview-0.4.2/pv/util.cpp:178:9: note:   mismatched types 'const QContiguousCache<T>' and 'QTextStream&(QTextStream&)'
  178 |   ts << forcesign;
      |         ^~~~~~~~~
/tmp/B.tU9xM8/BUILD/pulseview-0.4.2/pv/util.cpp:178:9: note:   mismatched types 'const QContiguousCache<T>' and 'QTextStream&(QTextStream&)'
/tmp/B.tU9xM8/BUILD/pulseview-0.4.2/pv/util.cpp:178:9: note:   couldn't deduce template parameter 'T'
In file included from /usr/include/qt5/QtCore/QDebug:1,
                 from /tmp/B.tU9xM8/BUILD/pulseview-0.4.2/pv/util.cpp:28:
/usr/include/qt5/QtCore/qdebug.h:340:15: note: candidate: 'template<class T> QDebug operator<<(QDebug, const QSharedPointer<T>&)'
  340 | inline QDebug operator<<(QDebug debug, const QSharedPointer<T> &ptr)
      |               ^~~~~~~~
/usr/include/qt5/QtCore/qdebug.h:340:15: note:   template argument deduction/substitution failed:
/tmp/B.tU9xM8/BUILD/pulseview-0.4.2/pv/util.cpp:178:9: note:   mismatched types 'const QSharedPointer<T>' and 'QTextStream&(QTextStream&)'
  178 |   ts << forcesign;
      |         ^~~~~~~~~
/tmp/B.tU9xM8/BUILD/pulseview-0.4.2/pv/util.cpp:178:9: note:   mismatched types 'const QSharedPointer<T>' and 'QTextStream&(QTextStream&)'
/tmp/B.tU9xM8/BUILD/pulseview-0.4.2/pv/util.cpp:178:9: note:   couldn't deduce template parameter 'T'
In file included from /usr/include/qt5/QtCore/QDebug:1,
                 from /tmp/B.tU9xM8/BUILD/pulseview-0.4.2/pv/util.cpp:28:
/usr/include/qt5/QtCore/qdebug.h:374:1: note: candidate: 'template<class T> typename std::enable_if<QtPrivate::IsQEnumHelper<T>::Value, QDebug>::type operator<<(QDebug, T)'
  374 | operator<<(QDebug dbg, T value)
      | ^~~~~~~~
/usr/include/qt5/QtCore/qdebug.h:374:1: note:   template argument deduction/substitution failed:
/tmp/B.tU9xM8/BUILD/pulseview-0.4.2/pv/util.cpp:178:9: note:   couldn't deduce template parameter 'T'
  178 |   ts << forcesign;
      |         ^~~~~~~~~
In file included from /usr/include/qt5/QtCore/QDebug:1,
                 from /tmp/B.tU9xM8/BUILD/pulseview-0.4.2/pv/util.cpp:28:
/usr/include/qt5/QtCore/qdebug.h:386:15: note: candidate: 'template<class T, class A, class B, class C, class D> QDebug operator<<(QDebug, T)'
  386 | inline QDebug operator<<(QDebug dbg, T value)
      |               ^~~~~~~~
/usr/include/qt5/QtCore/qdebug.h:386:15: note:   template argument deduction/substitution failed:
/tmp/B.tU9xM8/BUILD/pulseview-0.4.2/pv/util.cpp:178:9: note:   couldn't deduce template parameter 'T'
  178 |   ts << forcesign;
      |         ^~~~~~~~~
In file included from /usr/include/qt5/QtCore/QDebug:1,
                 from /tmp/B.tU9xM8/BUILD/pulseview-0.4.2/pv/util.cpp:28:
/usr/include/qt5/QtCore/qdebug.h:420:15: note: candidate: 'template<class T> QDebug operator<<(QDebug, const QFlags<T>&)'
  420 | inline QDebug operator<<(QDebug debug, const QFlags<T> &flags)
      |               ^~~~~~~~
/usr/include/qt5/QtCore/qdebug.h:420:15: note:   template argument deduction/substitution failed:
/tmp/B.tU9xM8/BUILD/pulseview-0.4.2/pv/util.cpp:178:9: note:   mismatched types 'const QFlags<T>' and 'QTextStream&(QTextStream&)'
  178 |   ts << forcesign;
      |         ^~~~~~~~~
/tmp/B.tU9xM8/BUILD/pulseview-0.4.2/pv/util.cpp:178:9: note:   mismatched types 'const QFlags<T>' and 'QTextStream&(QTextStream&)'
/tmp/B.tU9xM8/BUILD/pulseview-0.4.2/pv/util.cpp:178:9: note:   couldn't deduce template parameter 'T'
make[2]: *** [CMakeFiles/pulseview.dir/build.make:417: CMakeFiles/pulseview.dir/pv/util.cpp.o] Error 1
make[2]: Leaving directory '/tmp/B.tU9xM8/BUILD/pulseview-0.4.2/build'
make[2]: *** Waiting for unfinished jobs....
make[2]: Entering directory '/tmp/B.tU9xM8/BUILD/pulseview-0.4.2/build'
[ 11%] Building CXX object CMakeFiles/pulseview.dir/pv/mainwindow.cpp.o
/usr/bin/i686-pld-linux-g++  -DBOOST_MATH_DISABLE_FLOAT128=1 -DENABLE_DECODE -DENABLE_SIGNALS -DQT_CORE_LIB -DQT_GUI_LIB -DQT_NO_DEBUG -DQT_NO_KEYWORDS -DQT_SVG_LIB -DQT_WIDGETS_LIB -D__STDC_LIMIT_MACROS -I/tmp/B.tU9xM8/BUILD/pulseview-0.4.2/build/pulseview_autogen/include -I/tmp/B.tU9xM8/BUILD/pulseview-0.4.2/build -I/tmp/B.tU9xM8/BUILD/pulseview-0.4.2 -I/usr/include/libftdi1 -I/usr/include/hidapi -I/usr/include/libusb-1.0 -I/usr/include/libmount -I/usr/include/blkid -I/usr/include/glibmm-2.4 -I/usr/lib/glibmm-2.4/include -I/usr/include/sigc++-2.0 -I/usr/lib/sigc++-2.0/include -I/usr/include/python3.8 -I/usr/include/glib-2.0 -I/usr/lib/glib-2.0/include -isystem /usr/include/qt5 -isystem /usr/include/qt5/QtGui -isystem /usr/include/qt5/QtCore -isystem /usr/lib/qt5/./mkspecs/linux-g++ -isystem /usr/include/qt5/QtWidgets -isystem /usr/include/qt5/QtSvg  -O2 -fwrapv -pipe -Wformat -Werror=format-security -gdwarf-4 -fno-debug-types-section -fvar-tracking-assignments -g2 -Wp,-D_FORTIFY_SOURCE=2 -fstack-protector-strong --param=ssp-buffer-size=4 -Werror=trampolines -fomit-frame-pointer -march=i686 -fasynchronous-unwind-tables -mtune=pentium4 -gdwarf-4 -fno-debug-types-section -fvar-tracking-assignments -g2  -DNDEBUG -DQT_NO_DEBUG   -Wall -Wextra -std=c++11 -fPIC -o CMakeFiles/pulseview.dir/pv/mainwindow.cpp.o -c /tmp/B.tU9xM8/BUILD/pulseview-0.4.2/pv/mainwindow.cpp
make[2]: Leaving directory '/tmp/B.tU9xM8/BUILD/pulseview-0.4.2/build'
make[2]: Entering directory '/tmp/B.tU9xM8/BUILD/pulseview-0.4.2/build'
[ 18%] Building CXX object CMakeFiles/pulseview.dir/pv/data/analog.cpp.o
/usr/bin/i686-pld-linux-g++  -DBOOST_MATH_DISABLE_FLOAT128=1 -DENABLE_DECODE -DENABLE_SIGNALS -DQT_CORE_LIB -DQT_GUI_LIB -DQT_NO_DEBUG -DQT_NO_KEYWORDS -DQT_SVG_LIB -DQT_WIDGETS_LIB -D__STDC_LIMIT_MACROS -I/tmp/B.tU9xM8/BUILD/pulseview-0.4.2/build/pulseview_autogen/include -I/tmp/B.tU9xM8/BUILD/pulseview-0.4.2/build -I/tmp/B.tU9xM8/BUILD/pulseview-0.4.2 -I/usr/include/libftdi1 -I/usr/include/hidapi -I/usr/include/libusb-1.0 -I/usr/include/libmount -I/usr/include/blkid -I/usr/include/glibmm-2.4 -I/usr/lib/glibmm-2.4/include -I/usr/include/sigc++-2.0 -I/usr/lib/sigc++-2.0/include -I/usr/include/python3.8 -I/usr/include/glib-2.0 -I/usr/lib/glib-2.0/include -isystem /usr/include/qt5 -isystem /usr/include/qt5/QtGui -isystem /usr/include/qt5/QtCore -isystem /usr/lib/qt5/./mkspecs/linux-g++ -isystem /usr/include/qt5/QtWidgets -isystem /usr/include/qt5/QtSvg  -O2 -fwrapv -pipe -Wformat -Werror=format-security -gdwarf-4 -fno-debug-types-section -fvar-tracking-assignments -g2 -Wp,-D_FORTIFY_SOURCE=2 -fstack-protector-strong --param=ssp-buffer-size=4 -Werror=trampolines -fomit-frame-pointer -march=i686 -fasynchronous-unwind-tables -mtune=pentium4 -gdwarf-4 -fno-debug-types-section -fvar-tracking-assignments -g2  -DNDEBUG -DQT_NO_DEBUG   -Wall -Wextra -std=c++11 -fPIC -o CMakeFiles/pulseview.dir/pv/data/analog.cpp.o -c /tmp/B.tU9xM8/BUILD/pulseview-0.4.2/pv/data/analog.cpp
make[2]: Leaving directory '/tmp/B.tU9xM8/BUILD/pulseview-0.4.2/build'
make[2]: Entering directory '/tmp/B.tU9xM8/BUILD/pulseview-0.4.2/build'
[ 16%] Building CXX object CMakeFiles/pulseview.dir/pv/binding/inputoutput.cpp.o
/usr/bin/i686-pld-linux-g++  -DBOOST_MATH_DISABLE_FLOAT128=1 -DENABLE_DECODE -DENABLE_SIGNALS -DQT_CORE_LIB -DQT_GUI_LIB -DQT_NO_DEBUG -DQT_NO_KEYWORDS -DQT_SVG_LIB -DQT_WIDGETS_LIB -D__STDC_LIMIT_MACROS -I/tmp/B.tU9xM8/BUILD/pulseview-0.4.2/build/pulseview_autogen/include -I/tmp/B.tU9xM8/BUILD/pulseview-0.4.2/build -I/tmp/B.tU9xM8/BUILD/pulseview-0.4.2 -I/usr/include/libftdi1 -I/usr/include/hidapi -I/usr/include/libusb-1.0 -I/usr/include/libmount -I/usr/include/blkid -I/usr/include/glibmm-2.4 -I/usr/lib/glibmm-2.4/include -I/usr/include/sigc++-2.0 -I/usr/lib/sigc++-2.0/include -I/usr/include/python3.8 -I/usr/include/glib-2.0 -I/usr/lib/glib-2.0/include -isystem /usr/include/qt5 -isystem /usr/include/qt5/QtGui -isystem /usr/include/qt5/QtCore -isystem /usr/lib/qt5/./mkspecs/linux-g++ -isystem /usr/include/qt5/QtWidgets -isystem /usr/include/qt5/QtSvg  -O2 -fwrapv -pipe -Wformat -Werror=format-security -gdwarf-4 -fno-debug-types-section -fvar-tracking-assignments -g2 -Wp,-D_FORTIFY_SOURCE=2 -fstack-protector-strong --param=ssp-buffer-size=4 -Werror=trampolines -fomit-frame-pointer -march=i686 -fasynchronous-unwind-tables -mtune=pentium4 -gdwarf-4 -fno-debug-types-section -fvar-tracking-assignments -g2  -DNDEBUG -DQT_NO_DEBUG   -Wall -Wextra -std=c++11 -fPIC -o CMakeFiles/pulseview.dir/pv/binding/inputoutput.cpp.o -c /tmp/B.tU9xM8/BUILD/pulseview-0.4.2/pv/binding/inputoutput.cpp
make[2]: Leaving directory '/tmp/B.tU9xM8/BUILD/pulseview-0.4.2/build'
make[2]: Entering directory '/tmp/B.tU9xM8/BUILD/pulseview-0.4.2/build'
[ 17%] Building CXX object CMakeFiles/pulseview.dir/pv/binding/device.cpp.o
/usr/bin/i686-pld-linux-g++  -DBOOST_MATH_DISABLE_FLOAT128=1 -DENABLE_DECODE -DENABLE_SIGNALS -DQT_CORE_LIB -DQT_GUI_LIB -DQT_NO_DEBUG -DQT_NO_KEYWORDS -DQT_SVG_LIB -DQT_WIDGETS_LIB -D__STDC_LIMIT_MACROS -I/tmp/B.tU9xM8/BUILD/pulseview-0.4.2/build/pulseview_autogen/include -I/tmp/B.tU9xM8/BUILD/pulseview-0.4.2/build -I/tmp/B.tU9xM8/BUILD/pulseview-0.4.2 -I/usr/include/libftdi1 -I/usr/include/hidapi -I/usr/include/libusb-1.0 -I/usr/include/libmount -I/usr/include/blkid -I/usr/include/glibmm-2.4 -I/usr/lib/glibmm-2.4/include -I/usr/include/sigc++-2.0 -I/usr/lib/sigc++-2.0/include -I/usr/include/python3.8 -I/usr/include/glib-2.0 -I/usr/lib/glib-2.0/include -isystem /usr/include/qt5 -isystem /usr/include/qt5/QtGui -isystem /usr/include/qt5/QtCore -isystem /usr/lib/qt5/./mkspecs/linux-g++ -isystem /usr/include/qt5/QtWidgets -isystem /usr/include/qt5/QtSvg  -O2 -fwrapv -pipe -Wformat -Werror=format-security -gdwarf-4 -fno-debug-types-section -fvar-tracking-assignments -g2 -Wp,-D_FORTIFY_SOURCE=2 -fstack-protector-strong --param=ssp-buffer-size=4 -Werror=trampolines -fomit-frame-pointer -march=i686 -fasynchronous-unwind-tables -mtune=pentium4 -gdwarf-4 -fno-debug-types-section -fvar-tracking-assignments -g2  -DNDEBUG -DQT_NO_DEBUG   -Wall -Wextra -std=c++11 -fPIC -o CMakeFiles/pulseview.dir/pv/binding/device.cpp.o -c /tmp/B.tU9xM8/BUILD/pulseview-0.4.2/pv/binding/device.cpp
make[2]: Leaving directory '/tmp/B.tU9xM8/BUILD/pulseview-0.4.2/build'
make[2]: Entering directory '/tmp/B.tU9xM8/BUILD/pulseview-0.4.2/build'
[ 19%] Building CXX object CMakeFiles/pulseview.dir/pv/data/analogsegment.cpp.o
/usr/bin/i686-pld-linux-g++  -DBOOST_MATH_DISABLE_FLOAT128=1 -DENABLE_DECODE -DENABLE_SIGNALS -DQT_CORE_LIB -DQT_GUI_LIB -DQT_NO_DEBUG -DQT_NO_KEYWORDS -DQT_SVG_LIB -DQT_WIDGETS_LIB -D__STDC_LIMIT_MACROS -I/tmp/B.tU9xM8/BUILD/pulseview-0.4.2/build/pulseview_autogen/include -I/tmp/B.tU9xM8/BUILD/pulseview-0.4.2/build -I/tmp/B.tU9xM8/BUILD/pulseview-0.4.2 -I/usr/include/libftdi1 -I/usr/include/hidapi -I/usr/include/libusb-1.0 -I/usr/include/libmount -I/usr/include/blkid -I/usr/include/glibmm-2.4 -I/usr/lib/glibmm-2.4/include -I/usr/include/sigc++-2.0 -I/usr/lib/sigc++-2.0/include -I/usr/include/python3.8 -I/usr/include/glib-2.0 -I/usr/lib/glib-2.0/include -isystem /usr/include/qt5 -isystem /usr/include/qt5/QtGui -isystem /usr/include/qt5/QtCore -isystem /usr/lib/qt5/./mkspecs/linux-g++ -isystem /usr/include/qt5/QtWidgets -isystem /usr/include/qt5/QtSvg  -O2 -fwrapv -pipe -Wformat -Werror=format-security -gdwarf-4 -fno-debug-types-section -fvar-tracking-assignments -g2 -Wp,-D_FORTIFY_SOURCE=2 -fstack-protector-strong --param=ssp-buffer-size=4 -Werror=trampolines -fomit-frame-pointer -march=i686 -fasynchronous-unwind-tables -mtune=pentium4 -gdwarf-4 -fno-debug-types-section -fvar-tracking-assignments -g2  -DNDEBUG -DQT_NO_DEBUG   -Wall -Wextra -std=c++11 -fPIC -o CMakeFiles/pulseview.dir/pv/data/analogsegment.cpp.o -c /tmp/B.tU9xM8/BUILD/pulseview-0.4.2/pv/data/analogsegment.cpp
make[2]: Leaving directory '/tmp/B.tU9xM8/BUILD/pulseview-0.4.2/build'
make[2]: Entering directory '/tmp/B.tU9xM8/BUILD/pulseview-0.4.2/build'
[ 20%] Building CXX object CMakeFiles/pulseview.dir/pv/data/logic.cpp.o
/usr/bin/i686-pld-linux-g++  -DBOOST_MATH_DISABLE_FLOAT128=1 -DENABLE_DECODE -DENABLE_SIGNALS -DQT_CORE_LIB -DQT_GUI_LIB -DQT_NO_DEBUG -DQT_NO_KEYWORDS -DQT_SVG_LIB -DQT_WIDGETS_LIB -D__STDC_LIMIT_MACROS -I/tmp/B.tU9xM8/BUILD/pulseview-0.4.2/build/pulseview_autogen/include -I/tmp/B.tU9xM8/BUILD/pulseview-0.4.2/build -I/tmp/B.tU9xM8/BUILD/pulseview-0.4.2 -I/usr/include/libftdi1 -I/usr/include/hidapi -I/usr/include/libusb-1.0 -I/usr/include/libmount -I/usr/include/blkid -I/usr/include/glibmm-2.4 -I/usr/lib/glibmm-2.4/include -I/usr/include/sigc++-2.0 -I/usr/lib/sigc++-2.0/include -I/usr/include/python3.8 -I/usr/include/glib-2.0 -I/usr/lib/glib-2.0/include -isystem /usr/include/qt5 -isystem /usr/include/qt5/QtGui -isystem /usr/include/qt5/QtCore -isystem /usr/lib/qt5/./mkspecs/linux-g++ -isystem /usr/include/qt5/QtWidgets -isystem /usr/include/qt5/QtSvg  -O2 -fwrapv -pipe -Wformat -Werror=format-security -gdwarf-4 -fno-debug-types-section -fvar-tracking-assignments -g2 -Wp,-D_FORTIFY_SOURCE=2 -fstack-protector-strong --param=ssp-buffer-size=4 -Werror=trampolines -fomit-frame-pointer -march=i686 -fasynchronous-unwind-tables -mtune=pentium4 -gdwarf-4 -fno-debug-types-section -fvar-tracking-assignments -g2  -DNDEBUG -DQT_NO_DEBUG   -Wall -Wextra -std=c++11 -fPIC -o CMakeFiles/pulseview.dir/pv/data/logic.cpp.o -c /tmp/B.tU9xM8/BUILD/pulseview-0.4.2/pv/data/logic.cpp
make[2]: Leaving directory '/tmp/B.tU9xM8/BUILD/pulseview-0.4.2/build'
make[2]: Entering directory '/tmp/B.tU9xM8/BUILD/pulseview-0.4.2/build'
[  5%] Building CXX object CMakeFiles/pulseview.dir/pulseview_autogen/mocs_compilation.cpp.o
/usr/bin/i686-pld-linux-g++  -DBOOST_MATH_DISABLE_FLOAT128=1 -DENABLE_DECODE -DENABLE_SIGNALS -DQT_CORE_LIB -DQT_GUI_LIB -DQT_NO_DEBUG -DQT_NO_KEYWORDS -DQT_SVG_LIB -DQT_WIDGETS_LIB -D__STDC_LIMIT_MACROS -I/tmp/B.tU9xM8/BUILD/pulseview-0.4.2/build/pulseview_autogen/include -I/tmp/B.tU9xM8/BUILD/pulseview-0.4.2/build -I/tmp/B.tU9xM8/BUILD/pulseview-0.4.2 -I/usr/include/libftdi1 -I/usr/include/hidapi -I/usr/include/libusb-1.0 -I/usr/include/libmount -I/usr/include/blkid -I/usr/include/glibmm-2.4 -I/usr/lib/glibmm-2.4/include -I/usr/include/sigc++-2.0 -I/usr/lib/sigc++-2.0/include -I/usr/include/python3.8 -I/usr/include/glib-2.0 -I/usr/lib/glib-2.0/include -isystem /usr/include/qt5 -isystem /usr/include/qt5/QtGui -isystem /usr/include/qt5/QtCore -isystem /usr/lib/qt5/./mkspecs/linux-g++ -isystem /usr/include/qt5/QtWidgets -isystem /usr/include/qt5/QtSvg  -O2 -fwrapv -pipe -Wformat -Werror=format-security -gdwarf-4 -fno-debug-types-section -fvar-tracking-assignments -g2 -Wp,-D_FORTIFY_SOURCE=2 -fstack-protector-strong --param=ssp-buffer-size=4 -Werror=trampolines -fomit-frame-pointer -march=i686 -fasynchronous-unwind-tables -mtune=pentium4 -gdwarf-4 -fno-debug-types-section -fvar-tracking-assignments -g2  -DNDEBUG -DQT_NO_DEBUG   -Wall -Wextra -std=c++11 -fPIC -o CMakeFiles/pulseview.dir/pulseview_autogen/mocs_compilation.cpp.o -c /tmp/B.tU9xM8/BUILD/pulseview-0.4.2/build/pulseview_autogen/mocs_compilation.cpp
make[2]: Leaving directory '/tmp/B.tU9xM8/BUILD/pulseview-0.4.2/build'
make[2]: Entering directory '/tmp/B.tU9xM8/BUILD/pulseview-0.4.2/build'
[ 12%] Building CXX object CMakeFiles/pulseview.dir/pv/session.cpp.o
/usr/bin/i686-pld-linux-g++  -DBOOST_MATH_DISABLE_FLOAT128=1 -DENABLE_DECODE -DENABLE_SIGNALS -DQT_CORE_LIB -DQT_GUI_LIB -DQT_NO_DEBUG -DQT_NO_KEYWORDS -DQT_SVG_LIB -DQT_WIDGETS_LIB -D__STDC_LIMIT_MACROS -I/tmp/B.tU9xM8/BUILD/pulseview-0.4.2/build/pulseview_autogen/include -I/tmp/B.tU9xM8/BUILD/pulseview-0.4.2/build -I/tmp/B.tU9xM8/BUILD/pulseview-0.4.2 -I/usr/include/libftdi1 -I/usr/include/hidapi -I/usr/include/libusb-1.0 -I/usr/include/libmount -I/usr/include/blkid -I/usr/include/glibmm-2.4 -I/usr/lib/glibmm-2.4/include -I/usr/include/sigc++-2.0 -I/usr/lib/sigc++-2.0/include -I/usr/include/python3.8 -I/usr/include/glib-2.0 -I/usr/lib/glib-2.0/include -isystem /usr/include/qt5 -isystem /usr/include/qt5/QtGui -isystem /usr/include/qt5/QtCore -isystem /usr/lib/qt5/./mkspecs/linux-g++ -isystem /usr/include/qt5/QtWidgets -isystem /usr/include/qt5/QtSvg  -O2 -fwrapv -pipe -Wformat -Werror=format-security -gdwarf-4 -fno-debug-types-section -fvar-tracking-assignments -g2 -Wp,-D_FORTIFY_SOURCE=2 -fstack-protector-strong --param=ssp-buffer-size=4 -Werror=trampolines -fomit-frame-pointer -march=i686 -fasynchronous-unwind-tables -mtune=pentium4 -gdwarf-4 -fno-debug-types-section -fvar-tracking-assignments -g2  -DNDEBUG -DQT_NO_DEBUG   -Wall -Wextra -std=c++11 -fPIC -o CMakeFiles/pulseview.dir/pv/session.cpp.o -c /tmp/B.tU9xM8/BUILD/pulseview-0.4.2/pv/session.cpp
make[2]: Leaving directory '/tmp/B.tU9xM8/BUILD/pulseview-0.4.2/build'
make[1]: *** [CMakeFiles/Makefile2:122: CMakeFiles/pulseview.dir/all] Error 2
make: *** [Makefile:175: all] Error 2
error: Bad exit status from /tmp/B.tU9xM8/BUILD/tmp/rpm-tmp.12808 (%build)


RPM build errors:
    Bad exit status from /tmp/B.tU9xM8/BUILD/tmp/rpm-tmp.12808 (%build)
ended at: Fri Jul 31 06:31:06 2020, done in 0:00:25.612594
error: No files produced.
+ chmod -R u+rwX /tmp/B.tU9xM8/BUILD
+ rm -rf /tmp/B.tU9xM8/tmp /tmp/B.tU9xM8/BUILD
+ rm -rf /tmp/B.tU9xM8
Begin-PLD-Builder-Info
Build-Time: user:147.08s sys:14.12s real:30.24s (faults io:1 non-io:2214168)

End-PLD-Builder-Info
[Back to list of logs] [View rpm -qa of builder]